{"text_format":"1","workbook":"xlsx","n_sheets":21,"sheets":["Zeiterfassung","Tabelle1","Tabelle2","Tabelle3","Tabelle4","Tabelle5","Tabelle6","Tabelle7","Tabelle8","Tabelle9","Tabelle10","Tabelle11","Tabelle12","Tabelle13","Tabelle14","Tabelle15","Tabelle16","Tabelle17","Tabelle18","Tabelle19","Tabelle20"],"not_rendered":{"charts":0,"images":0,"macros":1,"external_links":0,"defined_names":21,"comments":20,"pivot_tables":0},"unopened":[],"bounds":{"document_bytes":16777216,"sheet_cells":100000,"rows_first":2000,"rows_last":500,"rows_between":2000,"halvings":0,"cell_chars":16384,"cell_head_chars":4096},"cells_cut":0,"cells_raw":0,"read":"whole","date_system":"1900"}

{"sheet":"Zeiterfassung","index":0,"n_rows":47,"n_cols":10,"rows_kept":47,"cut":false,"hidden":false,"merged":[[0,0,0,5],[1,2,1,3]]}
["Zeiterfassung"]
[null,null,{"$f":"NOW()","v":"2020-10-23T20:04:34.330"}]
["Start/Ende","Aktion","Bemerkung","gestartet ja/nein","letzte Zeiterfassung","Gesamt:","Tabellen-Bemerkung"]
[1,{"$f":"Tabelle1!$A$1","v":"Aktion 1"},{"$f":"Tabelle1!$A$2","v":"01"},{"$f":"Tabelle1!$A$3","v":"nein"},{"$f":"Tabelle1!$C$3","v":0},{"$f":"Tabelle1!$F$5","v":0}]
[2,{"$f":"Tabelle2!$A$1","v":"Aktion 2"},{"$f":"Tabelle2!$A$2","v":"02"},{"$f":"Tabelle2!$A$3","v":"nein"},{"$f":"Tabelle2!$C$3","v":0},{"$f":"Tabelle2!$F$5","v":0}]
[3,{"$f":"Tabelle3!$A$1","v":"Aktion 3"},{"$f":"Tabelle3!$A$2","v":"03"},{"$f":"Tabelle3!$A$3","v":"nein"},{"$f":"Tabelle3!$C$3","v":0},{"$f":"Tabelle3!$F$5","v":0}]
[4,{"$f":"Tabelle4!$A$1","v":"Aktion 4"},{"$f":"Tabelle4!$A$2","v":"04"},{"$f":"Tabelle4!$A$3","v":"nein"},{"$f":"Tabelle4!$C$3","v":0},{"$f":"Tabelle4!$F$5","v":0}]
[5,{"$f":"Tabelle5!$A$1","v":"Aktion 5"},{"$f":"Tabelle5!$A$2","v":"05"},{"$f":"Tabelle5!$A$3","v":"nein"},{"$f":"Tabelle5!$C$3","v":0},{"$f":"Tabelle5!$F$5","v":0}]
[6,{"$f":"Tabelle6!$A$1","v":"Aktion 6"},{"$f":"Tabelle6!$A$2","v":"06"},{"$f":"Tabelle6!$A$3","v":"nein"},{"$f":"Tabelle6!$C$3","v":0},{"$f":"Tabelle6!$F$5","v":0}]
[7,{"$f":"Tabelle7!$A$1","v":"Aktion 7"},{"$f":"Tabelle7!$A$2","v":"07"},{"$f":"Tabelle7!$A$3","v":"nein"},{"$f":"Tabelle7!$C$3","v":0},{"$f":"Tabelle7!$F$5","v":0}]
[8,{"$f":"Tabelle8!$A$1","v":"Aktion 8"},{"$f":"Tabelle8!$A$2","v":"08"},{"$f":"Tabelle8!$A$3","v":"nein"},{"$f":"Tabelle8!$C$3","v":0},{"$f":"Tabelle8!$F$5","v":0}]
[9,{"$f":"Tabelle9!$A$1","v":"Aktion 9"},{"$f":"Tabelle9!$A$2","v":"09"},{"$f":"Tabelle9!$A$3","v":"nein"},{"$f":"Tabelle9!$C$3","v":0},{"$f":"Tabelle9!$F$5","v":0}]
[10,{"$f":"Tabelle10!$A$1","v":"Aktion 10"},{"$f":"Tabelle10!$A$2","v":"10"},{"$f":"Tabelle10!$A$3","v":"nein"},{"$f":"Tabelle10!$C$3","v":0},{"$f":"Tabelle10!$F$5","v":0}]
[11,{"$f":"Tabelle11!$A$1","v":"Aktion 11"},{"$f":"Tabelle11!$A$2","v":"11"},{"$f":"Tabelle11!$A$3","v":"nein"},{"$f":"Tabelle11!$C$3","v":0},{"$f":"Tabelle11!$F$5","v":0}]
[12,{"$f":"Tabelle12!$A$1","v":"Aktion 12"},{"$f":"Tabelle12!$A$2","v":"12"},{"$f":"Tabelle12!$A$3","v":"nein"},{"$f":"Tabelle12!$C$3","v":0},{"$f":"Tabelle12!$F$5","v":0}]
[13,{"$f":"Tabelle13!$A$1","v":"Aktion 13"},{"$f":"Tabelle13!$A$2","v":"13"},{"$f":"Tabelle13!$A$3","v":"nein"},{"$f":"Tabelle13!$C$3","v":0},{"$f":"Tabelle13!$F$5","v":0}]
[14,{"$f":"Tabelle14!$A$1","v":"Aktion 14"},{"$f":"Tabelle14!$A$2","v":"14"},{"$f":"Tabelle14!$A$3","v":"nein"},{"$f":"Tabelle14!$C$3","v":0},{"$f":"Tabelle14!$F$5","v":0}]
[15,{"$f":"Tabelle15!$A$1","v":"Aktion 15"},{"$f":"Tabelle15!$A$2","v":"15"},{"$f":"Tabelle15!$A$3","v":"nein"},{"$f":"Tabelle15!$C$3","v":0},{"$f":"Tabelle15!$F$5","v":0}]
[16,{"$f":"Tabelle16!$A$1","v":"Aktion 16"},{"$f":"Tabelle16!$A$2","v":"16"},{"$f":"Tabelle16!$A$3","v":"nein"},{"$f":"Tabelle16!$C$3","v":0},{"$f":"Tabelle16!$F$5","v":0}]
[17,{"$f":"Tabelle17!$A$1","v":"Aktion 17"},{"$f":"Tabelle17!$A$2","v":"17"},{"$f":"Tabelle17!$A$3","v":"nein"},{"$f":"Tabelle17!$C$3","v":0},{"$f":"Tabelle17!$F$5","v":0}]
[18,{"$f":"Tabelle18!$A$1","v":"Aktion 18"},{"$f":"Tabelle18!$A$2","v":"18"},{"$f":"Tabelle18!$A$3","v":"nein"},{"$f":"Tabelle18!$C$3","v":0},{"$f":"Tabelle18!$F$5","v":0}]
[19,{"$f":"Tabelle19!$A$1","v":"Aktion 19"},{"$f":"Tabelle19!$A$2","v":"19"},{"$f":"Tabelle19!$A$3","v":"nein"},{"$f":"Tabelle19!$C$3","v":0},{"$f":"Tabelle19!$F$5","v":0}]
[20,{"$f":"Tabelle20!$A$1","v":"Aktion 20"},{"$f":"Tabelle20!$A$2","v":"20"},{"$f":"Tabelle20!$A$3","v":"nein"},{"$f":"Tabelle20!$C$3","v":0},{"$f":"Tabelle20!$F$5","v":0}]
[]
["Tabelle 1","Tabelle 2","Tabelle 3","Tabelle 4","Tabelle 5","Tabelle 6","Tabelle 7","Tabelle 8","Tabelle 9","Tabelle 10"]
["Bemerkung01","Bemerkung11","Bemerkung21","Bemerkung31","Bemerkung41","Bemerkung51","Bemerkung61","Bemerkung71","Bemerkung81","Bemerkung91"]
["Bemerkung02","Bemerkung12","Bemerkung22","Bemerkung32","Bemerkung42","Bemerkung52","Bemerkung62","Bemerkung72","Bemerkung82","Bemerkung92"]
["Bemerkung03","Bemerkung13","Bemerkung23","Bemerkung33","Bemerkung43","Bemerkung53","Bemerkung63","Bemerkung73","Bemerkung83","Bemerkung93"]
["Bemerkung04","Bemerkung14","Bemerkung24","Bemerkung34","Bemerkung44","Bemerkung54","Bemerkung64","Bemerkung74","Bemerkung84","Bemerkung94"]
["Bemerkung05","Bemerkung15","Bemerkung25","Bemerkung35","Bemerkung45","Bemerkung55","Bemerkung65","Bemerkung75","Bemerkung85","Bemerkung95"]
["Bemerkung06","Bemerkung16","Bemerkung26","Bemerkung36","Bemerkung46","Bemerkung56","Bemerkung66","Bemerkung76","Bemerkung86","Bemerkung96"]
["Bemerkung07","Bemerkung17","Bemerkung27","Bemerkung37","Bemerkung47","Bemerkung57","Bemerkung67","Bemerkung77","Bemerkung87","Bemerkung97"]
["Bemerkung08","Bemerkung18","Bemerkung28","Bemerkung38","Bemerkung48","Bemerkung58","Bemerkung68","Bemerkung78","Bemerkung88","Bemerkung98"]
["Bemerkung09","Bemerkung19","Bemerkung29","Bemerkung39","Bemerkung49","Bemerkung59","Bemerkung69","Bemerkung79","Bemerkung89","Bemerkung99"]
["Bemerkung10","Bemerkung20","Bemerkung30","Bemerkung40","Bemerkung50","Bemerkung60","Bemerkung70","Bemerkung80","Bemerkung90","Bemerkung100"]
[]
["Tabelle 11","Tabelle 12","Tabelle 13","Tabelle 14","Tabelle 15","Tabelle 16","Tabelle 17","Tabelle 18","Tabelle 19","Tabelle 20"]
["Bemerkung120","Bemerkung130","Bemerkung140","Bemerkung150","Bemerkung160","Bemerkung170","Bemerkung180","Bemerkung190","Bemerkung200","Bemerkung210"]
["Bemerkung119","Bemerkung129","Bemerkung139","Bemerkung149","Bemerkung159","Bemerkung169","Bemerkung179","Bemerkung189","Bemerkung199","Bemerkung209"]
["Bemerkung118","Bemerkung128","Bemerkung138","Bemerkung148","Bemerkung158","Bemerkung168","Bemerkung178","Bemerkung188","Bemerkung198","Bemerkung208"]
["Bemerkung117","Bemerkung127","Bemerkung137","Bemerkung147","Bemerkung157","Bemerkung167","Bemerkung177","Bemerkung187","Bemerkung197","Bemerkung207"]
["Bemerkung116","Bemerkung126","Bemerkung136","Bemerkung146","Bemerkung156","Bemerkung166","Bemerkung176","Bemerkung186","Bemerkung196","Bemerkung206"]
["Bemerkung115","Bemerkung125","Bemerkung135","Bemerkung145","Bemerkung155","Bemerkung165","Bemerkung175","Bemerkung185","Bemerkung195","Bemerkung205"]
["Bemerkung114","Bemerkung124","Bemerkung134","Bemerkung144","Bemerkung154","Bemerkung164","Bemerkung174","Bemerkung184","Bemerkung194","Bemerkung204"]
["Bemerkung113","Bemerkung123","Bemerkung133","Bemerkung143","Bemerkung153","Bemerkung163","Bemerkung173","Bemerkung183","Bemerkung193","Bemerkung203"]
["Bemerkung112","Bemerkung122","Bemerkung132","Bemerkung142","Bemerkung152","Bemerkung162","Bemerkung172","Bemerkung182","Bemerkung192","Bemerkung202"]
["Bemerkung111","Bemerkung121","Bemerkung131","Bemerkung141","Bemerkung151","Bemerkung161","Bemerkung171","Bemerkung181","Bemerkung191","Bemerkung201"]

{"sheet":"Tabelle1","index":1,"n_rows":6,"n_cols":9,"rows_kept":6,"cut":false,"hidden":false,"merged":[[3,0,3,1],[3,2,3,3]]}
["Aktion 1","2020-10-23T20:03:57.950",null,null,null,null,null,null,{"$f":"Zeiterfassung!G4","v":0}]
["01","2020-10-23T20:04:14.050"]
[{"$f":"IF(C2<C1,B3,D3)","v":"nein"},"ja",{"$f":"IF(C2<C1,D2,C2-C1)","v":0},"nein"]
["Start",null,"Ende",null,null,"h:mm:ss"]
["Datum","Uhrzeit","Datum","Uhrzeit","Gesamt",{"$f":"SUM(E:E)","v":0}]
[null,null,null,null,null,"Bemerkung"]

{"sheet":"Tabelle2","index":2,"n_rows":6,"n_cols":9,"rows_kept":6,"cut":false,"hidden":false,"merged":[[3,0,3,1],[3,2,3,3]]}
["Aktion 2","2020-10-23T20:04:20.140",null,null,null,null,null,null,{"$f":"Zeiterfassung!G5","v":0}]
["02","2020-10-23T20:04:24.440"]
[{"$f":"IF(C2<C1,B3,D3)","v":"nein"},"ja",{"$f":"IF(C2<C1,D2,C2-C1)","v":0},"nein"]
["Start",null,"Ende",null,null,"h:mm:ss"]
["Datum","Uhrzeit","Datum","Uhrzeit","Gesamt",{"$f":"SUM(E:E)","v":0}]
[null,null,null,null,null,"Bemerkung"]

{"sheet":"Tabelle3","index":3,"n_rows":6,"n_cols":9,"rows_kept":6,"cut":false,"hidden":false,"merged":[[3,0,3,1],[3,2,3,3]]}
["Aktion 3","2015-11-26T17:59:54.900",null,null,null,null,null,null,{"$f":"Zeiterfassung!G6","v":0}]
["03","2015-11-26T17:59:57.740"]
[{"$f":"IF(C2<C1,B3,D3)","v":"nein"},"ja",{"$f":"IF(C2<C1,D2,C2-C1)","v":0},"nein"]
["Start",null,"Ende",null,null,"h:mm:ss"]
["Datum","Uhrzeit","Datum","Uhrzeit","Gesamt",{"$f":"SUM(E:E)","v":0}]
[null,null,null,null,null,"Bemerkung"]

{"sheet":"Tabelle4","index":4,"n_rows":6,"n_cols":9,"rows_kept":6,"cut":false,"hidden":false,"merged":[[3,0,3,1],[3,2,3,3]]}
["Aktion 4","2015-11-26T17:57:28.410",null,null,null,null,null,null,{"$f":"Zeiterfassung!G7","v":0}]
["04","2015-11-26T17:57:41.230"]
[{"$f":"IF(C2<C1,B3,D3)","v":"nein"},"ja",{"$f":"IF(C2<C1,D2,C2-C1)","v":0},"nein"]
["Start",null,"Ende",null,null,"h:mm:ss"]
["Datum","Uhrzeit","Datum","Uhrzeit","Gesamt",{"$f":"SUM(E:E)","v":0}]
[null,null,null,null,null,"Bemerkung"]

{"sheet":"Tabelle5","index":5,"n_rows":6,"n_cols":9,"rows_kept":6,"cut":false,"hidden":false,"merged":[[3,0,3,1],[3,2,3,3]]}
["Aktion 5","2015-03-02T23:44:58.890",null,null,null,null,null,null,{"$f":"Zeiterfassung!G8","v":0}]
["05","2015-03-02T23:45:03.500"]
[{"$f":"IF(C2<C1,B3,D3)","v":"nein"},"ja",{"$f":"IF(C2<C1,D2,C2-C1)","v":0},"nein"]
["Start",null,"Ende",null,null,"h:mm:ss"]
["Datum","Uhrzeit","Datum","Uhrzeit","Gesamt",{"$f":"SUM(E:E)","v":0}]
[null,null,null,null,null,"Bemerkung"]

{"sheet":"Tabelle6","index":6,"n_rows":6,"n_cols":9,"rows_kept":6,"cut":false,"hidden":false,"merged":[[3,0,3,1],[3,2,3,3]]}
["Aktion 6","2015-03-02T23:29:33.890",null,null,null,null,null,null,{"$f":"Zeiterfassung!G9","v":0}]
["06","2015-03-02T23:29:35.940"]
[{"$f":"IF(C2<C1,B3,D3)","v":"nein"},"ja",{"$f":"IF(C2<C1,D2,C2-C1)","v":0},"nein"]
["Start",null,"Ende",null,null,"h:mm:ss"]
["Datum","Uhrzeit","Datum","Uhrzeit","Gesamt",{"$f":"SUM(E:E)","v":0}]
[null,null,null,null,null,"Bemerkung"]

{"sheet":"Tabelle7","index":7,"n_rows":6,"n_cols":9,"rows_kept":6,"cut":false,"hidden":false,"merged":[[3,0,3,1],[3,2,3,3]]}
["Aktion 7","2014-10-23T19:25:22.930",null,null,null,null,null,null,{"$f":"Zeiterfassung!G10","v":0}]
["07","2014-10-23T19:29:50.270"]
[{"$f":"IF(C2<C1,B3,D3)","v":"nein"},"ja",{"$f":"IF(C2<C1,D2,C2-C1)","v":0},"nein"]
["Start",null,"Ende",null,null,"h:mm:ss"]
["Datum","Uhrzeit","Datum","Uhrzeit","Gesamt",{"$f":"SUM(E:E)","v":0}]
[null,null,null,null,null,"Bemerkung"]

{"sheet":"Tabelle8","index":8,"n_rows":6,"n_cols":9,"rows_kept":6,"cut":false,"hidden":false,"merged":[[3,0,3,1],[3,2,3,3]]}
["Aktion 8","2015-03-02T23:28:47.580",null,null,null,null,null,null,{"$f":"Zeiterfassung!G11","v":0}]
["08","2015-03-03T21:37:34.410"]
[{"$f":"IF(C2<C1,B3,D3)","v":"nein"},"ja",{"$f":"IF(C2<C1,D2,C2-C1)","v":0},"nein"]
["Start",null,"Ende",null,null,"h:mm:ss"]
["Datum","Uhrzeit","Datum","Uhrzeit","Gesamt",{"$f":"SUM(E:E)","v":0}]
[null,null,null,null,null,"Bemerkung"]

{"sheet":"Tabelle9","index":9,"n_rows":6,"n_cols":9,"rows_kept":6,"cut":false,"hidden":false,"merged":[[3,0,3,1],[3,2,3,3]]}
["Aktion 9","2014-10-23T18:26:31.020",null,null,null,null,null,null,{"$f":"Zeiterfassung!G12","v":0}]
["09","2014-10-23T18:29:31.680"]
[{"$f":"IF(C2<C1,B3,D3)","v":"nein"},"ja",{"$f":"IF(C2<C1,D2,C2-C1)","v":0},"nein"]
["Start",null,"Ende",null,null,"h:mm:ss"]
["Datum","Uhrzeit","Datum","Uhrzeit","Gesamt",{"$f":"SUM(E:E)","v":0}]
[null,null,null,null,null,"Bemerkung"]

{"sheet":"Tabelle10","index":10,"n_rows":6,"n_cols":9,"rows_kept":6,"cut":false,"hidden":false,"merged":[[3,0,3,1],[3,2,3,3]]}
["Aktion 10","2014-10-23T18:26:31.020",null,null,null,null,null,null,{"$f":"Zeiterfassung!G13","v":0}]
["10","2014-10-23T18:29:31.680"]
[{"$f":"IF(C2<C1,B3,D3)","v":"nein"},"ja",{"$f":"IF(C2<C1,D2,C2-C1)","v":0},"nein"]
["Start",null,"Ende",null,null,"h:mm:ss"]
["Datum","Uhrzeit","Datum","Uhrzeit","Gesamt",{"$f":"SUM(E:E)","v":0}]
[null,null,null,null,null,"Bemerkung"]

{"sheet":"Tabelle11","index":11,"n_rows":6,"n_cols":9,"rows_kept":6,"cut":false,"hidden":false,"merged":[[3,0,3,1],[3,2,3,3]]}
["Aktion 11","2015-03-02T23:41:23.110",null,null,null,null,null,null,{"$f":"Zeiterfassung!G14","v":0}]
["11","2015-03-02T23:41:27.930"]
[{"$f":"IF(C2<C1,B3,D3)","v":"nein"},"ja",{"$f":"IF(C2<C1,D2,C2-C1)","v":0},"nein"]
["Start",null,"Ende",null,null,"h:mm:ss"]
["Datum","Uhrzeit","Datum","Uhrzeit","Gesamt",{"$f":"SUM(E:E)","v":0}]
[null,null,null,null,null,"Bemerkung"]

{"sheet":"Tabelle12","index":12,"n_rows":6,"n_cols":9,"rows_kept":6,"cut":false,"hidden":false,"merged":[[3,0,3,1],[3,2,3,3]]}
["Aktion 12","2014-10-23T18:26:31.020",null,null,null,null,null,null,{"$f":"Zeiterfassung!G15","v":0}]
["12","2014-10-23T18:29:31.680"]
[{"$f":"IF(C2<C1,B3,D3)","v":"nein"},"ja",{"$f":"IF(C2<C1,D2,C2-C1)","v":0},"nein"]
["Start",null,"Ende",null,null,"h:mm:ss"]
["Datum","Uhrzeit","Datum","Uhrzeit","Gesamt",{"$f":"SUM(E:E)","v":0}]
[null,null,null,null,null,"Bemerkung"]

{"sheet":"Tabelle13","index":13,"n_rows":6,"n_cols":9,"rows_kept":6,"cut":false,"hidden":false,"merged":[[3,0,3,1],[3,2,3,3]]}
["Aktion 13","2014-10-23T18:26:31.020",null,null,null,null,null,null,{"$f":"Zeiterfassung!G16","v":0}]
["13","2014-10-23T18:29:31.680"]
[{"$f":"IF(C2<C1,B3,D3)","v":"nein"},"ja",{"$f":"IF(C2<C1,D2,C2-C1)","v":0},"nein"]
["Start",null,"Ende",null,null,"h:mm:ss"]
["Datum","Uhrzeit","Datum","Uhrzeit","Gesamt",{"$f":"SUM(E:E)","v":0}]
[null,null,null,null,null,"Bemerkung"]

{"sheet":"Tabelle14","index":14,"n_rows":6,"n_cols":9,"rows_kept":6,"cut":false,"hidden":false,"merged":[[3,0,3,1],[3,2,3,3]]}
["Aktion 14","2014-10-23T18:26:31.020",null,null,null,null,null,null,{"$f":"Zeiterfassung!G17","v":0}]
["14","2014-10-23T18:29:31.680"]
[{"$f":"IF(C2<C1,B3,D3)","v":"nein"},"ja",{"$f":"IF(C2<C1,D2,C2-C1)","v":0},"nein"]
["Start",null,"Ende",null,null,"h:mm:ss"]
["Datum","Uhrzeit","Datum","Uhrzeit","Gesamt",{"$f":"SUM(E:E)","v":0}]
[null,null,null,null,null,"Bemerkung"]

{"sheet":"Tabelle15","index":15,"n_rows":6,"n_cols":9,"rows_kept":6,"cut":false,"hidden":false,"merged":[[3,0,3,1],[3,2,3,3]]}
["Aktion 15","2014-10-23T18:26:31.020",null,null,null,null,null,null,{"$f":"Zeiterfassung!G18","v":0}]
["15","2014-10-23T18:29:31.680"]
[{"$f":"IF(C2<C1,B3,D3)","v":"nein"},"ja",{"$f":"IF(C2<C1,D2,C2-C1)","v":0},"nein"]
["Start",null,"Ende",null,null,"h:mm:ss"]
["Datum","Uhrzeit","Datum","Uhrzeit","Gesamt",{"$f":"SUM(E:E)","v":0}]
[null,null,null,null,null,"Bemerkung"]

{"sheet":"Tabelle16","index":16,"n_rows":6,"n_cols":9,"rows_kept":6,"cut":false,"hidden":false,"merged":[[3,0,3,1],[3,2,3,3]]}
["Aktion 16","2014-10-23T18:26:31.020",null,null,null,null,null,null,{"$f":"Zeiterfassung!G19","v":0}]
["16","2014-10-23T18:29:31.680"]
[{"$f":"IF(C2<C1,B3,D3)","v":"nein"},"ja",{"$f":"IF(C2<C1,D2,C2-C1)","v":0},"nein"]
["Start",null,"Ende",null,null,"h:mm:ss"]
["Datum","Uhrzeit","Datum","Uhrzeit","Gesamt",{"$f":"SUM(E:E)","v":0}]
[null,null,null,null,null,"Bemerkung"]

{"sheet":"Tabelle17","index":17,"n_rows":6,"n_cols":9,"rows_kept":6,"cut":false,"hidden":false,"merged":[[3,0,3,1],[3,2,3,3]]}
["Aktion 17","2014-10-23T18:26:31.020",null,null,null,null,null,null,{"$f":"Zeiterfassung!G20","v":0}]
["17","2014-10-23T18:29:31.680"]
[{"$f":"IF(C2<C1,B3,D3)","v":"nein"},"ja",{"$f":"IF(C2<C1,D2,C2-C1)","v":0},"nein"]
["Start",null,"Ende",null,null,"h:mm:ss"]
["Datum","Uhrzeit","Datum","Uhrzeit","Gesamt",{"$f":"SUM(E:E)","v":0}]
[null,null,null,null,null,"Bemerkung"]

{"sheet":"Tabelle18","index":18,"n_rows":6,"n_cols":9,"rows_kept":6,"cut":false,"hidden":false,"merged":[[3,0,3,1],[3,2,3,3]]}
["Aktion 18","2014-10-23T18:26:31.020",null,null,null,null,null,null,{"$f":"Zeiterfassung!G21","v":0}]
["18","2014-10-23T18:29:31.680"]
[{"$f":"IF(C2<C1,B3,D3)","v":"nein"},"ja",{"$f":"IF(C2<C1,D2,C2-C1)","v":0},"nein"]
["Start",null,"Ende",null,null,"h:mm:ss"]
["Datum","Uhrzeit","Datum","Uhrzeit","Gesamt",{"$f":"SUM(E:E)","v":0}]
[null,null,null,null,null,"Bemerkung"]

{"sheet":"Tabelle19","index":19,"n_rows":6,"n_cols":9,"rows_kept":6,"cut":false,"hidden":false,"merged":[[3,0,3,1],[3,2,3,3]]}
["Aktion 19","2014-10-23T18:26:31.020",null,null,null,null,null,null,{"$f":"Zeiterfassung!G22","v":0}]
["19","2014-10-23T18:29:31.680"]
[{"$f":"IF(C2<C1,B3,D3)","v":"nein"},"ja",{"$f":"IF(C2<C1,D2,C2-C1)","v":0},"nein"]
["Start",null,"Ende",null,null,"h:mm:ss"]
["Datum","Uhrzeit","Datum","Uhrzeit","Gesamt",{"$f":"SUM(E:E)","v":0}]
[null,null,null,null,null,"Bemerkung"]

{"sheet":"Tabelle20","index":20,"n_rows":6,"n_cols":9,"rows_kept":6,"cut":false,"hidden":false,"merged":[[3,0,3,1],[3,2,3,3]]}
["Aktion 20","2015-03-03T22:14:42.030",null,null,null,null,null,null,{"$f":"Zeiterfassung!G23","v":0}]
["20","2015-03-03T22:14:46.710"]
[{"$f":"IF(C2<C1,B3,D3)","v":"nein"},"ja",{"$f":"IF(C2<C1,D2,C2-C1)","v":0},"nein"]
["Start",null,"Ende",null,null,"h:mm:ss"]
["Datum","Uhrzeit","Datum","Uhrzeit","Gesamt",{"$f":"SUM(E:E)","v":0}]
[null,null,null,null,null,"Bemerkung"]