{"text_format":"1","workbook":"xlsx","n_sheets":48,"sheets":["Start","Suche","Druckausgabe","diverse Arbeiten","TGM Standardgewinde","TGM Bohren"," Tiefbohren mehrere Arten","TGM Rundschleifen","TGM Plandrehen","TGM Langdrehen ","Aufmaß Zeitspanvolumen Drehen","TGM Fräsen_F pro Zahn","TGM Fräsen _F pro Min.","Drehzahlberechnung","Vorschubberechnung","ZSV","Aufmaße","Rundstahl","Rundstahl (-)","Kegelstumpf","Kegelstumpf (-)","Vierkant","Vierkant (-)","Sechskant","Sechskant (-)","Kugel","Kugel (-)","Rohr","Rohr (-)","Vielkant","Vielkant (-)","Pyramidenstumpf(+)","Pyramidenstumpf(-)","Kugelsektor(+) ","Kugelsektor(-)","Kugelabschnitt +","Kugelabschnitt -","Zylinderabschnitt(+)","Zylinderabschnitt(-)","Prisma(+)","Prisma(-)","diverse Berechnungen","Flächen","Umrechnungen","Rechner","Pfad für Ordner","Löschen","Werkzeugdaten"],"not_rendered":{"charts":0,"images":72,"macros":1,"external_links":0,"defined_names":5,"comments":11,"pivot_tables":0},"unopened":[],"bounds":{"document_bytes":16777216,"sheet_cells":100000,"rows_first":2000,"rows_last":500,"rows_between":2000,"halvings":0,"cell_chars":16384,"cell_head_chars":4096},"cells_cut":0,"cells_raw":0,"read":"whole","date_system":"1900"}

{"sheet":"Start","index":0,"n_rows":26,"n_cols":23,"rows_kept":26,"cut":false,"hidden":false,"merged":[[6,0,6,1],[1,0,1,1],[17,0,17,1]]}
["Gesamtzeit des Teiles in Minuten:",{"$f":"SUM('diverse Arbeiten'!E2)+('TGM Standardgewinde'!F2)+('TGM Bohren'!J3)+('TGM Plandrehen'!K1)+('TGM Langdrehen '!M1)+('TGM Fräsen_F pro Zahn'!I2)+('TGM Fräsen _F pro Min.'!F2)+(' Tiefbohren mehrere Arten'!E2)+('TGM Rundschleifen'!D2)+(ZSV!D11)+(ZSV!D20)+(ZSV!D29)+(ZSV!D38)+(ZSV!D47)+(ZSV!D56)+('Aufmaß Zeitspanvolumen Drehen'!C3)","v":0},"Arbeitsblätter",null,1,{"$f":"INDEX(E2:E13,E1)","v":"€"},null,null,null,null,null,{"$f":"IF(Suche!O1=0,\"Fehler bedingte Formatierung\",Suche!O1)","v":{"$error":"#N/A"}}]
["Gesamtsumme + X% Zuschlagsatz",null,null,null,"€"]
[30,{"$f":"ROUND($B$1+($B$1/100*A3),2)","v":0},null,null,"CHF"]
[{"$f":"CONCATENATE(\"Stundensatz in \",F1)","v":"Stundensatz in €"},{"$f":"CONCATENATE(\"Preis in \",F1)","v":"Preis in €"},null,null,"$"]
[70,{"$f":"A5/60*B3","v":0}]
[]
[]
[null,null,null,null,null,null,null,{"$f":"IF(H9=16,\"Hinweis1\",\"edit_Berechnung\")","v":"Hinweis1"}]
[null,null,null,null,null,null,null,{"$f":"TYPE(Suche!O1)","v":16},null,null,null,null,null,null,null,{"$f":"A19","v":"Teile-Nr.:"},{"$f":"A20","v":"Teilebezeichnung:"},{"$f":"A21","v":"Material:"},"Speicher-Datum",{"$f":"A22","v":"für Firma:"},{"$f":"A23","v":"Anfrage-Nr.:"},{"$f":"A24","v":"Angebots-Nr.:"},{"$f":"A2","v":"Gesamtsumme + X% Zuschlagsatz"}]
[null,null,null,null,null,null,null,{"$f":"IF(B19=0,\"Hinweis2\",\"TGM_speichern\")","v":"Hinweis2"},null,null,null,null,null,null,null,{"$f":"B19","v":0},{"$f":"B20","v":0},{"$f":"B21","v":0},{"$f":"NOW()","v":"2016-12-21T14:11:15.230"},{"$f":"B22","v":0},{"$f":"B23","v":0},{"$f":"B24","v":0},{"$f":"B3","v":0}]
[]
[]
[]
["heutiges Datum:",{"$f":"NOW()","v":"2016-12-21T14:11:15.240"}]
[]
["© Ulrich Daßler 25.05.2016"]
[]
["Dateneingabe für Berechnung",null,"Anzahl gespeicherte Berechnungen"]
["Teile-Nr.:",null,{"$f":"COUNTA(Suche!A:A)-1","v":0}]
["Teilebezeichnung:"]
["Material:"]
["für Firma:"]
["Anfrage-Nr.:"]
["Angebots-Nr.:"]
[]
["Hinweis für die Berechnung:"]

{"sheet":"Suche","index":1,"n_rows":1,"n_cols":16,"rows_kept":1,"cut":false,"hidden":false,"merged":[]}
["Teile-Nr.:","Teilebezeichnung:","Material:","Speicher-Datum","für Firma:","Anfrage-Nr.:","Angebots-Nr.:","Berechnete Zeit in Minuten einschl. Zuschlagsatz",null,null,null,null,null,null,{"$f":"VLOOKUP(P1,A:A,1,0)","v":{"$error":"#N/A"}},{"$f":"Start!B19","v":0}]

{"sheet":"Druckausgabe","index":2,"n_rows":720,"n_cols":6,"rows_kept":720,"cut":false,"hidden":false,"merged":[]}
[null,null,null,null,"Abfrage Ausblenden J/N"]
["Berechnung der Hauptnutzungszeit ",null,null,null,null,{"$f":"CONCATENATE(B3,\"_\",B4)","v":"0_0"}]
[{"$f":"Start!A19","v":"Teile-Nr.:"},{"$f":"Start!B19","v":0}]
[{"$f":"Start!A20","v":"Teilebezeichnung:"},{"$f":"Start!B20","v":0}]
[{"$f":"Start!A21","v":"Material:"},{"$f":"Start!B21","v":0}]
[{"$f":"Start!A22","v":"für Firma:"},{"$f":"Start!B22","v":0}]
[{"$f":"Start!A23","v":"Anfrage-Nr.:"},{"$f":"Start!B23","v":0}]
[{"$f":"Start!A24","v":"Angebots-Nr.:"},{"$f":"Start!B24","v":0}]
[{"$f":"Start!A25","v":0},{"$f":"Start!B25","v":0},null,null,{"$f":"IF(A9=0,\"J\",\"N\")","v":"J"}]
[{"$f":"Start!A26","v":"Hinweis für die Berechnung:"},{"$f":"Start!B26","v":0},null,null,"N"]
[{"$f":"Start!A27","v":0},{"$f":"Start!B27","v":0},null,null,"J"]
[{"$f":"Start!A28","v":0},{"$f":"Start!B28","v":0},null,null,"J"]
[{"$f":"Start!A29","v":0},{"$f":"Start!B29","v":0},null,null,"J"]
[]
["berechnete Zeit in Minuten:",{"$f":"ROUND(Start!B1,2)","v":0}]
["Zuschlagsatz in %:",{"$f":"CONCATENATE(Start!A3,\"%\")","v":"30%"}]
["Gesamtzeit inkl. Zuschlagsatz in Minuten:",{"$f":"Start!B3","v":0}]
[{"$f":"CONCATENATE(\"Stundensatz in \",Start!F1,\":\")","v":"Stundensatz in €:"},{"$f":"CONCATENATE(Start!A5,\" \",Start!F1)","v":"70 €"}]
[{"$f":"CONCATENATE(\"Preis in \",Start!F1,\":\")","v":"Preis in €:"},{"$f":"CONCATENATE(ROUND(Start!B5,2),\" \",Start!F1)","v":"0 €"}]
[]
[{"$f":"'diverse Arbeiten'!B1","v":"Zeitberechnung diverse Arbeiten"},null,null,null,{"$f":"IF(B22=0,\"J\",\"N\")","v":"J"}]
["Gesamtzeit in Minuten =",{"$f":"'diverse Arbeiten'!E2","v":0},null,null,{"$f":"IF(B22=0,\"J\",\"N\")","v":"J"}]
["Bemerkung","Beschreibung","Menge ","Zeit",{"$f":"IF(B22=0,\"J\",\"N\")","v":"J"}]
[{"$f":"'diverse Arbeiten'!A4","v":0},{"$f":"'diverse Arbeiten'!B4","v":0},{"$f":"'diverse Arbeiten'!C4","v":0},{"$f":"'diverse Arbeiten'!E4","v":0},{"$f":"IF(D24=0,\"J\",\"N\")","v":"J"}]
[{"$f":"'diverse Arbeiten'!A5","v":0},{"$f":"'diverse Arbeiten'!B5","v":0},{"$f":"'diverse Arbeiten'!C5","v":0},{"$f":"'diverse Arbeiten'!E5","v":0},{"$f":"IF(D25=0,\"J\",\"N\")","v":"J"}]
[{"$f":"'diverse Arbeiten'!A6","v":0},{"$f":"'diverse Arbeiten'!B6","v":0},{"$f":"'diverse Arbeiten'!C6","v":0},{"$f":"'diverse Arbeiten'!E6","v":0},"J"]
[{"$f":"'diverse Arbeiten'!A7","v":0},{"$f":"'diverse Arbeiten'!B7","v":0},{"$f":"'diverse Arbeiten'!C7","v":0},{"$f":"'diverse Arbeiten'!E7","v":0},"J"]
[{"$f":"'diverse Arbeiten'!A8","v":0},{"$f":"'diverse Arbeiten'!B8","v":0},{"$f":"'diverse Arbeiten'!C8","v":0},{"$f":"'diverse Arbeiten'!E8","v":0},"J"]
[{"$f":"'diverse Arbeiten'!A9","v":0},{"$f":"'diverse Arbeiten'!B9","v":0},{"$f":"'diverse Arbeiten'!C9","v":0},{"$f":"'diverse Arbeiten'!E9","v":0},"J"]
[{"$f":"'diverse Arbeiten'!A10","v":0},{"$f":"'diverse Arbeiten'!B10","v":0},{"$f":"'diverse Arbeiten'!C10","v":0},{"$f":"'diverse Arbeiten'!E10","v":0},"J"]
[{"$f":"'diverse Arbeiten'!A11","v":0},{"$f":"'diverse Arbeiten'!B11","v":0},{"$f":"'diverse Arbeiten'!C11","v":0},{"$f":"'diverse Arbeiten'!E11","v":0},"J"]
[{"$f":"'diverse Arbeiten'!A12","v":0},{"$f":"'diverse Arbeiten'!B12","v":0},{"$f":"'diverse Arbeiten'!C12","v":0},{"$f":"'diverse Arbeiten'!E12","v":0},"J"]
[{"$f":"'diverse Arbeiten'!A13","v":0},{"$f":"'diverse Arbeiten'!B13","v":0},{"$f":"'diverse Arbeiten'!C13","v":0},{"$f":"'diverse Arbeiten'!E13","v":0},"J"]
[{"$f":"'diverse Arbeiten'!A14","v":0},{"$f":"'diverse Arbeiten'!B14","v":0},{"$f":"'diverse Arbeiten'!C14","v":0},{"$f":"'diverse Arbeiten'!E14","v":0},"J"]
[{"$f":"'diverse Arbeiten'!A15","v":0},{"$f":"'diverse Arbeiten'!B15","v":0},{"$f":"'diverse Arbeiten'!C15","v":0},{"$f":"'diverse Arbeiten'!E15","v":0},"J"]
[{"$f":"'diverse Arbeiten'!A16","v":0},{"$f":"'diverse Arbeiten'!B16","v":0},{"$f":"'diverse Arbeiten'!C16","v":0},{"$f":"'diverse Arbeiten'!E16","v":0},"J"]
[{"$f":"'diverse Arbeiten'!A17","v":0},{"$f":"'diverse Arbeiten'!B17","v":0},{"$f":"'diverse Arbeiten'!C17","v":0},{"$f":"'diverse Arbeiten'!E17","v":0},"J"]
[{"$f":"'diverse Arbeiten'!A18","v":0},{"$f":"'diverse Arbeiten'!B18","v":0},{"$f":"'diverse Arbeiten'!C18","v":0},{"$f":"'diverse Arbeiten'!E18","v":0},"J"]
[{"$f":"'diverse Arbeiten'!A19","v":0},{"$f":"'diverse Arbeiten'!B19","v":0},{"$f":"'diverse Arbeiten'!C19","v":0},{"$f":"'diverse Arbeiten'!E19","v":0},"J"]
[{"$f":"'diverse Arbeiten'!A20","v":0},{"$f":"'diverse Arbeiten'!B20","v":0},{"$f":"'diverse Arbeiten'!C20","v":0},{"$f":"'diverse Arbeiten'!E20","v":0},"J"]
[{"$f":"'diverse Arbeiten'!A21","v":0},{"$f":"'diverse Arbeiten'!B21","v":0},{"$f":"'diverse Arbeiten'!C21","v":0},{"$f":"'diverse Arbeiten'!E21","v":0},"J"]
[{"$f":"'diverse Arbeiten'!A22","v":0},{"$f":"'diverse Arbeiten'!B22","v":0},{"$f":"'diverse Arbeiten'!C22","v":0},{"$f":"'diverse Arbeiten'!E22","v":0},"J"]
[{"$f":"'diverse Arbeiten'!A23","v":0},{"$f":"'diverse Arbeiten'!B23","v":0},{"$f":"'diverse Arbeiten'!C23","v":0},{"$f":"'diverse Arbeiten'!E23","v":0},"J"]
[{"$f":"'diverse Arbeiten'!A24","v":0},{"$f":"'diverse Arbeiten'!B24","v":0},{"$f":"'diverse Arbeiten'!C24","v":0},{"$f":"'diverse Arbeiten'!E24","v":0},"J"]
[{"$f":"'diverse Arbeiten'!A25","v":0},{"$f":"'diverse Arbeiten'!B25","v":0},{"$f":"'diverse Arbeiten'!C25","v":0},{"$f":"'diverse Arbeiten'!E25","v":0},"J"]
[{"$f":"'diverse Arbeiten'!A26","v":0},{"$f":"'diverse Arbeiten'!B26","v":0},{"$f":"'diverse Arbeiten'!C26","v":0},{"$f":"'diverse Arbeiten'!E26","v":0},"J"]
[{"$f":"'diverse Arbeiten'!A27","v":0},{"$f":"'diverse Arbeiten'!B27","v":0},{"$f":"'diverse Arbeiten'!C27","v":0},{"$f":"'diverse Arbeiten'!E27","v":0},"J"]
[{"$f":"'diverse Arbeiten'!A28","v":0},{"$f":"'diverse Arbeiten'!B28","v":0},{"$f":"'diverse Arbeiten'!C28","v":0},{"$f":"'diverse Arbeiten'!E28","v":0},"J"]
[{"$f":"'diverse Arbeiten'!A29","v":0},{"$f":"'diverse Arbeiten'!B29","v":0},{"$f":"'diverse Arbeiten'!C29","v":0},{"$f":"'diverse Arbeiten'!E29","v":0},"J"]
[{"$f":"'diverse Arbeiten'!A30","v":0},{"$f":"'diverse Arbeiten'!B30","v":0},{"$f":"'diverse Arbeiten'!C30","v":0},{"$f":"'diverse Arbeiten'!E30","v":0},"J"]
[{"$f":"'diverse Arbeiten'!A31","v":0},{"$f":"'diverse Arbeiten'!B31","v":0},{"$f":"'diverse Arbeiten'!C31","v":0},{"$f":"'diverse Arbeiten'!E31","v":0},"J"]
[{"$f":"'diverse Arbeiten'!A32","v":0},{"$f":"'diverse Arbeiten'!B32","v":0},{"$f":"'diverse Arbeiten'!C32","v":0},{"$f":"'diverse Arbeiten'!E32","v":0},"J"]
[{"$f":"'diverse Arbeiten'!A33","v":0},{"$f":"'diverse Arbeiten'!B33","v":0},{"$f":"'diverse Arbeiten'!C33","v":0},{"$f":"'diverse Arbeiten'!E33","v":0},"J"]
[{"$f":"'diverse Arbeiten'!A34","v":0},{"$f":"'diverse Arbeiten'!B34","v":0},{"$f":"'diverse Arbeiten'!C34","v":0},{"$f":"'diverse Arbeiten'!E34","v":0},"J"]
[{"$f":"'diverse Arbeiten'!A35","v":0},{"$f":"'diverse Arbeiten'!B35","v":0},{"$f":"'diverse Arbeiten'!C35","v":0},{"$f":"'diverse Arbeiten'!E35","v":0},"J"]
[{"$f":"'diverse Arbeiten'!A36","v":0},{"$f":"'diverse Arbeiten'!B36","v":0},{"$f":"'diverse Arbeiten'!C36","v":0},{"$f":"'diverse Arbeiten'!E36","v":0},"J"]
[{"$f":"'diverse Arbeiten'!A37","v":0},{"$f":"'diverse Arbeiten'!B37","v":0},{"$f":"'diverse Arbeiten'!C37","v":0},{"$f":"'diverse Arbeiten'!E37","v":0},"J"]
[{"$f":"'diverse Arbeiten'!A38","v":0},{"$f":"'diverse Arbeiten'!B38","v":0},{"$f":"'diverse Arbeiten'!C38","v":0},{"$f":"'diverse Arbeiten'!E38","v":0},"J"]
[{"$f":"'diverse Arbeiten'!A39","v":0},{"$f":"'diverse Arbeiten'!B39","v":0},{"$f":"'diverse Arbeiten'!C39","v":0},{"$f":"'diverse Arbeiten'!E39","v":0},"J"]
[{"$f":"'diverse Arbeiten'!A40","v":0},{"$f":"'diverse Arbeiten'!B40","v":0},{"$f":"'diverse Arbeiten'!C40","v":0},{"$f":"'diverse Arbeiten'!E40","v":0},"J"]
[{"$f":"'diverse Arbeiten'!A41","v":0},{"$f":"'diverse Arbeiten'!B41","v":0},{"$f":"'diverse Arbeiten'!C41","v":0},{"$f":"'diverse Arbeiten'!E41","v":0},"J"]
[{"$f":"'diverse Arbeiten'!A42","v":0},{"$f":"'diverse Arbeiten'!B42","v":0},{"$f":"'diverse Arbeiten'!C42","v":0},{"$f":"'diverse Arbeiten'!E42","v":0},"J"]
[{"$f":"'diverse Arbeiten'!A43","v":0},{"$f":"'diverse Arbeiten'!B43","v":0},{"$f":"'diverse Arbeiten'!C43","v":0},{"$f":"'diverse Arbeiten'!E43","v":0},"J"]
[{"$f":"'diverse Arbeiten'!A44","v":0},{"$f":"'diverse Arbeiten'!B44","v":0},{"$f":"'diverse Arbeiten'!C44","v":0},{"$f":"'diverse Arbeiten'!E44","v":0},"J"]
[{"$f":"'diverse Arbeiten'!A45","v":0},{"$f":"'diverse Arbeiten'!B45","v":0},{"$f":"'diverse Arbeiten'!C45","v":0},{"$f":"'diverse Arbeiten'!E45","v":0},"J"]
[{"$f":"'diverse Arbeiten'!A46","v":0},{"$f":"'diverse Arbeiten'!B46","v":0},{"$f":"'diverse Arbeiten'!C46","v":0},{"$f":"'diverse Arbeiten'!E46","v":0},"J"]
[{"$f":"'diverse Arbeiten'!A47","v":0},{"$f":"'diverse Arbeiten'!B47","v":0},{"$f":"'diverse Arbeiten'!C47","v":0},{"$f":"'diverse Arbeiten'!E47","v":0},"J"]
[{"$f":"'diverse Arbeiten'!A48","v":0},{"$f":"'diverse Arbeiten'!B48","v":0},{"$f":"'diverse Arbeiten'!C48","v":0},{"$f":"'diverse Arbeiten'!E48","v":0},"J"]
[{"$f":"'diverse Arbeiten'!A49","v":0},{"$f":"'diverse Arbeiten'!B49","v":0},{"$f":"'diverse Arbeiten'!C49","v":0},{"$f":"'diverse Arbeiten'!E49","v":0},"J"]
[{"$f":"'diverse Arbeiten'!A50","v":0},{"$f":"'diverse Arbeiten'!B50","v":0},{"$f":"'diverse Arbeiten'!C50","v":0},{"$f":"'diverse Arbeiten'!E50","v":0},"J"]
[{"$f":"'diverse Arbeiten'!A51","v":0},{"$f":"'diverse Arbeiten'!B51","v":0},{"$f":"'diverse Arbeiten'!C51","v":0},{"$f":"'diverse Arbeiten'!E51","v":0},"J"]
[{"$f":"'diverse Arbeiten'!A52","v":0},{"$f":"'diverse Arbeiten'!B52","v":0},{"$f":"'diverse Arbeiten'!C52","v":0},{"$f":"'diverse Arbeiten'!E52","v":0},"J"]
[{"$f":"'diverse Arbeiten'!A53","v":0},{"$f":"'diverse Arbeiten'!B53","v":0},{"$f":"'diverse Arbeiten'!C53","v":0},{"$f":"'diverse Arbeiten'!E53","v":0},"J"]
[{"$f":"'diverse Arbeiten'!A54","v":0},{"$f":"'diverse Arbeiten'!B54","v":0},{"$f":"'diverse Arbeiten'!C54","v":0},{"$f":"'diverse Arbeiten'!E54","v":0},"J"]
[{"$f":"'diverse Arbeiten'!A55","v":0},{"$f":"'diverse Arbeiten'!B55","v":0},{"$f":"'diverse Arbeiten'!C55","v":0},{"$f":"'diverse Arbeiten'!E55","v":0},"J"]
[{"$f":"'diverse Arbeiten'!A56","v":0},{"$f":"'diverse Arbeiten'!B56","v":0},{"$f":"'diverse Arbeiten'!C56","v":0},{"$f":"'diverse Arbeiten'!E56","v":0},"J"]
[{"$f":"'diverse Arbeiten'!A57","v":0},{"$f":"'diverse Arbeiten'!B57","v":0},{"$f":"'diverse Arbeiten'!C57","v":0},{"$f":"'diverse Arbeiten'!E57","v":0},"J"]
[{"$f":"'diverse Arbeiten'!A58","v":0},{"$f":"'diverse Arbeiten'!B58","v":0},{"$f":"'diverse Arbeiten'!C58","v":0},{"$f":"'diverse Arbeiten'!E58","v":0},"J"]
[{"$f":"'diverse Arbeiten'!A59","v":0},{"$f":"'diverse Arbeiten'!B59","v":0},{"$f":"'diverse Arbeiten'!C59","v":0},{"$f":"'diverse Arbeiten'!E59","v":0},"J"]
[{"$f":"'diverse Arbeiten'!A60","v":0},{"$f":"'diverse Arbeiten'!B60","v":0},{"$f":"'diverse Arbeiten'!C60","v":0},{"$f":"'diverse Arbeiten'!E60","v":0},"J"]
[{"$f":"'diverse Arbeiten'!A61","v":0},{"$f":"'diverse Arbeiten'!B61","v":0},{"$f":"'diverse Arbeiten'!C61","v":0},{"$f":"'diverse Arbeiten'!E61","v":0},"J"]
[{"$f":"'diverse Arbeiten'!A62","v":0},{"$f":"'diverse Arbeiten'!B62","v":0},{"$f":"'diverse Arbeiten'!C62","v":0},{"$f":"'diverse Arbeiten'!E62","v":0},"J"]
[{"$f":"'diverse Arbeiten'!A63","v":0},{"$f":"'diverse Arbeiten'!B63","v":0},{"$f":"'diverse Arbeiten'!C63","v":0},{"$f":"'diverse Arbeiten'!E63","v":0},"J"]
[{"$f":"'diverse Arbeiten'!A64","v":0},{"$f":"'diverse Arbeiten'!B64","v":0},{"$f":"'diverse Arbeiten'!C64","v":0},{"$f":"'diverse Arbeiten'!E64","v":0},"J"]
[{"$f":"'diverse Arbeiten'!A65","v":0},{"$f":"'diverse Arbeiten'!B65","v":0},{"$f":"'diverse Arbeiten'!C65","v":0},{"$f":"'diverse Arbeiten'!E65","v":0},"J"]
[{"$f":"'diverse Arbeiten'!A66","v":0},{"$f":"'diverse Arbeiten'!B66","v":0},{"$f":"'diverse Arbeiten'!C66","v":0},{"$f":"'diverse Arbeiten'!E66","v":0},"J"]
[{"$f":"'diverse Arbeiten'!A67","v":0},{"$f":"'diverse Arbeiten'!B67","v":0},{"$f":"'diverse Arbeiten'!C67","v":0},{"$f":"'diverse Arbeiten'!E67","v":0},"J"]
[{"$f":"'diverse Arbeiten'!A68","v":0},{"$f":"'diverse Arbeiten'!B68","v":0},{"$f":"'diverse Arbeiten'!C68","v":0},{"$f":"'diverse Arbeiten'!E68","v":0},"J"]
[{"$f":"'diverse Arbeiten'!A69","v":0},{"$f":"'diverse Arbeiten'!B69","v":0},{"$f":"'diverse Arbeiten'!C69","v":0},{"$f":"'diverse Arbeiten'!E69","v":0},{"$f":"IF(D89=0,\"J\",\"N\")","v":"J"}]
[{"$f":"'diverse Arbeiten'!A70","v":0},{"$f":"'diverse Arbeiten'!B70","v":0},{"$f":"'diverse Arbeiten'!C70","v":0},{"$f":"'diverse Arbeiten'!E70","v":0},"J"]
[{"$f":"'diverse Arbeiten'!A71","v":0},{"$f":"'diverse Arbeiten'!B71","v":0},{"$f":"'diverse Arbeiten'!C71","v":0},{"$f":"'diverse Arbeiten'!E71","v":0},"J"]
[{"$f":"'diverse Arbeiten'!A72","v":0},{"$f":"'diverse Arbeiten'!B72","v":0},{"$f":"'diverse Arbeiten'!C72","v":0},{"$f":"'diverse Arbeiten'!E72","v":0},"J"]
[{"$f":"'diverse Arbeiten'!A73","v":0},{"$f":"'diverse Arbeiten'!B73","v":0},{"$f":"'diverse Arbeiten'!C73","v":0},{"$f":"'diverse Arbeiten'!E73","v":0},"J"]
[{"$f":"'diverse Arbeiten'!A74","v":0},{"$f":"'diverse Arbeiten'!B74","v":0},{"$f":"'diverse Arbeiten'!C74","v":0},{"$f":"'diverse Arbeiten'!E74","v":0},"J"]
[{"$f":"'diverse Arbeiten'!A75","v":0},{"$f":"'diverse Arbeiten'!B75","v":0},{"$f":"'diverse Arbeiten'!C75","v":0},{"$f":"'diverse Arbeiten'!E75","v":0},"J"]
[{"$f":"'diverse Arbeiten'!A76","v":0},{"$f":"'diverse Arbeiten'!B76","v":0},{"$f":"'diverse Arbeiten'!C76","v":0},{"$f":"'diverse Arbeiten'!E76","v":0},"J"]
[{"$f":"'diverse Arbeiten'!A77","v":0},{"$f":"'diverse Arbeiten'!B77","v":0},{"$f":"'diverse Arbeiten'!C77","v":0},{"$f":"'diverse Arbeiten'!E77","v":0},"J"]
[{"$f":"'diverse Arbeiten'!A78","v":0},{"$f":"'diverse Arbeiten'!B78","v":0},{"$f":"'diverse Arbeiten'!C78","v":0},{"$f":"'diverse Arbeiten'!E78","v":0},"J"]
[{"$f":"'diverse Arbeiten'!A79","v":0},{"$f":"'diverse Arbeiten'!B79","v":0},{"$f":"'diverse Arbeiten'!C79","v":0},{"$f":"'diverse Arbeiten'!E79","v":0},"J"]
[{"$f":"'diverse Arbeiten'!A80","v":0},{"$f":"'diverse Arbeiten'!B80","v":0},{"$f":"'diverse Arbeiten'!C80","v":0},{"$f":"'diverse Arbeiten'!E80","v":0},"J"]
[{"$f":"'diverse Arbeiten'!A81","v":0},{"$f":"'diverse Arbeiten'!B81","v":0},{"$f":"'diverse Arbeiten'!C81","v":0},{"$f":"'diverse Arbeiten'!E81","v":0},"J"]
[{"$f":"'diverse Arbeiten'!A82","v":0},{"$f":"'diverse Arbeiten'!B82","v":0},{"$f":"'diverse Arbeiten'!C82","v":0},{"$f":"'diverse Arbeiten'!E82","v":0},"J"]
[{"$f":"'diverse Arbeiten'!A83","v":0},{"$f":"'diverse Arbeiten'!B83","v":0},{"$f":"'diverse Arbeiten'!C83","v":0},{"$f":"'diverse Arbeiten'!E83","v":0},"J"]
[{"$f":"'diverse Arbeiten'!A84","v":0},{"$f":"'diverse Arbeiten'!B84","v":0},{"$f":"'diverse Arbeiten'!C84","v":0},{"$f":"'diverse Arbeiten'!E84","v":0},"J"]
[{"$f":"'diverse Arbeiten'!A85","v":0},{"$f":"'diverse Arbeiten'!B85","v":0},{"$f":"'diverse Arbeiten'!C85","v":0},{"$f":"'diverse Arbeiten'!E85","v":0},"J"]
[{"$f":"'diverse Arbeiten'!A86","v":0},{"$f":"'diverse Arbeiten'!B86","v":0},{"$f":"'diverse Arbeiten'!C86","v":0},{"$f":"'diverse Arbeiten'!E86","v":0},"J"]
[{"$f":"'diverse Arbeiten'!A87","v":0},{"$f":"'diverse Arbeiten'!B87","v":0},{"$f":"'diverse Arbeiten'!C87","v":0},{"$f":"'diverse Arbeiten'!E87","v":0},"J"]
[{"$f":"'diverse Arbeiten'!A88","v":0},{"$f":"'diverse Arbeiten'!B88","v":0},{"$f":"'diverse Arbeiten'!C88","v":0},{"$f":"'diverse Arbeiten'!E88","v":0},"J"]
[{"$f":"'diverse Arbeiten'!A89","v":0},{"$f":"'diverse Arbeiten'!B89","v":0},{"$f":"'diverse Arbeiten'!C89","v":0},{"$f":"'diverse Arbeiten'!E89","v":0},"J"]
[{"$f":"'diverse Arbeiten'!A90","v":0},{"$f":"'diverse Arbeiten'!B90","v":0},{"$f":"'diverse Arbeiten'!C90","v":0},{"$f":"'diverse Arbeiten'!E90","v":0},"J"]
[{"$f":"'diverse Arbeiten'!A91","v":0},{"$f":"'diverse Arbeiten'!B91","v":0},{"$f":"'diverse Arbeiten'!C91","v":0},{"$f":"'diverse Arbeiten'!E91","v":0},"J"]
[{"$f":"'diverse Arbeiten'!A92","v":0},{"$f":"'diverse Arbeiten'!B92","v":0},{"$f":"'diverse Arbeiten'!C92","v":0},{"$f":"'diverse Arbeiten'!E92","v":0},"J"]
[{"$f":"'diverse Arbeiten'!A93","v":0},{"$f":"'diverse Arbeiten'!B93","v":0},{"$f":"'diverse Arbeiten'!C93","v":0},{"$f":"'diverse Arbeiten'!E93","v":0},"J"]
[{"$f":"'diverse Arbeiten'!A94","v":0},{"$f":"'diverse Arbeiten'!B94","v":0},{"$f":"'diverse Arbeiten'!C94","v":0},{"$f":"'diverse Arbeiten'!E94","v":0},"J"]
[{"$f":"'diverse Arbeiten'!A95","v":0},{"$f":"'diverse Arbeiten'!B95","v":0},{"$f":"'diverse Arbeiten'!C95","v":0},{"$f":"'diverse Arbeiten'!E95","v":0},"J"]
[{"$f":"'diverse Arbeiten'!A96","v":0},{"$f":"'diverse Arbeiten'!B96","v":0},{"$f":"'diverse Arbeiten'!C96","v":0},{"$f":"'diverse Arbeiten'!E96","v":0},"J"]
[{"$f":"'diverse Arbeiten'!A97","v":0},{"$f":"'diverse Arbeiten'!B97","v":0},{"$f":"'diverse Arbeiten'!C97","v":0},{"$f":"'diverse Arbeiten'!E97","v":0},"J"]
[{"$f":"'diverse Arbeiten'!A98","v":0},{"$f":"'diverse Arbeiten'!B98","v":0},{"$f":"'diverse Arbeiten'!C98","v":0},{"$f":"'diverse Arbeiten'!E98","v":0},"J"]
[{"$f":"'diverse Arbeiten'!A99","v":0},{"$f":"'diverse Arbeiten'!B99","v":0},{"$f":"'diverse Arbeiten'!C99","v":0},{"$f":"'diverse Arbeiten'!E99","v":0},"J"]
[{"$f":"'diverse Arbeiten'!A100","v":0},{"$f":"'diverse Arbeiten'!B100","v":0},{"$f":"'diverse Arbeiten'!C100","v":0},{"$f":"'diverse Arbeiten'!E100","v":0},"J"]
[{"$f":"'diverse Arbeiten'!A101","v":0},{"$f":"'diverse Arbeiten'!B101","v":0},{"$f":"'diverse Arbeiten'!C101","v":0},{"$f":"'diverse Arbeiten'!E101","v":0},"J"]
[{"$f":"'diverse Arbeiten'!A102","v":0},{"$f":"'diverse Arbeiten'!B102","v":0},{"$f":"'diverse Arbeiten'!C102","v":0},{"$f":"'diverse Arbeiten'!E102","v":0},"J"]
[{"$f":"'diverse Arbeiten'!A103","v":0},{"$f":"'diverse Arbeiten'!B103","v":0},{"$f":"'diverse Arbeiten'!C103","v":0},{"$f":"'diverse Arbeiten'!E103","v":0},"J"]
[{"$f":"'diverse Arbeiten'!A104","v":0},{"$f":"'diverse Arbeiten'!B104","v":0},{"$f":"'diverse Arbeiten'!C104","v":0},{"$f":"'diverse Arbeiten'!E104","v":0},"J"]
[null,null,null,null,{"$f":"IF(B22=0,\"J\",\"N\")","v":"J"}]
[{"$f":"'TGM Standardgewinde'!A1","v":"Zeitberechnung  zentrieren, bohren, senken und Gewinde schneiden bei Standardgewinden"},null,null,null,{"$f":"IF(B127=0,\"J\",\"N\")","v":"J"}]
["Gesamtzeit in Minuten =",{"$f":"'TGM Standardgewinde'!F2","v":0},null,null,{"$f":"IF(B127=0,\"J\",\"N\")","v":"J"}]
["Bemerkung","Gewinde","Menge ","Zeit",{"$f":"IF(B127=0,\"J\",\"N\")","v":"J"}]
[{"$f":"'TGM Standardgewinde'!A3","v":0},{"$f":"'TGM Standardgewinde'!B3","v":0},{"$f":"'TGM Standardgewinde'!C3","v":0},{"$f":"'TGM Standardgewinde'!E3","v":0},{"$f":"IF(D129=0,\"J\",\"N\")","v":"J"}]
[{"$f":"'TGM Standardgewinde'!A4","v":0},{"$f":"'TGM Standardgewinde'!B4","v":"M4"},{"$f":"'TGM Standardgewinde'!C4","v":0},{"$f":"'TGM Standardgewinde'!E4","v":0},"J"]
[{"$f":"'TGM Standardgewinde'!A5","v":0},{"$f":"'TGM Standardgewinde'!B5","v":"M5"},{"$f":"'TGM Standardgewinde'!C5","v":0},{"$f":"'TGM Standardgewinde'!E5","v":0},"J"]
[{"$f":"'TGM Standardgewinde'!A6","v":0},{"$f":"'TGM Standardgewinde'!B6","v":"M6"},{"$f":"'TGM Standardgewinde'!C6","v":0},{"$f":"'TGM Standardgewinde'!E6","v":0},"J"]
[{"$f":"'TGM Standardgewinde'!A7","v":0},{"$f":"'TGM Standardgewinde'!B7","v":"M8"},{"$f":"'TGM Standardgewinde'!C7","v":0},{"$f":"'TGM Standardgewinde'!E7","v":0},"J"]
[{"$f":"'TGM Standardgewinde'!A8","v":0},{"$f":"'TGM Standardgewinde'!B8","v":"M10"},{"$f":"'TGM Standardgewinde'!C8","v":0},{"$f":"'TGM Standardgewinde'!E8","v":0},"J"]
[{"$f":"'TGM Standardgewinde'!A9","v":0},{"$f":"'TGM Standardgewinde'!B9","v":"M12"},{"$f":"'TGM Standardgewinde'!C9","v":0},{"$f":"'TGM Standardgewinde'!E9","v":0},"J"]
[{"$f":"'TGM Standardgewinde'!A10","v":0},{"$f":"'TGM Standardgewinde'!B10","v":"M14"},{"$f":"'TGM Standardgewinde'!C10","v":0},{"$f":"'TGM Standardgewinde'!E10","v":0},"J"]
[{"$f":"'TGM Standardgewinde'!A11","v":0},{"$f":"'TGM Standardgewinde'!B11","v":"M16"},{"$f":"'TGM Standardgewinde'!C11","v":0},{"$f":"'TGM Standardgewinde'!E11","v":0},"J"]
[{"$f":"'TGM Standardgewinde'!A12","v":0},{"$f":"'TGM Standardgewinde'!B12","v":"M18"},{"$f":"'TGM Standardgewinde'!C12","v":0},{"$f":"'TGM Standardgewinde'!E12","v":0},"J"]
[{"$f":"'TGM Standardgewinde'!A13","v":0},{"$f":"'TGM Standardgewinde'!B13","v":"M20"},{"$f":"'TGM Standardgewinde'!C13","v":0},{"$f":"'TGM Standardgewinde'!E13","v":0},"J"]
[{"$f":"'TGM Standardgewinde'!A14","v":0},{"$f":"'TGM Standardgewinde'!B14","v":"M22"},{"$f":"'TGM Standardgewinde'!C14","v":0},{"$f":"'TGM Standardgewinde'!E14","v":0},"J"]
[{"$f":"'TGM Standardgewinde'!A15","v":0},{"$f":"'TGM Standardgewinde'!B15","v":"M24"},{"$f":"'TGM Standardgewinde'!C15","v":0},{"$f":"'TGM Standardgewinde'!E15","v":0},"J"]
[{"$f":"'TGM Standardgewinde'!A16","v":0},{"$f":"'TGM Standardgewinde'!B16","v":"G1/8\""},{"$f":"'TGM Standardgewinde'!C16","v":0},{"$f":"'TGM Standardgewinde'!E16","v":0},"J"]
[{"$f":"'TGM Standardgewinde'!A17","v":0},{"$f":"'TGM Standardgewinde'!B17","v":"G1/4\""},{"$f":"'TGM Standardgewinde'!C17","v":0},{"$f":"'TGM Standardgewinde'!E17","v":0},"J"]
[{"$f":"'TGM Standardgewinde'!A18","v":0},{"$f":"'TGM Standardgewinde'!B18","v":"G1/2\""},{"$f":"'TGM Standardgewinde'!C18","v":0},{"$f":"'TGM Standardgewinde'!E18","v":0},"J"]
[{"$f":"'TGM Standardgewinde'!A19","v":0},{"$f":"'TGM Standardgewinde'!B19","v":"G3/4\""},{"$f":"'TGM Standardgewinde'!C19","v":0},{"$f":"'TGM Standardgewinde'!E19","v":0},"J"]
[{"$f":"'TGM Standardgewinde'!A20","v":0},{"$f":"'TGM Standardgewinde'!B20","v":"G1"},{"$f":"'TGM Standardgewinde'!C20","v":0},{"$f":"'TGM Standardgewinde'!E20","v":0},"J"]
[{"$f":"'TGM Standardgewinde'!A21","v":0},{"$f":"'TGM Standardgewinde'!B21","v":0},{"$f":"'TGM Standardgewinde'!C21","v":0},{"$f":"'TGM Standardgewinde'!E21","v":0},"J"]
[{"$f":"'TGM Standardgewinde'!A22","v":0},{"$f":"'TGM Standardgewinde'!B22","v":0},{"$f":"'TGM Standardgewinde'!C22","v":0},{"$f":"'TGM Standardgewinde'!E22","v":0},"J"]
[{"$f":"'TGM Standardgewinde'!A23","v":0},{"$f":"'TGM Standardgewinde'!B23","v":0},{"$f":"'TGM Standardgewinde'!C23","v":0},{"$f":"'TGM Standardgewinde'!E23","v":0},"J"]
[{"$f":"'TGM Standardgewinde'!A24","v":0},{"$f":"'TGM Standardgewinde'!B24","v":0},{"$f":"'TGM Standardgewinde'!C24","v":0},{"$f":"'TGM Standardgewinde'!E24","v":0},"J"]
[{"$f":"'TGM Standardgewinde'!A25","v":0},{"$f":"'TGM Standardgewinde'!B25","v":0},{"$f":"'TGM Standardgewinde'!C25","v":0},{"$f":"'TGM Standardgewinde'!E25","v":0},"J"]
[null,null,null,null,{"$f":"IF(B127=0,\"J\",\"N\")","v":"J"}]
[{"$f":"'TGM Bohren'!A2","v":"Grundzeitberechnung für das Bohren ohne Ausspanen"},null,null,null,{"$f":"IF(B154=0,\"J\",\"N\")","v":"J"}]
["Gesamtzeit in Minuten =",{"$f":"'TGM Bohren'!J3","v":0},null,null,{"$f":"IF(B154=0,\"J\",\"N\")","v":"J"}]
["Bemerkung","Dm der Bohrung und Tiefe","Menge ","Zeit",{"$f":"IF(B154=0,\"J\",\"N\")","v":"J"}]
[{"$f":"'TGM Bohren'!A4","v":0},{"$f":"IF(C156=0,0,CONCATENATE(\"Dm\",'TGM Bohren'!B4,\"/\",'TGM Bohren'!F4,\" tief\"))","v":0},{"$f":"'TGM Bohren'!C4","v":0},{"$f":"'TGM Bohren'!I4","v":0},{"$f":"IF(D156=0,\"J\",\"N\")","v":"J"}]
[{"$f":"'TGM Bohren'!A5","v":0},{"$f":"IF(C157=0,0,CONCATENATE(\"Dm\",'TGM Bohren'!B5,\"/\",'TGM Bohren'!F5,\" tief\"))","v":0},{"$f":"'TGM Bohren'!C5","v":0},{"$f":"'TGM Bohren'!I5","v":0},"J"]
[{"$f":"'TGM Bohren'!A6","v":0},{"$f":"IF(C158=0,0,CONCATENATE(\"Dm\",'TGM Bohren'!B6,\"/\",'TGM Bohren'!F6,\" tief\"))","v":0},{"$f":"'TGM Bohren'!C6","v":0},{"$f":"'TGM Bohren'!I6","v":0},"J"]
[{"$f":"'TGM Bohren'!A7","v":0},{"$f":"IF(C159=0,0,CONCATENATE(\"Dm\",'TGM Bohren'!B7,\"/\",'TGM Bohren'!F7,\" tief\"))","v":0},{"$f":"'TGM Bohren'!C7","v":0},{"$f":"'TGM Bohren'!I7","v":0},"J"]
[{"$f":"'TGM Bohren'!A8","v":0},{"$f":"IF(C160=0,0,CONCATENATE(\"Dm\",'TGM Bohren'!B8,\"/\",'TGM Bohren'!F8,\" tief\"))","v":0},{"$f":"'TGM Bohren'!C8","v":0},{"$f":"'TGM Bohren'!I8","v":0},"J"]
[{"$f":"'TGM Bohren'!A9","v":0},{"$f":"IF(C161=0,0,CONCATENATE(\"Dm\",'TGM Bohren'!B9,\"/\",'TGM Bohren'!F9,\" tief\"))","v":0},{"$f":"'TGM Bohren'!C9","v":0},{"$f":"'TGM Bohren'!I9","v":0},"J"]
[{"$f":"'TGM Bohren'!A10","v":0},{"$f":"IF(C162=0,0,CONCATENATE(\"Dm\",'TGM Bohren'!B10,\"/\",'TGM Bohren'!F10,\" tief\"))","v":0},{"$f":"'TGM Bohren'!C10","v":0},{"$f":"'TGM Bohren'!I10","v":0},"J"]
[{"$f":"'TGM Bohren'!A11","v":0},{"$f":"IF(C163=0,0,CONCATENATE(\"Dm\",'TGM Bohren'!B11,\"/\",'TGM Bohren'!F11,\" tief\"))","v":0},{"$f":"'TGM Bohren'!C11","v":0},{"$f":"'TGM Bohren'!I11","v":0},"J"]
[{"$f":"'TGM Bohren'!A12","v":0},{"$f":"IF(C164=0,0,CONCATENATE(\"Dm\",'TGM Bohren'!B12,\"/\",'TGM Bohren'!F12,\" tief\"))","v":0},{"$f":"'TGM Bohren'!C12","v":0},{"$f":"'TGM Bohren'!I12","v":0},"J"]
[{"$f":"'TGM Bohren'!A13","v":0},{"$f":"IF(C165=0,0,CONCATENATE(\"Dm\",'TGM Bohren'!B13,\"/\",'TGM Bohren'!F13,\" tief\"))","v":0},{"$f":"'TGM Bohren'!C13","v":0},{"$f":"'TGM Bohren'!I13","v":0},"J"]
[{"$f":"'TGM Bohren'!A14","v":0},{"$f":"IF(C166=0,0,CONCATENATE(\"Dm\",'TGM Bohren'!B14,\"/\",'TGM Bohren'!F14,\" tief\"))","v":0},{"$f":"'TGM Bohren'!C14","v":0},{"$f":"'TGM Bohren'!I14","v":0},"J"]
[{"$f":"'TGM Bohren'!A15","v":0},{"$f":"IF(C167=0,0,CONCATENATE(\"Dm\",'TGM Bohren'!B15,\"/\",'TGM Bohren'!F15,\" tief\"))","v":0},{"$f":"'TGM Bohren'!C15","v":0},{"$f":"'TGM Bohren'!I15","v":0},"J"]
[{"$f":"'TGM Bohren'!A16","v":0},{"$f":"IF(C168=0,0,CONCATENATE(\"Dm\",'TGM Bohren'!B16,\"/\",'TGM Bohren'!F16,\" tief\"))","v":0},{"$f":"'TGM Bohren'!C16","v":0},{"$f":"'TGM Bohren'!I16","v":0},"J"]
[{"$f":"'TGM Bohren'!A17","v":0},{"$f":"IF(C169=0,0,CONCATENATE(\"Dm\",'TGM Bohren'!B17,\"/\",'TGM Bohren'!F17,\" tief\"))","v":0},{"$f":"'TGM Bohren'!C17","v":0},{"$f":"'TGM Bohren'!I17","v":0},"J"]
[{"$f":"'TGM Bohren'!A18","v":0},{"$f":"IF(C170=0,0,CONCATENATE(\"Dm\",'TGM Bohren'!B18,\"/\",'TGM Bohren'!F18,\" tief\"))","v":0},{"$f":"'TGM Bohren'!C18","v":0},{"$f":"'TGM Bohren'!I18","v":0},"J"]
[{"$f":"'TGM Bohren'!A19","v":0},{"$f":"IF(C171=0,0,CONCATENATE(\"Dm\",'TGM Bohren'!B19,\"/\",'TGM Bohren'!F19,\" tief\"))","v":0},{"$f":"'TGM Bohren'!C19","v":0},{"$f":"'TGM Bohren'!I19","v":0},"J"]
[{"$f":"'TGM Bohren'!A20","v":0},{"$f":"IF(C172=0,0,CONCATENATE(\"Dm\",'TGM Bohren'!B20,\"/\",'TGM Bohren'!F20,\" tief\"))","v":0},{"$f":"'TGM Bohren'!C20","v":0},{"$f":"'TGM Bohren'!I20","v":0},"J"]
[{"$f":"'TGM Bohren'!A21","v":0},{"$f":"IF(C173=0,0,CONCATENATE(\"Dm\",'TGM Bohren'!B21,\"/\",'TGM Bohren'!F21,\" tief\"))","v":0},{"$f":"'TGM Bohren'!C21","v":0},{"$f":"'TGM Bohren'!I21","v":0},"J"]
[{"$f":"'TGM Bohren'!A22","v":0},{"$f":"IF(C174=0,0,CONCATENATE(\"Dm\",'TGM Bohren'!B22,\"/\",'TGM Bohren'!F22,\" tief\"))","v":0},{"$f":"'TGM Bohren'!C22","v":0},{"$f":"'TGM Bohren'!I22","v":0},"J"]
[{"$f":"'TGM Bohren'!A23","v":0},{"$f":"IF(C175=0,0,CONCATENATE(\"Dm\",'TGM Bohren'!B23,\"/\",'TGM Bohren'!F23,\" tief\"))","v":0},{"$f":"'TGM Bohren'!C23","v":0},{"$f":"'TGM Bohren'!I23","v":0},"J"]
[{"$f":"'TGM Bohren'!A24","v":0},{"$f":"IF(C176=0,0,CONCATENATE(\"Dm\",'TGM Bohren'!B24,\"/\",'TGM Bohren'!F24,\" tief\"))","v":0},{"$f":"'TGM Bohren'!C24","v":0},{"$f":"'TGM Bohren'!I24","v":0},"J"]
[{"$f":"'TGM Bohren'!A25","v":0},{"$f":"IF(C177=0,0,CONCATENATE(\"Dm\",'TGM Bohren'!B25,\"/\",'TGM Bohren'!F25,\" tief\"))","v":0},{"$f":"'TGM Bohren'!C25","v":0},{"$f":"'TGM Bohren'!I25","v":0},"J"]
[{"$f":"'TGM Bohren'!A26","v":0},{"$f":"IF(C178=0,0,CONCATENATE(\"Dm\",'TGM Bohren'!B26,\"/\",'TGM Bohren'!F26,\" tief\"))","v":0},{"$f":"'TGM Bohren'!C26","v":0},{"$f":"'TGM Bohren'!I26","v":0},"J"]
[null,null,null,null,{"$f":"IF(B154=0,\"J\",\"N\")","v":"J"}]
[{"$f":"' Tiefbohren mehrere Arten'!C1","v":"Berechnungstabelle für die Bearbeitungsdauer beim Tiefbohren mit Ausspanung"},null,null,null,{"$f":"IF(B181=0,\"J\",\"N\")","v":"J"}]
["Gesamtzeit in Minuten =",{"$f":"' Tiefbohren mehrere Arten'!E2","v":0},null,null,{"$f":"IF(B181=0,\"J\",\"N\")","v":"J"}]
["Bemerkung","Bohrtiefe","Menge ","Zeit",{"$f":"IF(B181=0,\"J\",\"N\")","v":"J"}]
[{"$f":"' Tiefbohren mehrere Arten'!B5","v":0},{"$f":"' Tiefbohren mehrere Arten'!G5","v":0},{"$f":"' Tiefbohren mehrere Arten'!C5","v":0},{"$f":"' Tiefbohren mehrere Arten'!K5","v":0},{"$f":"IF(D183=0,\"J\",\"N\")","v":"J"}]
[{"$f":"' Tiefbohren mehrere Arten'!B6","v":0},{"$f":"' Tiefbohren mehrere Arten'!G6","v":0},{"$f":"' Tiefbohren mehrere Arten'!C6","v":0},{"$f":"' Tiefbohren mehrere Arten'!K6","v":0},"J"]
[{"$f":"' Tiefbohren mehrere Arten'!B7","v":0},{"$f":"' Tiefbohren mehrere Arten'!G7","v":0},{"$f":"' Tiefbohren mehrere Arten'!C7","v":0},{"$f":"' Tiefbohren mehrere Arten'!K7","v":0},"J"]
[{"$f":"' Tiefbohren mehrere Arten'!B8","v":0},{"$f":"' Tiefbohren mehrere Arten'!G8","v":0},{"$f":"' Tiefbohren mehrere Arten'!C8","v":0},{"$f":"' Tiefbohren mehrere Arten'!K8","v":0},"J"]
[{"$f":"' Tiefbohren mehrere Arten'!B9","v":0},{"$f":"' Tiefbohren mehrere Arten'!G9","v":0},{"$f":"' Tiefbohren mehrere Arten'!C9","v":0},{"$f":"' Tiefbohren mehrere Arten'!K9","v":0},"J"]
[{"$f":"' Tiefbohren mehrere Arten'!B10","v":0},{"$f":"' Tiefbohren mehrere Arten'!G10","v":0},{"$f":"' Tiefbohren mehrere Arten'!C10","v":0},{"$f":"' Tiefbohren mehrere Arten'!K10","v":0},"J"]
[{"$f":"' Tiefbohren mehrere Arten'!B11","v":0},{"$f":"' Tiefbohren mehrere Arten'!G11","v":0},{"$f":"' Tiefbohren mehrere Arten'!C11","v":0},{"$f":"' Tiefbohren mehrere Arten'!K11","v":0},"J"]
[{"$f":"' Tiefbohren mehrere Arten'!B12","v":0},{"$f":"' Tiefbohren mehrere Arten'!G12","v":0},{"$f":"' Tiefbohren mehrere Arten'!C12","v":0},{"$f":"' Tiefbohren mehrere Arten'!K12","v":0},"J"]
[{"$f":"' Tiefbohren mehrere Arten'!B13","v":0},{"$f":"' Tiefbohren mehrere Arten'!G13","v":0},{"$f":"' Tiefbohren mehrere Arten'!C13","v":0},{"$f":"' Tiefbohren mehrere Arten'!K13","v":0},"J"]
[{"$f":"' Tiefbohren mehrere Arten'!B14","v":0},{"$f":"' Tiefbohren mehrere Arten'!G14","v":0},{"$f":"' Tiefbohren mehrere Arten'!C14","v":0},{"$f":"' Tiefbohren mehrere Arten'!K14","v":0},"J"]
[{"$f":"' Tiefbohren mehrere Arten'!B15","v":0},{"$f":"' Tiefbohren mehrere Arten'!G15","v":0},{"$f":"' Tiefbohren mehrere Arten'!C15","v":0},{"$f":"' Tiefbohren mehrere Arten'!K15","v":0},"J"]
[{"$f":"' Tiefbohren mehrere Arten'!B16","v":0},{"$f":"' Tiefbohren mehrere Arten'!G16","v":0},{"$f":"' Tiefbohren mehrere Arten'!C16","v":0},{"$f":"' Tiefbohren mehrere Arten'!K16","v":0},"J"]
[{"$f":"' Tiefbohren mehrere Arten'!B17","v":0},{"$f":"' Tiefbohren mehrere Arten'!G17","v":0},{"$f":"' Tiefbohren mehrere Arten'!C17","v":0},{"$f":"' Tiefbohren mehrere Arten'!K17","v":0},"J"]
[{"$f":"' Tiefbohren mehrere Arten'!B18","v":0},{"$f":"' Tiefbohren mehrere Arten'!G18","v":0},{"$f":"' Tiefbohren mehrere Arten'!C18","v":0},{"$f":"' Tiefbohren mehrere Arten'!K18","v":0},"J"]
[{"$f":"' Tiefbohren mehrere Arten'!B19","v":0},{"$f":"' Tiefbohren mehrere Arten'!G19","v":0},{"$f":"' Tiefbohren mehrere Arten'!C19","v":0},{"$f":"' Tiefbohren mehrere Arten'!K19","v":0},"J"]
[{"$f":"' Tiefbohren mehrere Arten'!B20","v":0},{"$f":"' Tiefbohren mehrere Arten'!G20","v":0},{"$f":"' Tiefbohren mehrere Arten'!C20","v":0},{"$f":"' Tiefbohren mehrere Arten'!K20","v":0},"J"]
[{"$f":"' Tiefbohren mehrere Arten'!B21","v":0},{"$f":"' Tiefbohren mehrere Arten'!G21","v":0},{"$f":"' Tiefbohren mehrere Arten'!C21","v":0},{"$f":"' Tiefbohren mehrere Arten'!K21","v":0},"J"]
[{"$f":"' Tiefbohren mehrere Arten'!B22","v":0},{"$f":"' Tiefbohren mehrere Arten'!G22","v":0},{"$f":"' Tiefbohren mehrere Arten'!C22","v":0},{"$f":"' Tiefbohren mehrere Arten'!K22","v":0},"J"]
[{"$f":"' Tiefbohren mehrere Arten'!B23","v":0},{"$f":"' Tiefbohren mehrere Arten'!G23","v":0},{"$f":"' Tiefbohren mehrere Arten'!C23","v":0},{"$f":"' Tiefbohren mehrere Arten'!K23","v":0},"J"]
[{"$f":"' Tiefbohren mehrere Arten'!B24","v":0},{"$f":"' Tiefbohren mehrere Arten'!G24","v":0},{"$f":"' Tiefbohren mehrere Arten'!C24","v":0},{"$f":"' Tiefbohren mehrere Arten'!K24","v":0},"J"]
[{"$f":"' Tiefbohren mehrere Arten'!B25","v":0},{"$f":"' Tiefbohren mehrere Arten'!G25","v":0},{"$f":"' Tiefbohren mehrere Arten'!C25","v":0},{"$f":"' Tiefbohren mehrere Arten'!K25","v":0},"J"]
[{"$f":"' Tiefbohren mehrere Arten'!B26","v":0},{"$f":"' Tiefbohren mehrere Arten'!G26","v":0},{"$f":"' Tiefbohren mehrere Arten'!C26","v":0},{"$f":"' Tiefbohren mehrere Arten'!K26","v":0},"J"]
[{"$f":"' Tiefbohren mehrere Arten'!B27","v":0},{"$f":"' Tiefbohren mehrere Arten'!G27","v":0},{"$f":"' Tiefbohren mehrere Arten'!C27","v":0},{"$f":"' Tiefbohren mehrere Arten'!K27","v":0},"J"]
[{"$f":"' Tiefbohren mehrere Arten'!B28","v":0},{"$f":"' Tiefbohren mehrere Arten'!G28","v":0},{"$f":"' Tiefbohren mehrere Arten'!C28","v":0},{"$f":"' Tiefbohren mehrere Arten'!K28","v":0},"J"]
[{"$f":"' Tiefbohren mehrere Arten'!B29","v":0},{"$f":"' Tiefbohren mehrere Arten'!G29","v":0},{"$f":"' Tiefbohren mehrere Arten'!C29","v":0},{"$f":"' Tiefbohren mehrere Arten'!K29","v":0},"J"]
[{"$f":"' Tiefbohren mehrere Arten'!B30","v":0},{"$f":"' Tiefbohren mehrere Arten'!G30","v":0},{"$f":"' Tiefbohren mehrere Arten'!C30","v":0},{"$f":"' Tiefbohren mehrere Arten'!K30","v":0},"J"]
[{"$f":"' Tiefbohren mehrere Arten'!B31","v":0},{"$f":"' Tiefbohren mehrere Arten'!G31","v":0},{"$f":"' Tiefbohren mehrere Arten'!C31","v":0},{"$f":"' Tiefbohren mehrere Arten'!K31","v":0},"J"]
[{"$f":"' Tiefbohren mehrere Arten'!B32","v":0},{"$f":"' Tiefbohren mehrere Arten'!G32","v":0},{"$f":"' Tiefbohren mehrere Arten'!C32","v":0},{"$f":"' Tiefbohren mehrere Arten'!K32","v":0},"J"]
[{"$f":"' Tiefbohren mehrere Arten'!B33","v":0},{"$f":"' Tiefbohren mehrere Arten'!G33","v":0},{"$f":"' Tiefbohren mehrere Arten'!C33","v":0},{"$f":"' Tiefbohren mehrere Arten'!K33","v":0},"J"]
[{"$f":"' Tiefbohren mehrere Arten'!B34","v":0},{"$f":"' Tiefbohren mehrere Arten'!G34","v":0},{"$f":"' Tiefbohren mehrere Arten'!C34","v":0},{"$f":"' Tiefbohren mehrere Arten'!K34","v":0},"J"]
[{"$f":"' Tiefbohren mehrere Arten'!B35","v":0},{"$f":"' Tiefbohren mehrere Arten'!G35","v":0},{"$f":"' Tiefbohren mehrere Arten'!C35","v":0},{"$f":"' Tiefbohren mehrere Arten'!K35","v":0},"J"]
[{"$f":"' Tiefbohren mehrere Arten'!B36","v":0},{"$f":"' Tiefbohren mehrere Arten'!G36","v":0},{"$f":"' Tiefbohren mehrere Arten'!C36","v":0},{"$f":"' Tiefbohren mehrere Arten'!K36","v":0},"J"]
[{"$f":"' Tiefbohren mehrere Arten'!B37","v":0},{"$f":"' Tiefbohren mehrere Arten'!G37","v":0},{"$f":"' Tiefbohren mehrere Arten'!C37","v":0},{"$f":"' Tiefbohren mehrere Arten'!K37","v":0},"J"]
[{"$f":"' Tiefbohren mehrere Arten'!B38","v":0},{"$f":"' Tiefbohren mehrere Arten'!G38","v":0},{"$f":"' Tiefbohren mehrere Arten'!C38","v":0},{"$f":"' Tiefbohren mehrere Arten'!K38","v":0},"J"]
[{"$f":"' Tiefbohren mehrere Arten'!B39","v":0},{"$f":"' Tiefbohren mehrere Arten'!G39","v":0},{"$f":"' Tiefbohren mehrere Arten'!C39","v":0},{"$f":"' Tiefbohren mehrere Arten'!K39","v":0},"J"]
[{"$f":"' Tiefbohren mehrere Arten'!B40","v":0},{"$f":"' Tiefbohren mehrere Arten'!G40","v":0},{"$f":"' Tiefbohren mehrere Arten'!C40","v":0},{"$f":"' Tiefbohren mehrere Arten'!K40","v":0},"J"]
[{"$f":"' Tiefbohren mehrere Arten'!B41","v":0},{"$f":"' Tiefbohren mehrere Arten'!G41","v":0},{"$f":"' Tiefbohren mehrere Arten'!C41","v":0},{"$f":"' Tiefbohren mehrere Arten'!K41","v":0},"J"]
[{"$f":"' Tiefbohren mehrere Arten'!B42","v":0},{"$f":"' Tiefbohren mehrere Arten'!G42","v":0},{"$f":"' Tiefbohren mehrere Arten'!C42","v":0},{"$f":"' Tiefbohren mehrere Arten'!K42","v":0},"J"]
[{"$f":"' Tiefbohren mehrere Arten'!B43","v":0},{"$f":"' Tiefbohren mehrere Arten'!G43","v":0},{"$f":"' Tiefbohren mehrere Arten'!C43","v":0},{"$f":"' Tiefbohren mehrere Arten'!K43","v":0},"J"]
[{"$f":"' Tiefbohren mehrere Arten'!B44","v":0},{"$f":"' Tiefbohren mehrere Arten'!G44","v":0},{"$f":"' Tiefbohren mehrere Arten'!C44","v":0},{"$f":"' Tiefbohren mehrere Arten'!K44","v":0},"J"]
[null,null,null,null,{"$f":"IF(B181=0,\"J\",\"N\")","v":"J"}]
[{"$f":"'TGM Rundschleifen'!B1","v":"Berechnungstabelle für die Bearbeitungsdauer beim Rundschleifen"},null,null,null,{"$f":"IF(B225=0,\"J\",\"N\")","v":"J"}]
["Gesamtzeit in Minuten =",{"$f":"'TGM Rundschleifen'!D2","v":0},null,null,{"$f":"IF(B225=0,\"J\",\"N\")","v":"J"}]
["Bemerkung","Schleifweg in mm","Anzahl der Schnitte","Zeit",{"$f":"IF(B225=0,\"J\",\"N\")","v":"J"}]
[{"$f":"'TGM Rundschleifen'!L6","v":0},{"$f":"'TGM Rundschleifen'!O6","v":0},{"$f":"'TGM Rundschleifen'!M6","v":0},{"$f":"'TGM Rundschleifen'!P6","v":0},{"$f":"IF(D227=0,\"J\",\"N\")","v":"J"}]
[{"$f":"'TGM Rundschleifen'!L7","v":0},{"$f":"'TGM Rundschleifen'!O7","v":0},{"$f":"'TGM Rundschleifen'!M7","v":0},{"$f":"'TGM Rundschleifen'!P7","v":0},"J"]
[{"$f":"'TGM Rundschleifen'!L8","v":0},{"$f":"'TGM Rundschleifen'!O8","v":0},{"$f":"'TGM Rundschleifen'!M8","v":0},{"$f":"'TGM Rundschleifen'!P8","v":0},"J"]
[{"$f":"'TGM Rundschleifen'!L9","v":0},{"$f":"'TGM Rundschleifen'!O9","v":0},{"$f":"'TGM Rundschleifen'!M9","v":0},{"$f":"'TGM Rundschleifen'!P9","v":0},"J"]
[{"$f":"'TGM Rundschleifen'!L10","v":0},{"$f":"'TGM Rundschleifen'!O10","v":0},{"$f":"'TGM Rundschleifen'!M10","v":0},{"$f":"'TGM Rundschleifen'!P10","v":0},"J"]
[{"$f":"'TGM Rundschleifen'!L11","v":0},{"$f":"'TGM Rundschleifen'!O11","v":0},{"$f":"'TGM Rundschleifen'!M11","v":0},{"$f":"'TGM Rundschleifen'!P11","v":0},"J"]
[{"$f":"'TGM Rundschleifen'!L12","v":0},{"$f":"'TGM Rundschleifen'!O12","v":0},{"$f":"'TGM Rundschleifen'!M12","v":0},{"$f":"'TGM Rundschleifen'!P12","v":0},"J"]
[{"$f":"'TGM Rundschleifen'!L13","v":0},{"$f":"'TGM Rundschleifen'!O13","v":0},{"$f":"'TGM Rundschleifen'!M13","v":0},{"$f":"'TGM Rundschleifen'!P13","v":0},"J"]
[{"$f":"'TGM Rundschleifen'!L14","v":0},{"$f":"'TGM Rundschleifen'!O14","v":0},{"$f":"'TGM Rundschleifen'!M14","v":0},{"$f":"'TGM Rundschleifen'!P14","v":0},"J"]
[{"$f":"'TGM Rundschleifen'!L15","v":0},{"$f":"'TGM Rundschleifen'!O15","v":0},{"$f":"'TGM Rundschleifen'!M15","v":0},{"$f":"'TGM Rundschleifen'!P15","v":0},"J"]
[{"$f":"'TGM Rundschleifen'!L16","v":0},{"$f":"'TGM Rundschleifen'!O16","v":0},{"$f":"'TGM Rundschleifen'!M16","v":0},{"$f":"'TGM Rundschleifen'!P16","v":0},"J"]
[{"$f":"'TGM Rundschleifen'!L17","v":0},{"$f":"'TGM Rundschleifen'!O17","v":0},{"$f":"'TGM Rundschleifen'!M17","v":0},{"$f":"'TGM Rundschleifen'!P17","v":0},"J"]
[{"$f":"'TGM Rundschleifen'!L18","v":0},{"$f":"'TGM Rundschleifen'!O18","v":0},{"$f":"'TGM Rundschleifen'!M18","v":0},{"$f":"'TGM Rundschleifen'!P18","v":0},"J"]
[{"$f":"'TGM Rundschleifen'!L19","v":0},{"$f":"'TGM Rundschleifen'!O19","v":0},{"$f":"'TGM Rundschleifen'!M19","v":0},{"$f":"'TGM Rundschleifen'!P19","v":0},"J"]
[{"$f":"'TGM Rundschleifen'!L20","v":0},{"$f":"'TGM Rundschleifen'!O20","v":0},{"$f":"'TGM Rundschleifen'!M20","v":0},{"$f":"'TGM Rundschleifen'!P20","v":0},"J"]
[{"$f":"'TGM Rundschleifen'!L21","v":0},{"$f":"'TGM Rundschleifen'!O21","v":0},{"$f":"'TGM Rundschleifen'!M21","v":0},{"$f":"'TGM Rundschleifen'!P21","v":0},"J"]
[{"$f":"'TGM Rundschleifen'!L22","v":0},{"$f":"'TGM Rundschleifen'!O22","v":0},{"$f":"'TGM Rundschleifen'!M22","v":0},{"$f":"'TGM Rundschleifen'!P22","v":0},"J"]
[{"$f":"'TGM Rundschleifen'!L23","v":0},{"$f":"'TGM Rundschleifen'!O23","v":0},{"$f":"'TGM Rundschleifen'!M23","v":0},{"$f":"'TGM Rundschleifen'!P23","v":0},"J"]
[{"$f":"'TGM Rundschleifen'!L24","v":0},{"$f":"'TGM Rundschleifen'!O24","v":0},{"$f":"'TGM Rundschleifen'!M24","v":0},{"$f":"'TGM Rundschleifen'!P24","v":0},"J"]
[{"$f":"'TGM Rundschleifen'!L25","v":0},{"$f":"'TGM Rundschleifen'!O25","v":0},{"$f":"'TGM Rundschleifen'!M25","v":0},{"$f":"'TGM Rundschleifen'!P25","v":0},"J"]
[{"$f":"'TGM Rundschleifen'!L26","v":0},{"$f":"'TGM Rundschleifen'!O26","v":0},{"$f":"'TGM Rundschleifen'!M26","v":0},{"$f":"'TGM Rundschleifen'!P26","v":0},"J"]
[{"$f":"'TGM Rundschleifen'!L27","v":0},{"$f":"'TGM Rundschleifen'!O27","v":0},{"$f":"'TGM Rundschleifen'!M27","v":0},{"$f":"'TGM Rundschleifen'!P27","v":0},"J"]
[{"$f":"'TGM Rundschleifen'!L28","v":0},{"$f":"'TGM Rundschleifen'!O28","v":0},{"$f":"'TGM Rundschleifen'!M28","v":0},{"$f":"'TGM Rundschleifen'!P28","v":0},"J"]
[{"$f":"'TGM Rundschleifen'!L29","v":0},{"$f":"'TGM Rundschleifen'!O29","v":0},{"$f":"'TGM Rundschleifen'!M29","v":0},{"$f":"'TGM Rundschleifen'!P29","v":0},"J"]
[{"$f":"'TGM Rundschleifen'!L30","v":0},{"$f":"'TGM Rundschleifen'!O30","v":0},{"$f":"'TGM Rundschleifen'!M30","v":0},{"$f":"'TGM Rundschleifen'!P30","v":0},"J"]
[{"$f":"'TGM Rundschleifen'!L31","v":0},{"$f":"'TGM Rundschleifen'!O31","v":0},{"$f":"'TGM Rundschleifen'!M31","v":0},{"$f":"'TGM Rundschleifen'!P31","v":0},"J"]
[{"$f":"'TGM Rundschleifen'!L32","v":0},{"$f":"'TGM Rundschleifen'!O32","v":0},{"$f":"'TGM Rundschleifen'!M32","v":0},{"$f":"'TGM Rundschleifen'!P32","v":0},"J"]
[{"$f":"'TGM Rundschleifen'!L33","v":0},{"$f":"'TGM Rundschleifen'!O33","v":0},{"$f":"'TGM Rundschleifen'!M33","v":0},{"$f":"'TGM Rundschleifen'!P33","v":0},"J"]
[{"$f":"'TGM Rundschleifen'!L34","v":0},{"$f":"'TGM Rundschleifen'!O34","v":0},{"$f":"'TGM Rundschleifen'!M34","v":0},{"$f":"'TGM Rundschleifen'!P34","v":0},"J"]
[{"$f":"'TGM Rundschleifen'!L35","v":0},{"$f":"'TGM Rundschleifen'!O35","v":0},{"$f":"'TGM Rundschleifen'!M35","v":0},{"$f":"'TGM Rundschleifen'!P35","v":0},"J"]
[{"$f":"'TGM Rundschleifen'!L36","v":0},{"$f":"'TGM Rundschleifen'!O36","v":0},{"$f":"'TGM Rundschleifen'!M36","v":0},{"$f":"'TGM Rundschleifen'!P36","v":0},"J"]
[{"$f":"'TGM Rundschleifen'!L37","v":0},{"$f":"'TGM Rundschleifen'!O37","v":0},{"$f":"'TGM Rundschleifen'!M37","v":0},{"$f":"'TGM Rundschleifen'!P37","v":0},"J"]
[{"$f":"'TGM Rundschleifen'!L38","v":0},{"$f":"'TGM Rundschleifen'!O38","v":0},{"$f":"'TGM Rundschleifen'!M38","v":0},{"$f":"'TGM Rundschleifen'!P38","v":0},"J"]
[{"$f":"'TGM Rundschleifen'!L39","v":0},{"$f":"'TGM Rundschleifen'!O39","v":0},{"$f":"'TGM Rundschleifen'!M39","v":0},{"$f":"'TGM Rundschleifen'!P39","v":0},"J"]
[{"$f":"'TGM Rundschleifen'!L40","v":0},{"$f":"'TGM Rundschleifen'!O40","v":0},{"$f":"'TGM Rundschleifen'!M40","v":0},{"$f":"'TGM Rundschleifen'!P40","v":0},"J"]
[{"$f":"'TGM Rundschleifen'!L41","v":0},{"$f":"'TGM Rundschleifen'!O41","v":0},{"$f":"'TGM Rundschleifen'!M41","v":0},{"$f":"'TGM Rundschleifen'!P41","v":0},"J"]
[{"$f":"'TGM Rundschleifen'!L42","v":0},{"$f":"'TGM Rundschleifen'!O42","v":0},{"$f":"'TGM Rundschleifen'!M42","v":0},{"$f":"'TGM Rundschleifen'!P42","v":0},"J"]
[{"$f":"'TGM Rundschleifen'!L43","v":0},{"$f":"'TGM Rundschleifen'!O43","v":0},{"$f":"'TGM Rundschleifen'!M43","v":0},{"$f":"'TGM Rundschleifen'!P43","v":0},"J"]
[{"$f":"'TGM Rundschleifen'!L44","v":0},{"$f":"'TGM Rundschleifen'!O44","v":0},{"$f":"'TGM Rundschleifen'!M44","v":0},{"$f":"'TGM Rundschleifen'!P44","v":0},"J"]
[{"$f":"'TGM Rundschleifen'!L45","v":0},{"$f":"'TGM Rundschleifen'!O45","v":0},{"$f":"'TGM Rundschleifen'!M45","v":0},{"$f":"'TGM Rundschleifen'!P45","v":0},"J"]
[null,null,null,null,{"$f":"IF(B225=0,\"J\",\"N\")","v":"J"}]
[{"$f":"'TGM Plandrehen'!A1","v":"Schnittzeitberechnung Plandrehen"},null,null,null,{"$f":"IF(B269=0,\"J\",\"N\")","v":"J"}]
["Gesamtzeit in Minuten =",{"$f":"'TGM Plandrehen'!K1","v":0},null,null,{"$f":"IF(B269=0,\"J\",\"N\")","v":"J"}]
["Bemerkung","Planweg vom Anfags-Dm","Anzahl der Schnitte","Zeit",{"$f":"IF(B269=0,\"J\",\"N\")","v":"J"}]
[{"$f":"'TGM Plandrehen'!A15","v":0},{"$f":"IF(C271=0,0,CONCATENATE(\"vom außen Dm\",'TGM Plandrehen'!C15,\" / \",('TGM Plandrehen'!C15-'TGM Plandrehen'!D15)/2,\" tief planen\"))","v":0},{"$f":"'TGM Plandrehen'!E15","v":0},{"$f":"'TGM Plandrehen'!J15","v":0},{"$f":"IF(D271=0,\"J\",\"N\")","v":"J"}]
[{"$f":"'TGM Plandrehen'!A16","v":0},{"$f":"IF(C272=0,0,CONCATENATE(\"vom außen Dm\",'TGM Plandrehen'!C16,\" / \",('TGM Plandrehen'!C16-'TGM Plandrehen'!D16)/2,\" tief planen\"))","v":0},{"$f":"'TGM Plandrehen'!E16","v":0},{"$f":"'TGM Plandrehen'!J16","v":0},"J"]
[{"$f":"'TGM Plandrehen'!A17","v":0},{"$f":"IF(C273=0,0,CONCATENATE(\"vom außen Dm\",'TGM Plandrehen'!C17,\" / \",('TGM Plandrehen'!C17-'TGM Plandrehen'!D17)/2,\" tief planen\"))","v":0},{"$f":"'TGM Plandrehen'!E17","v":0},{"$f":"'TGM Plandrehen'!J17","v":0},"J"]
[{"$f":"'TGM Plandrehen'!A18","v":0},{"$f":"IF(C274=0,0,CONCATENATE(\"vom außen Dm\",'TGM Plandrehen'!C18,\" / \",('TGM Plandrehen'!C18-'TGM Plandrehen'!D18)/2,\" tief planen\"))","v":0},{"$f":"'TGM Plandrehen'!E18","v":0},{"$f":"'TGM Plandrehen'!J18","v":0},"J"]
[{"$f":"'TGM Plandrehen'!A19","v":0},{"$f":"IF(C275=0,0,CONCATENATE(\"vom außen Dm\",'TGM Plandrehen'!C19,\" / \",('TGM Plandrehen'!C19-'TGM Plandrehen'!D19)/2,\" tief planen\"))","v":0},{"$f":"'TGM Plandrehen'!E19","v":0},{"$f":"'TGM Plandrehen'!J19","v":0},"J"]
[{"$f":"'TGM Plandrehen'!A20","v":0},{"$f":"IF(C276=0,0,CONCATENATE(\"vom außen Dm\",'TGM Plandrehen'!C20,\" / \",('TGM Plandrehen'!C20-'TGM Plandrehen'!D20)/2,\" tief planen\"))","v":0},{"$f":"'TGM Plandrehen'!E20","v":0},{"$f":"'TGM Plandrehen'!J20","v":0},"J"]
[{"$f":"'TGM Plandrehen'!A21","v":0},{"$f":"IF(C277=0,0,CONCATENATE(\"vom außen Dm\",'TGM Plandrehen'!C21,\" / \",('TGM Plandrehen'!C21-'TGM Plandrehen'!D21)/2,\" tief planen\"))","v":0},{"$f":"'TGM Plandrehen'!E21","v":0},{"$f":"'TGM Plandrehen'!J21","v":0},"J"]
[{"$f":"'TGM Plandrehen'!A22","v":0},{"$f":"IF(C278=0,0,CONCATENATE(\"vom außen Dm\",'TGM Plandrehen'!C22,\" / \",('TGM Plandrehen'!C22-'TGM Plandrehen'!D22)/2,\" tief planen\"))","v":0},{"$f":"'TGM Plandrehen'!E22","v":0},{"$f":"'TGM Plandrehen'!J22","v":0},"J"]
[{"$f":"'TGM Plandrehen'!A23","v":0},{"$f":"IF(C279=0,0,CONCATENATE(\"vom außen Dm\",'TGM Plandrehen'!C23,\" / \",('TGM Plandrehen'!C23-'TGM Plandrehen'!D23)/2,\" tief planen\"))","v":0},{"$f":"'TGM Plandrehen'!E23","v":0},{"$f":"'TGM Plandrehen'!J23","v":0},"J"]
[{"$f":"'TGM Plandrehen'!A24","v":0},{"$f":"IF(C280=0,0,CONCATENATE(\"vom außen Dm\",'TGM Plandrehen'!C24,\" / \",('TGM Plandrehen'!C24-'TGM Plandrehen'!D24)/2,\" tief planen\"))","v":0},{"$f":"'TGM Plandrehen'!E24","v":0},{"$f":"'TGM Plandrehen'!J24","v":0},"J"]
[{"$f":"'TGM Plandrehen'!A25","v":0},{"$f":"IF(C281=0,0,CONCATENATE(\"vom außen Dm\",'TGM Plandrehen'!C25,\" / \",('TGM Plandrehen'!C25-'TGM Plandrehen'!D25)/2,\" tief planen\"))","v":0},{"$f":"'TGM Plandrehen'!E25","v":0},{"$f":"'TGM Plandrehen'!J25","v":0},"J"]
[{"$f":"'TGM Plandrehen'!A26","v":0},{"$f":"IF(C282=0,0,CONCATENATE(\"vom außen Dm\",'TGM Plandrehen'!C26,\" / \",('TGM Plandrehen'!C26-'TGM Plandrehen'!D26)/2,\" tief planen\"))","v":0},{"$f":"'TGM Plandrehen'!E26","v":0},{"$f":"'TGM Plandrehen'!J26","v":0},"J"]
[{"$f":"'TGM Plandrehen'!A27","v":0},{"$f":"IF(C283=0,0,CONCATENATE(\"vom außen Dm\",'TGM Plandrehen'!C27,\" / \",('TGM Plandrehen'!C27-'TGM Plandrehen'!D27)/2,\" tief planen\"))","v":0},{"$f":"'TGM Plandrehen'!E27","v":0},{"$f":"'TGM Plandrehen'!J27","v":0},"J"]
[{"$f":"'TGM Plandrehen'!A28","v":0},{"$f":"IF(C284=0,0,CONCATENATE(\"vom außen Dm\",'TGM Plandrehen'!C28,\" / \",('TGM Plandrehen'!C28-'TGM Plandrehen'!D28)/2,\" tief planen\"))","v":0},{"$f":"'TGM Plandrehen'!E28","v":0},{"$f":"'TGM Plandrehen'!J28","v":0},"J"]
[{"$f":"'TGM Plandrehen'!A29","v":0},{"$f":"IF(C285=0,0,CONCATENATE(\"vom außen Dm\",'TGM Plandrehen'!C29,\" / \",('TGM Plandrehen'!C29-'TGM Plandrehen'!D29)/2,\" tief planen\"))","v":0},{"$f":"'TGM Plandrehen'!E29","v":0},{"$f":"'TGM Plandrehen'!J29","v":0},"J"]
[{"$f":"'TGM Plandrehen'!A30","v":0},{"$f":"IF(C286=0,0,CONCATENATE(\"vom außen Dm\",'TGM Plandrehen'!C30,\" / \",('TGM Plandrehen'!C30-'TGM Plandrehen'!D30)/2,\" tief planen\"))","v":0},{"$f":"'TGM Plandrehen'!E30","v":0},{"$f":"'TGM Plandrehen'!J30","v":0},"J"]
[{"$f":"'TGM Plandrehen'!A31","v":0},{"$f":"IF(C287=0,0,CONCATENATE(\"vom außen Dm\",'TGM Plandrehen'!C31,\" / \",('TGM Plandrehen'!C31-'TGM Plandrehen'!D31)/2,\" tief planen\"))","v":0},{"$f":"'TGM Plandrehen'!E31","v":0},{"$f":"'TGM Plandrehen'!J31","v":0},"J"]
[{"$f":"'TGM Plandrehen'!A32","v":0},{"$f":"IF(C288=0,0,CONCATENATE(\"vom außen Dm\",'TGM Plandrehen'!C32,\" / \",('TGM Plandrehen'!C32-'TGM Plandrehen'!D32)/2,\" tief planen\"))","v":0},{"$f":"'TGM Plandrehen'!E32","v":0},{"$f":"'TGM Plandrehen'!J32","v":0},"J"]
[{"$f":"'TGM Plandrehen'!A33","v":0},{"$f":"IF(C289=0,0,CONCATENATE(\"vom außen Dm\",'TGM Plandrehen'!C33,\" / \",('TGM Plandrehen'!C33-'TGM Plandrehen'!D33)/2,\" tief planen\"))","v":0},{"$f":"'TGM Plandrehen'!E33","v":0},{"$f":"'TGM Plandrehen'!J33","v":0},"J"]
[{"$f":"'TGM Plandrehen'!A34","v":0},{"$f":"IF(C290=0,0,CONCATENATE(\"vom außen Dm\",'TGM Plandrehen'!C34,\" / \",('TGM Plandrehen'!C34-'TGM Plandrehen'!D34)/2,\" tief planen\"))","v":0},{"$f":"'TGM Plandrehen'!E34","v":0},{"$f":"'TGM Plandrehen'!J34","v":0},"J"]
[{"$f":"'TGM Plandrehen'!A35","v":0},{"$f":"IF(C291=0,0,CONCATENATE(\"vom außen Dm\",'TGM Plandrehen'!C35,\" / \",('TGM Plandrehen'!C35-'TGM Plandrehen'!D35)/2,\" tief planen\"))","v":0},{"$f":"'TGM Plandrehen'!E35","v":0},{"$f":"'TGM Plandrehen'!J35","v":0},"J"]
[{"$f":"'TGM Plandrehen'!A36","v":0},{"$f":"IF(C292=0,0,CONCATENATE(\"vom außen Dm\",'TGM Plandrehen'!C36,\" / \",('TGM Plandrehen'!C36-'TGM Plandrehen'!D36)/2,\" tief planen\"))","v":0},{"$f":"'TGM Plandrehen'!E36","v":0},{"$f":"'TGM Plandrehen'!J36","v":0},"J"]
[{"$f":"'TGM Plandrehen'!A37","v":0},{"$f":"IF(C293=0,0,CONCATENATE(\"vom außen Dm\",'TGM Plandrehen'!C37,\" / \",('TGM Plandrehen'!C37-'TGM Plandrehen'!D37)/2,\" tief planen\"))","v":0},{"$f":"'TGM Plandrehen'!E37","v":0},{"$f":"'TGM Plandrehen'!J37","v":0},"J"]
[{"$f":"'TGM Plandrehen'!A38","v":0},{"$f":"IF(C294=0,0,CONCATENATE(\"vom außen Dm\",'TGM Plandrehen'!C38,\" / \",('TGM Plandrehen'!C38-'TGM Plandrehen'!D38)/2,\" tief planen\"))","v":0},{"$f":"'TGM Plandrehen'!E38","v":0},{"$f":"'TGM Plandrehen'!J38","v":0},"J"]
[{"$f":"'TGM Plandrehen'!A39","v":0},{"$f":"IF(C295=0,0,CONCATENATE(\"vom außen Dm\",'TGM Plandrehen'!C39,\" / \",('TGM Plandrehen'!C39-'TGM Plandrehen'!D39)/2,\" tief planen\"))","v":0},{"$f":"'TGM Plandrehen'!E39","v":0},{"$f":"'TGM Plandrehen'!J39","v":0},"J"]
[{"$f":"'TGM Plandrehen'!A40","v":0},{"$f":"IF(C296=0,0,CONCATENATE(\"vom außen Dm\",'TGM Plandrehen'!C40,\" / \",('TGM Plandrehen'!C40-'TGM Plandrehen'!D40)/2,\" tief planen\"))","v":0},{"$f":"'TGM Plandrehen'!E40","v":0},{"$f":"'TGM Plandrehen'!J40","v":0},"J"]
[{"$f":"'TGM Plandrehen'!A41","v":0},{"$f":"IF(C297=0,0,CONCATENATE(\"vom außen Dm\",'TGM Plandrehen'!C41,\" / \",('TGM Plandrehen'!C41-'TGM Plandrehen'!D41)/2,\" tief planen\"))","v":0},{"$f":"'TGM Plandrehen'!E41","v":0},{"$f":"'TGM Plandrehen'!J41","v":0},"J"]
[{"$f":"'TGM Plandrehen'!A42","v":0},{"$f":"IF(C298=0,0,CONCATENATE(\"vom außen Dm\",'TGM Plandrehen'!C42,\" / \",('TGM Plandrehen'!C42-'TGM Plandrehen'!D42)/2,\" tief planen\"))","v":0},{"$f":"'TGM Plandrehen'!E42","v":0},{"$f":"'TGM Plandrehen'!J42","v":0},"J"]
[{"$f":"'TGM Plandrehen'!A43","v":0},{"$f":"IF(C299=0,0,CONCATENATE(\"vom außen Dm\",'TGM Plandrehen'!C43,\" / \",('TGM Plandrehen'!C43-'TGM Plandrehen'!D43)/2,\" tief planen\"))","v":0},{"$f":"'TGM Plandrehen'!E43","v":0},{"$f":"'TGM Plandrehen'!J43","v":0},"J"]
[{"$f":"'TGM Plandrehen'!A44","v":0},{"$f":"IF(C300=0,0,CONCATENATE(\"vom außen Dm\",'TGM Plandrehen'!C44,\" / \",('TGM Plandrehen'!C44-'TGM Plandrehen'!D44)/2,\" tief planen\"))","v":0},{"$f":"'TGM Plandrehen'!E44","v":0},{"$f":"'TGM Plandrehen'!J44","v":0},"J"]
[{"$f":"'TGM Plandrehen'!A45","v":0},{"$f":"IF(C301=0,0,CONCATENATE(\"vom außen Dm\",'TGM Plandrehen'!C45,\" / \",('TGM Plandrehen'!C45-'TGM Plandrehen'!D45)/2,\" tief planen\"))","v":0},{"$f":"'TGM Plandrehen'!E45","v":0},{"$f":"'TGM Plandrehen'!J45","v":0},"J"]
[{"$f":"'TGM Plandrehen'!A46","v":0},{"$f":"IF(C302=0,0,CONCATENATE(\"vom außen Dm\",'TGM Plandrehen'!C46,\" / \",('TGM Plandrehen'!C46-'TGM Plandrehen'!D46)/2,\" tief planen\"))","v":0},{"$f":"'TGM Plandrehen'!E46","v":0},{"$f":"'TGM Plandrehen'!J46","v":0},"J"]
[{"$f":"'TGM Plandrehen'!A47","v":0},{"$f":"IF(C303=0,0,CONCATENATE(\"vom außen Dm\",'TGM Plandrehen'!C47,\" / \",('TGM Plandrehen'!C47-'TGM Plandrehen'!D47)/2,\" tief planen\"))","v":0},{"$f":"'TGM Plandrehen'!E47","v":0},{"$f":"'TGM Plandrehen'!J47","v":0},"J"]
[{"$f":"'TGM Plandrehen'!A48","v":0},{"$f":"IF(C304=0,0,CONCATENATE(\"vom außen Dm\",'TGM Plandrehen'!C48,\" / \",('TGM Plandrehen'!C48-'TGM Plandrehen'!D48)/2,\" tief planen\"))","v":0},{"$f":"'TGM Plandrehen'!E48","v":0},{"$f":"'TGM Plandrehen'!J48","v":0},"J"]
[{"$f":"'TGM Plandrehen'!A49","v":0},{"$f":"IF(C305=0,0,CONCATENATE(\"vom außen Dm\",'TGM Plandrehen'!C49,\" / \",('TGM Plandrehen'!C49-'TGM Plandrehen'!D49)/2,\" tief planen\"))","v":0},{"$f":"'TGM Plandrehen'!E49","v":0},{"$f":"'TGM Plandrehen'!J49","v":0},"J"]
[{"$f":"'TGM Plandrehen'!A50","v":0},{"$f":"IF(C306=0,0,CONCATENATE(\"vom außen Dm\",'TGM Plandrehen'!C50,\" / \",('TGM Plandrehen'!C50-'TGM Plandrehen'!D50)/2,\" tief planen\"))","v":0},{"$f":"'TGM Plandrehen'!E50","v":0},{"$f":"'TGM Plandrehen'!J50","v":0},"J"]
[{"$f":"'TGM Plandrehen'!A51","v":0},{"$f":"IF(C307=0,0,CONCATENATE(\"vom außen Dm\",'TGM Plandrehen'!C51,\" / \",('TGM Plandrehen'!C51-'TGM Plandrehen'!D51)/2,\" tief planen\"))","v":0},{"$f":"'TGM Plandrehen'!E51","v":0},{"$f":"'TGM Plandrehen'!J51","v":0},"J"]
[{"$f":"'TGM Plandrehen'!A52","v":0},{"$f":"IF(C308=0,0,CONCATENATE(\"vom außen Dm\",'TGM Plandrehen'!C52,\" / \",('TGM Plandrehen'!C52-'TGM Plandrehen'!D52)/2,\" tief planen\"))","v":0},{"$f":"'TGM Plandrehen'!E52","v":0},{"$f":"'TGM Plandrehen'!J52","v":0},"J"]
[{"$f":"'TGM Plandrehen'!A53","v":0},{"$f":"IF(C309=0,0,CONCATENATE(\"vom außen Dm\",'TGM Plandrehen'!C53,\" / \",('TGM Plandrehen'!C53-'TGM Plandrehen'!D53)/2,\" tief planen\"))","v":0},{"$f":"'TGM Plandrehen'!E53","v":0},{"$f":"'TGM Plandrehen'!J53","v":0},"J"]
[{"$f":"'TGM Plandrehen'!A54","v":0},{"$f":"IF(C310=0,0,CONCATENATE(\"vom außen Dm\",'TGM Plandrehen'!C54,\" / \",('TGM Plandrehen'!C54-'TGM Plandrehen'!D54)/2,\" tief planen\"))","v":0},{"$f":"'TGM Plandrehen'!E54","v":0},{"$f":"'TGM Plandrehen'!J54","v":0},"J"]
[{"$f":"'TGM Plandrehen'!A55","v":0},{"$f":"IF(C311=0,0,CONCATENATE(\"vom außen Dm\",'TGM Plandrehen'!C55,\" / \",('TGM Plandrehen'!C55-'TGM Plandrehen'!D55)/2,\" tief planen\"))","v":0},{"$f":"'TGM Plandrehen'!E55","v":0},{"$f":"'TGM Plandrehen'!J55","v":0},"J"]
[{"$f":"'TGM Plandrehen'!A56","v":0},{"$f":"IF(C312=0,0,CONCATENATE(\"vom außen Dm\",'TGM Plandrehen'!C56,\" / \",('TGM Plandrehen'!C56-'TGM Plandrehen'!D56)/2,\" tief planen\"))","v":0},{"$f":"'TGM Plandrehen'!E56","v":0},{"$f":"'TGM Plandrehen'!J56","v":0},"J"]
[{"$f":"'TGM Plandrehen'!A57","v":0},{"$f":"IF(C313=0,0,CONCATENATE(\"vom außen Dm\",'TGM Plandrehen'!C57,\" / \",('TGM Plandrehen'!C57-'TGM Plandrehen'!D57)/2,\" tief planen\"))","v":0},{"$f":"'TGM Plandrehen'!E57","v":0},{"$f":"'TGM Plandrehen'!J57","v":0},"J"]
[{"$f":"'TGM Plandrehen'!A58","v":0},{"$f":"IF(C314=0,0,CONCATENATE(\"vom außen Dm\",'TGM Plandrehen'!C58,\" / \",('TGM Plandrehen'!C58-'TGM Plandrehen'!D58)/2,\" tief planen\"))","v":0},{"$f":"'TGM Plandrehen'!E58","v":0},{"$f":"'TGM Plandrehen'!J58","v":0},"J"]
[{"$f":"'TGM Plandrehen'!A59","v":0},{"$f":"IF(C315=0,0,CONCATENATE(\"vom außen Dm\",'TGM Plandrehen'!C59,\" / \",('TGM Plandrehen'!C59-'TGM Plandrehen'!D59)/2,\" tief planen\"))","v":0},{"$f":"'TGM Plandrehen'!E59","v":0},{"$f":"'TGM Plandrehen'!J59","v":0},"J"]
[{"$f":"'TGM Plandrehen'!A60","v":0},{"$f":"IF(C316=0,0,CONCATENATE(\"vom außen Dm\",'TGM Plandrehen'!C60,\" / \",('TGM Plandrehen'!C60-'TGM Plandrehen'!D60)/2,\" tief planen\"))","v":0},{"$f":"'TGM Plandrehen'!E60","v":0},{"$f":"'TGM Plandrehen'!J60","v":0},"J"]
[{"$f":"'TGM Plandrehen'!A61","v":0},{"$f":"IF(C317=0,0,CONCATENATE(\"vom außen Dm\",'TGM Plandrehen'!C61,\" / \",('TGM Plandrehen'!C61-'TGM Plandrehen'!D61)/2,\" tief planen\"))","v":0},{"$f":"'TGM Plandrehen'!E61","v":0},{"$f":"'TGM Plandrehen'!J61","v":0},"J"]
[{"$f":"'TGM Plandrehen'!A62","v":0},{"$f":"IF(C318=0,0,CONCATENATE(\"vom außen Dm\",'TGM Plandrehen'!C62,\" / \",('TGM Plandrehen'!C62-'TGM Plandrehen'!D62)/2,\" tief planen\"))","v":0},{"$f":"'TGM Plandrehen'!E62","v":0},{"$f":"'TGM Plandrehen'!J62","v":0},"J"]
[{"$f":"'TGM Plandrehen'!A63","v":0},{"$f":"IF(C319=0,0,CONCATENATE(\"vom außen Dm\",'TGM Plandrehen'!C63,\" / \",('TGM Plandrehen'!C63-'TGM Plandrehen'!D63)/2,\" tief planen\"))","v":0},{"$f":"'TGM Plandrehen'!E63","v":0},{"$f":"'TGM Plandrehen'!J63","v":0},"J"]
[{"$f":"'TGM Plandrehen'!A64","v":0},{"$f":"IF(C320=0,0,CONCATENATE(\"vom außen Dm\",'TGM Plandrehen'!C64,\" / \",('TGM Plandrehen'!C64-'TGM Plandrehen'!D64)/2,\" tief planen\"))","v":0},{"$f":"'TGM Plandrehen'!E64","v":0},{"$f":"'TGM Plandrehen'!J64","v":0},"J"]
[{"$f":"'TGM Plandrehen'!A65","v":0},{"$f":"IF(C321=0,0,CONCATENATE(\"vom außen Dm\",'TGM Plandrehen'!C65,\" / \",('TGM Plandrehen'!C65-'TGM Plandrehen'!D65)/2,\" tief planen\"))","v":0},{"$f":"'TGM Plandrehen'!E65","v":0},{"$f":"'TGM Plandrehen'!J65","v":0},"J"]
[null,null,null,null,{"$f":"IF(B269=0,\"J\",\"N\")","v":"J"}]
[{"$f":"'TGM Langdrehen '!A1","v":"Schnittzeitberechnung Langdrehen"},null,null,null,{"$f":"IF(B324=0,\"J\",\"N\")","v":"J"}]
["Gesamtzeit in Minuten =",{"$f":"'TGM Langdrehen '!M1","v":0},null,null,{"$f":"IF(B324=0,\"J\",\"N\")","v":"J"}]
["Bemerkung","Drehbereich","Anzahl der Schnitte","Zeit",{"$f":"IF(B324=0,\"J\",\"N\")","v":"J"}]
[{"$f":"'TGM Langdrehen '!A16","v":0},{"$f":"IF(C326=0,0,CONCATENATE(\"Dm\",'TGM Langdrehen '!C16,\" bis Dm\",'TGM Langdrehen '!D16,\",\",'TGM Langdrehen '!E16, \" lang überdrehen\"))","v":0},{"$f":"'TGM Langdrehen '!I16","v":0},{"$f":"'TGM Langdrehen '!L16","v":0},{"$f":"IF(D326=0,\"J\",\"N\")","v":"J"}]
[{"$f":"'TGM Langdrehen '!A17","v":0},{"$f":"IF(C327=0,0,CONCATENATE(\"Dm\",'TGM Langdrehen '!C17,\" bis Dm\",'TGM Langdrehen '!D17,\",\",'TGM Langdrehen '!E17, \" lang überdrehen\"))","v":0},{"$f":"'TGM Langdrehen '!I17","v":0},{"$f":"'TGM Langdrehen '!L17","v":0},"J"]
[{"$f":"'TGM Langdrehen '!A18","v":0},{"$f":"IF(C328=0,0,CONCATENATE(\"Dm\",'TGM Langdrehen '!C18,\" bis Dm\",'TGM Langdrehen '!D18,\",\",'TGM Langdrehen '!E18, \" lang überdrehen\"))","v":0},{"$f":"'TGM Langdrehen '!I18","v":0},{"$f":"'TGM Langdrehen '!L18","v":0},"J"]
[{"$f":"'TGM Langdrehen '!A19","v":0},{"$f":"IF(C329=0,0,CONCATENATE(\"Dm\",'TGM Langdrehen '!C19,\" bis Dm\",'TGM Langdrehen '!D19,\",\",'TGM Langdrehen '!E19, \" lang überdrehen\"))","v":0},{"$f":"'TGM Langdrehen '!I19","v":0},{"$f":"'TGM Langdrehen '!L19","v":0},"J"]
[{"$f":"'TGM Langdrehen '!A20","v":0},{"$f":"IF(C330=0,0,CONCATENATE(\"Dm\",'TGM Langdrehen '!C20,\" bis Dm\",'TGM Langdrehen '!D20,\",\",'TGM Langdrehen '!E20, \" lang überdrehen\"))","v":0},{"$f":"'TGM Langdrehen '!I20","v":0},{"$f":"'TGM Langdrehen '!L20","v":0},"J"]
[{"$f":"'TGM Langdrehen '!A21","v":0},{"$f":"IF(C331=0,0,CONCATENATE(\"Dm\",'TGM Langdrehen '!C21,\" bis Dm\",'TGM Langdrehen '!D21,\",\",'TGM Langdrehen '!E21, \" lang überdrehen\"))","v":0},{"$f":"'TGM Langdrehen '!I21","v":0},{"$f":"'TGM Langdrehen '!L21","v":0},"J"]
[{"$f":"'TGM Langdrehen '!A22","v":0},{"$f":"IF(C332=0,0,CONCATENATE(\"Dm\",'TGM Langdrehen '!C22,\" bis Dm\",'TGM Langdrehen '!D22,\",\",'TGM Langdrehen '!E22, \" lang überdrehen\"))","v":0},{"$f":"'TGM Langdrehen '!I22","v":0},{"$f":"'TGM Langdrehen '!L22","v":0},"J"]
[{"$f":"'TGM Langdrehen '!A23","v":0},{"$f":"IF(C333=0,0,CONCATENATE(\"Dm\",'TGM Langdrehen '!C23,\" bis Dm\",'TGM Langdrehen '!D23,\",\",'TGM Langdrehen '!E23, \" lang überdrehen\"))","v":0},{"$f":"'TGM Langdrehen '!I23","v":0},{"$f":"'TGM Langdrehen '!L23","v":0},"J"]
[{"$f":"'TGM Langdrehen '!A24","v":0},{"$f":"IF(C334=0,0,CONCATENATE(\"Dm\",'TGM Langdrehen '!C24,\" bis Dm\",'TGM Langdrehen '!D24,\",\",'TGM Langdrehen '!E24, \" lang überdrehen\"))","v":0},{"$f":"'TGM Langdrehen '!I24","v":0},{"$f":"'TGM Langdrehen '!L24","v":0},"J"]
[{"$f":"'TGM Langdrehen '!A25","v":0},{"$f":"IF(C335=0,0,CONCATENATE(\"Dm\",'TGM Langdrehen '!C25,\" bis Dm\",'TGM Langdrehen '!D25,\",\",'TGM Langdrehen '!E25, \" lang überdrehen\"))","v":0},{"$f":"'TGM Langdrehen '!I25","v":0},{"$f":"'TGM Langdrehen '!L25","v":0},"J"]
[{"$f":"'TGM Langdrehen '!A26","v":0},{"$f":"IF(C336=0,0,CONCATENATE(\"Dm\",'TGM Langdrehen '!C26,\" bis Dm\",'TGM Langdrehen '!D26,\",\",'TGM Langdrehen '!E26, \" lang überdrehen\"))","v":0},{"$f":"'TGM Langdrehen '!I26","v":0},{"$f":"'TGM Langdrehen '!L26","v":0},"J"]
[{"$f":"'TGM Langdrehen '!A27","v":0},{"$f":"IF(C337=0,0,CONCATENATE(\"Dm\",'TGM Langdrehen '!C27,\" bis Dm\",'TGM Langdrehen '!D27,\",\",'TGM Langdrehen '!E27, \" lang überdrehen\"))","v":0},{"$f":"'TGM Langdrehen '!I27","v":0},{"$f":"'TGM Langdrehen '!L27","v":0},"J"]
[{"$f":"'TGM Langdrehen '!A28","v":0},{"$f":"IF(C338=0,0,CONCATENATE(\"Dm\",'TGM Langdrehen '!C28,\" bis Dm\",'TGM Langdrehen '!D28,\",\",'TGM Langdrehen '!E28, \" lang überdrehen\"))","v":0},{"$f":"'TGM Langdrehen '!I28","v":0},{"$f":"'TGM Langdrehen '!L28","v":0},"J"]
[{"$f":"'TGM Langdrehen '!A29","v":0},{"$f":"IF(C339=0,0,CONCATENATE(\"Dm\",'TGM Langdrehen '!C29,\" bis Dm\",'TGM Langdrehen '!D29,\",\",'TGM Langdrehen '!E29, \" lang überdrehen\"))","v":0},{"$f":"'TGM Langdrehen '!I29","v":0},{"$f":"'TGM Langdrehen '!L29","v":0},"J"]
[{"$f":"'TGM Langdrehen '!A30","v":0},{"$f":"IF(C340=0,0,CONCATENATE(\"Dm\",'TGM Langdrehen '!C30,\" bis Dm\",'TGM Langdrehen '!D30,\",\",'TGM Langdrehen '!E30, \" lang überdrehen\"))","v":0},{"$f":"'TGM Langdrehen '!I30","v":0},{"$f":"'TGM Langdrehen '!L30","v":0},"J"]
[{"$f":"'TGM Langdrehen '!A31","v":0},{"$f":"IF(C341=0,0,CONCATENATE(\"Dm\",'TGM Langdrehen '!C31,\" bis Dm\",'TGM Langdrehen '!D31,\",\",'TGM Langdrehen '!E31, \" lang überdrehen\"))","v":0},{"$f":"'TGM Langdrehen '!I31","v":0},{"$f":"'TGM Langdrehen '!L31","v":0},"J"]
[{"$f":"'TGM Langdrehen '!A32","v":0},{"$f":"IF(C342=0,0,CONCATENATE(\"Dm\",'TGM Langdrehen '!C32,\" bis Dm\",'TGM Langdrehen '!D32,\",\",'TGM Langdrehen '!E32, \" lang überdrehen\"))","v":0},{"$f":"'TGM Langdrehen '!I32","v":0},{"$f":"'TGM Langdrehen '!L32","v":0},"J"]
[{"$f":"'TGM Langdrehen '!A33","v":0},{"$f":"IF(C343=0,0,CONCATENATE(\"Dm\",'TGM Langdrehen '!C33,\" bis Dm\",'TGM Langdrehen '!D33,\",\",'TGM Langdrehen '!E33, \" lang überdrehen\"))","v":0},{"$f":"'TGM Langdrehen '!I33","v":0},{"$f":"'TGM Langdrehen '!L33","v":0},"J"]
[{"$f":"'TGM Langdrehen '!A34","v":0},{"$f":"IF(C344=0,0,CONCATENATE(\"Dm\",'TGM Langdrehen '!C34,\" bis Dm\",'TGM Langdrehen '!D34,\",\",'TGM Langdrehen '!E34, \" lang überdrehen\"))","v":0},{"$f":"'TGM Langdrehen '!I34","v":0},{"$f":"'TGM Langdrehen '!L34","v":0},"J"]
[{"$f":"'TGM Langdrehen '!A35","v":0},{"$f":"IF(C345=0,0,CONCATENATE(\"Dm\",'TGM Langdrehen '!C35,\" bis Dm\",'TGM Langdrehen '!D35,\",\",'TGM Langdrehen '!E35, \" lang überdrehen\"))","v":0},{"$f":"'TGM Langdrehen '!I35","v":0},{"$f":"'TGM Langdrehen '!L35","v":0},"J"]
[{"$f":"'TGM Langdrehen '!A36","v":0},{"$f":"IF(C346=0,0,CONCATENATE(\"Dm\",'TGM Langdrehen '!C36,\" bis Dm\",'TGM Langdrehen '!D36,\",\",'TGM Langdrehen '!E36, \" lang überdrehen\"))","v":0},{"$f":"'TGM Langdrehen '!I36","v":0},{"$f":"'TGM Langdrehen '!L36","v":0},"J"]
[{"$f":"'TGM Langdrehen '!A37","v":0},{"$f":"IF(C347=0,0,CONCATENATE(\"Dm\",'TGM Langdrehen '!C37,\" bis Dm\",'TGM Langdrehen '!D37,\",\",'TGM Langdrehen '!E37, \" lang überdrehen\"))","v":0},{"$f":"'TGM Langdrehen '!I37","v":0},{"$f":"'TGM Langdrehen '!L37","v":0},"J"]
[{"$f":"'TGM Langdrehen '!A38","v":0},{"$f":"IF(C348=0,0,CONCATENATE(\"Dm\",'TGM Langdrehen '!C38,\" bis Dm\",'TGM Langdrehen '!D38,\",\",'TGM Langdrehen '!E38, \" lang überdrehen\"))","v":0},{"$f":"'TGM Langdrehen '!I38","v":0},{"$f":"'TGM Langdrehen '!L38","v":0},"J"]
[{"$f":"'TGM Langdrehen '!A39","v":0},{"$f":"IF(C349=0,0,CONCATENATE(\"Dm\",'TGM Langdrehen '!C39,\" bis Dm\",'TGM Langdrehen '!D39,\",\",'TGM Langdrehen '!E39, \" lang überdrehen\"))","v":0},{"$f":"'TGM Langdrehen '!I39","v":0},{"$f":"'TGM Langdrehen '!L39","v":0},"J"]
[{"$f":"'TGM Langdrehen '!A40","v":0},{"$f":"IF(C350=0,0,CONCATENATE(\"Dm\",'TGM Langdrehen '!C40,\" bis Dm\",'TGM Langdrehen '!D40,\",\",'TGM Langdrehen '!E40, \" lang überdrehen\"))","v":0},{"$f":"'TGM Langdrehen '!I40","v":0},{"$f":"'TGM Langdrehen '!L40","v":0},"J"]
[{"$f":"'TGM Langdrehen '!A41","v":0},{"$f":"IF(C351=0,0,CONCATENATE(\"Dm\",'TGM Langdrehen '!C41,\" bis Dm\",'TGM Langdrehen '!D41,\",\",'TGM Langdrehen '!E41, \" lang überdrehen\"))","v":0},{"$f":"'TGM Langdrehen '!I41","v":0},{"$f":"'TGM Langdrehen '!L41","v":0},"J"]
[{"$f":"'TGM Langdrehen '!A42","v":0},{"$f":"IF(C352=0,0,CONCATENATE(\"Dm\",'TGM Langdrehen '!C42,\" bis Dm\",'TGM Langdrehen '!D42,\",\",'TGM Langdrehen '!E42, \" lang überdrehen\"))","v":0},{"$f":"'TGM Langdrehen '!I42","v":0},{"$f":"'TGM Langdrehen '!L42","v":0},"J"]
[{"$f":"'TGM Langdrehen '!A43","v":0},{"$f":"IF(C353=0,0,CONCATENATE(\"Dm\",'TGM Langdrehen '!C43,\" bis Dm\",'TGM Langdrehen '!D43,\",\",'TGM Langdrehen '!E43, \" lang überdrehen\"))","v":0},{"$f":"'TGM Langdrehen '!I43","v":0},{"$f":"'TGM Langdrehen '!L43","v":0},"J"]
[{"$f":"'TGM Langdrehen '!A44","v":0},{"$f":"IF(C354=0,0,CONCATENATE(\"Dm\",'TGM Langdrehen '!C44,\" bis Dm\",'TGM Langdrehen '!D44,\",\",'TGM Langdrehen '!E44, \" lang überdrehen\"))","v":0},{"$f":"'TGM Langdrehen '!I44","v":0},{"$f":"'TGM Langdrehen '!L44","v":0},"J"]
[{"$f":"'TGM Langdrehen '!A45","v":0},{"$f":"IF(C355=0,0,CONCATENATE(\"Dm\",'TGM Langdrehen '!C45,\" bis Dm\",'TGM Langdrehen '!D45,\",\",'TGM Langdrehen '!E45, \" lang überdrehen\"))","v":0},{"$f":"'TGM Langdrehen '!I45","v":0},{"$f":"'TGM Langdrehen '!L45","v":0},"J"]
[{"$f":"'TGM Langdrehen '!A46","v":0},{"$f":"IF(C356=0,0,CONCATENATE(\"Dm\",'TGM Langdrehen '!C46,\" bis Dm\",'TGM Langdrehen '!D46,\",\",'TGM Langdrehen '!E46, \" lang überdrehen\"))","v":0},{"$f":"'TGM Langdrehen '!I46","v":0},{"$f":"'TGM Langdrehen '!L46","v":0},"J"]
[{"$f":"'TGM Langdrehen '!A47","v":0},{"$f":"IF(C357=0,0,CONCATENATE(\"Dm\",'TGM Langdrehen '!C47,\" bis Dm\",'TGM Langdrehen '!D47,\",\",'TGM Langdrehen '!E47, \" lang überdrehen\"))","v":0},{"$f":"'TGM Langdrehen '!I47","v":0},{"$f":"'TGM Langdrehen '!L47","v":0},"J"]
[{"$f":"'TGM Langdrehen '!A48","v":0},{"$f":"IF(C358=0,0,CONCATENATE(\"Dm\",'TGM Langdrehen '!C48,\" bis Dm\",'TGM Langdrehen '!D48,\",\",'TGM Langdrehen '!E48, \" lang überdrehen\"))","v":0},{"$f":"'TGM Langdrehen '!I48","v":0},{"$f":"'TGM Langdrehen '!L48","v":0},"J"]
[{"$f":"'TGM Langdrehen '!A49","v":0},{"$f":"IF(C359=0,0,CONCATENATE(\"Dm\",'TGM Langdrehen '!C49,\" bis Dm\",'TGM Langdrehen '!D49,\",\",'TGM Langdrehen '!E49, \" lang überdrehen\"))","v":0},{"$f":"'TGM Langdrehen '!I49","v":0},{"$f":"'TGM Langdrehen '!L49","v":0},"J"]
[{"$f":"'TGM Langdrehen '!A50","v":0},{"$f":"IF(C360=0,0,CONCATENATE(\"Dm\",'TGM Langdrehen '!C50,\" bis Dm\",'TGM Langdrehen '!D50,\",\",'TGM Langdrehen '!E50, \" lang überdrehen\"))","v":0},{"$f":"'TGM Langdrehen '!I50","v":0},{"$f":"'TGM Langdrehen '!L50","v":0},"J"]
[{"$f":"'TGM Langdrehen '!A51","v":0},{"$f":"IF(C361=0,0,CONCATENATE(\"Dm\",'TGM Langdrehen '!C51,\" bis Dm\",'TGM Langdrehen '!D51,\",\",'TGM Langdrehen '!E51, \" lang überdrehen\"))","v":0},{"$f":"'TGM Langdrehen '!I51","v":0},{"$f":"'TGM Langdrehen '!L51","v":0},"J"]
[{"$f":"'TGM Langdrehen '!A52","v":0},{"$f":"IF(C362=0,0,CONCATENATE(\"Dm\",'TGM Langdrehen '!C52,\" bis Dm\",'TGM Langdrehen '!D52,\",\",'TGM Langdrehen '!E52, \" lang überdrehen\"))","v":0},{"$f":"'TGM Langdrehen '!I52","v":0},{"$f":"'TGM Langdrehen '!L52","v":0},"J"]
[{"$f":"'TGM Langdrehen '!A53","v":0},{"$f":"IF(C363=0,0,CONCATENATE(\"Dm\",'TGM Langdrehen '!C53,\" bis Dm\",'TGM Langdrehen '!D53,\",\",'TGM Langdrehen '!E53, \" lang überdrehen\"))","v":0},{"$f":"'TGM Langdrehen '!I53","v":0},{"$f":"'TGM Langdrehen '!L53","v":0},"J"]
[{"$f":"'TGM Langdrehen '!A54","v":0},{"$f":"IF(C364=0,0,CONCATENATE(\"Dm\",'TGM Langdrehen '!C54,\" bis Dm\",'TGM Langdrehen '!D54,\",\",'TGM Langdrehen '!E54, \" lang überdrehen\"))","v":0},{"$f":"'TGM Langdrehen '!I54","v":0},{"$f":"'TGM Langdrehen '!L54","v":0},"J"]
[{"$f":"'TGM Langdrehen '!A55","v":0},{"$f":"IF(C365=0,0,CONCATENATE(\"Dm\",'TGM Langdrehen '!C55,\" bis Dm\",'TGM Langdrehen '!D55,\",\",'TGM Langdrehen '!E55, \" lang überdrehen\"))","v":0},{"$f":"'TGM Langdrehen '!I55","v":0},{"$f":"'TGM Langdrehen '!L55","v":0},"J"]
[{"$f":"'TGM Langdrehen '!A56","v":0},{"$f":"IF(C366=0,0,CONCATENATE(\"Dm\",'TGM Langdrehen '!C56,\" bis Dm\",'TGM Langdrehen '!D56,\",\",'TGM Langdrehen '!E56, \" lang überdrehen\"))","v":0},{"$f":"'TGM Langdrehen '!I56","v":0},{"$f":"'TGM Langdrehen '!L56","v":0},"J"]
[{"$f":"'TGM Langdrehen '!A57","v":0},{"$f":"IF(C367=0,0,CONCATENATE(\"Dm\",'TGM Langdrehen '!C57,\" bis Dm\",'TGM Langdrehen '!D57,\",\",'TGM Langdrehen '!E57, \" lang überdrehen\"))","v":0},{"$f":"'TGM Langdrehen '!I57","v":0},{"$f":"'TGM Langdrehen '!L57","v":0},"J"]
[{"$f":"'TGM Langdrehen '!A58","v":0},{"$f":"IF(C368=0,0,CONCATENATE(\"Dm\",'TGM Langdrehen '!C58,\" bis Dm\",'TGM Langdrehen '!D58,\",\",'TGM Langdrehen '!E58, \" lang überdrehen\"))","v":0},{"$f":"'TGM Langdrehen '!I58","v":0},{"$f":"'TGM Langdrehen '!L58","v":0},"J"]
[{"$f":"'TGM Langdrehen '!A59","v":0},{"$f":"IF(C369=0,0,CONCATENATE(\"Dm\",'TGM Langdrehen '!C59,\" bis Dm\",'TGM Langdrehen '!D59,\",\",'TGM Langdrehen '!E59, \" lang überdrehen\"))","v":0},{"$f":"'TGM Langdrehen '!I59","v":0},{"$f":"'TGM Langdrehen '!L59","v":0},"J"]
[{"$f":"'TGM Langdrehen '!A60","v":0},{"$f":"IF(C370=0,0,CONCATENATE(\"Dm\",'TGM Langdrehen '!C60,\" bis Dm\",'TGM Langdrehen '!D60,\",\",'TGM Langdrehen '!E60, \" lang überdrehen\"))","v":0},{"$f":"'TGM Langdrehen '!I60","v":0},{"$f":"'TGM Langdrehen '!L60","v":0},"J"]
[{"$f":"'TGM Langdrehen '!A61","v":0},{"$f":"IF(C371=0,0,CONCATENATE(\"Dm\",'TGM Langdrehen '!C61,\" bis Dm\",'TGM Langdrehen '!D61,\",\",'TGM Langdrehen '!E61, \" lang überdrehen\"))","v":0},{"$f":"'TGM Langdrehen '!I61","v":0},{"$f":"'TGM Langdrehen '!L61","v":0},"J"]
[{"$f":"'TGM Langdrehen '!A62","v":0},{"$f":"IF(C372=0,0,CONCATENATE(\"Dm\",'TGM Langdrehen '!C62,\" bis Dm\",'TGM Langdrehen '!D62,\",\",'TGM Langdrehen '!E62, \" lang überdrehen\"))","v":0},{"$f":"'TGM Langdrehen '!I62","v":0},{"$f":"'TGM Langdrehen '!L62","v":0},"J"]
[{"$f":"'TGM Langdrehen '!A63","v":0},{"$f":"IF(C373=0,0,CONCATENATE(\"Dm\",'TGM Langdrehen '!C63,\" bis Dm\",'TGM Langdrehen '!D63,\",\",'TGM Langdrehen '!E63, \" lang überdrehen\"))","v":0},{"$f":"'TGM Langdrehen '!I63","v":0},{"$f":"'TGM Langdrehen '!L63","v":0},"J"]
[{"$f":"'TGM Langdrehen '!A64","v":0},{"$f":"IF(C374=0,0,CONCATENATE(\"Dm\",'TGM Langdrehen '!C64,\" bis Dm\",'TGM Langdrehen '!D64,\",\",'TGM Langdrehen '!E64, \" lang überdrehen\"))","v":0},{"$f":"'TGM Langdrehen '!I64","v":0},{"$f":"'TGM Langdrehen '!L64","v":0},"J"]
[{"$f":"'TGM Langdrehen '!A65","v":0},{"$f":"IF(C375=0,0,CONCATENATE(\"Dm\",'TGM Langdrehen '!C65,\" bis Dm\",'TGM Langdrehen '!D65,\",\",'TGM Langdrehen '!E65, \" lang überdrehen\"))","v":0},{"$f":"'TGM Langdrehen '!I65","v":0},{"$f":"'TGM Langdrehen '!L65","v":0},"J"]
[{"$f":"'TGM Langdrehen '!A66","v":0},{"$f":"IF(C376=0,0,CONCATENATE(\"Dm\",'TGM Langdrehen '!C66,\" bis Dm\",'TGM Langdrehen '!D66,\",\",'TGM Langdrehen '!E66, \" lang überdrehen\"))","v":0},{"$f":"'TGM Langdrehen '!I66","v":0},{"$f":"'TGM Langdrehen '!L66","v":0},"J"]
[{"$f":"'TGM Langdrehen '!A67","v":0},{"$f":"IF(C377=0,0,CONCATENATE(\"Dm\",'TGM Langdrehen '!C67,\" bis Dm\",'TGM Langdrehen '!D67,\",\",'TGM Langdrehen '!E67, \" lang überdrehen\"))","v":0},{"$f":"'TGM Langdrehen '!I67","v":0},{"$f":"'TGM Langdrehen '!L67","v":0},"J"]
[{"$f":"'TGM Langdrehen '!A68","v":0},{"$f":"IF(C378=0,0,CONCATENATE(\"Dm\",'TGM Langdrehen '!C68,\" bis Dm\",'TGM Langdrehen '!D68,\",\",'TGM Langdrehen '!E68, \" lang überdrehen\"))","v":0},{"$f":"'TGM Langdrehen '!I68","v":0},{"$f":"'TGM Langdrehen '!L68","v":0},"J"]
[{"$f":"'TGM Langdrehen '!A69","v":0},{"$f":"IF(C379=0,0,CONCATENATE(\"Dm\",'TGM Langdrehen '!C69,\" bis Dm\",'TGM Langdrehen '!D69,\",\",'TGM Langdrehen '!E69, \" lang überdrehen\"))","v":0},{"$f":"'TGM Langdrehen '!I69","v":0},{"$f":"'TGM Langdrehen '!L69","v":0},"J"]
[{"$f":"'TGM Langdrehen '!A70","v":0},{"$f":"IF(C380=0,0,CONCATENATE(\"Dm\",'TGM Langdrehen '!C70,\" bis Dm\",'TGM Langdrehen '!D70,\",\",'TGM Langdrehen '!E70, \" lang überdrehen\"))","v":0},{"$f":"'TGM Langdrehen '!I70","v":0},{"$f":"'TGM Langdrehen '!L70","v":0},"J"]
[{"$f":"'TGM Langdrehen '!A71","v":0},{"$f":"IF(C381=0,0,CONCATENATE(\"Dm\",'TGM Langdrehen '!C71,\" bis Dm\",'TGM Langdrehen '!D71,\",\",'TGM Langdrehen '!E71, \" lang überdrehen\"))","v":0},{"$f":"'TGM Langdrehen '!I71","v":0},{"$f":"'TGM Langdrehen '!L71","v":0},"J"]
[{"$f":"'TGM Langdrehen '!A72","v":0},{"$f":"IF(C382=0,0,CONCATENATE(\"Dm\",'TGM Langdrehen '!C72,\" bis Dm\",'TGM Langdrehen '!D72,\",\",'TGM Langdrehen '!E72, \" lang überdrehen\"))","v":0},{"$f":"'TGM Langdrehen '!I72","v":0},{"$f":"'TGM Langdrehen '!L72","v":0},"J"]
[{"$f":"'TGM Langdrehen '!A73","v":0},{"$f":"IF(C383=0,0,CONCATENATE(\"Dm\",'TGM Langdrehen '!C73,\" bis Dm\",'TGM Langdrehen '!D73,\",\",'TGM Langdrehen '!E73, \" lang überdrehen\"))","v":0},{"$f":"'TGM Langdrehen '!I73","v":0},{"$f":"'TGM Langdrehen '!L73","v":0},"J"]
[{"$f":"'TGM Langdrehen '!A74","v":0},{"$f":"IF(C384=0,0,CONCATENATE(\"Dm\",'TGM Langdrehen '!C74,\" bis Dm\",'TGM Langdrehen '!D74,\",\",'TGM Langdrehen '!E74, \" lang überdrehen\"))","v":0},{"$f":"'TGM Langdrehen '!I74","v":0},{"$f":"'TGM Langdrehen '!L74","v":0},"J"]
[{"$f":"'TGM Langdrehen '!A75","v":0},{"$f":"IF(C385=0,0,CONCATENATE(\"Dm\",'TGM Langdrehen '!C75,\" bis Dm\",'TGM Langdrehen '!D75,\",\",'TGM Langdrehen '!E75, \" lang überdrehen\"))","v":0},{"$f":"'TGM Langdrehen '!I75","v":0},{"$f":"'TGM Langdrehen '!L75","v":0},"J"]
[{"$f":"'TGM Langdrehen '!A76","v":0},{"$f":"IF(C386=0,0,CONCATENATE(\"Dm\",'TGM Langdrehen '!C76,\" bis Dm\",'TGM Langdrehen '!D76,\",\",'TGM Langdrehen '!E76, \" lang überdrehen\"))","v":0},{"$f":"'TGM Langdrehen '!I76","v":0},{"$f":"'TGM Langdrehen '!L76","v":0},"J"]
[{"$f":"'TGM Langdrehen '!A77","v":0},{"$f":"IF(C387=0,0,CONCATENATE(\"Dm\",'TGM Langdrehen '!C77,\" bis Dm\",'TGM Langdrehen '!D77,\",\",'TGM Langdrehen '!E77, \" lang überdrehen\"))","v":0},{"$f":"'TGM Langdrehen '!I77","v":0},{"$f":"'TGM Langdrehen '!L77","v":0},"J"]
[{"$f":"'TGM Langdrehen '!A78","v":0},{"$f":"IF(C388=0,0,CONCATENATE(\"Dm\",'TGM Langdrehen '!C78,\" bis Dm\",'TGM Langdrehen '!D78,\",\",'TGM Langdrehen '!E78, \" lang überdrehen\"))","v":0},{"$f":"'TGM Langdrehen '!I78","v":0},{"$f":"'TGM Langdrehen '!L78","v":0},"J"]
[{"$f":"'TGM Langdrehen '!A79","v":0},{"$f":"IF(C389=0,0,CONCATENATE(\"Dm\",'TGM Langdrehen '!C79,\" bis Dm\",'TGM Langdrehen '!D79,\",\",'TGM Langdrehen '!E79, \" lang überdrehen\"))","v":0},{"$f":"'TGM Langdrehen '!I79","v":0},{"$f":"'TGM Langdrehen '!L79","v":0},"J"]
[{"$f":"'TGM Langdrehen '!A80","v":0},{"$f":"IF(C390=0,0,CONCATENATE(\"Dm\",'TGM Langdrehen '!C80,\" bis Dm\",'TGM Langdrehen '!D80,\",\",'TGM Langdrehen '!E80, \" lang überdrehen\"))","v":0},{"$f":"'TGM Langdrehen '!I80","v":0},{"$f":"'TGM Langdrehen '!L80","v":0},{"$f":"IF(D390=0,\"J\",\"N\")","v":"J"}]
[{"$f":"'TGM Langdrehen '!A81","v":0},{"$f":"IF(C391=0,0,CONCATENATE(\"Dm\",'TGM Langdrehen '!C81,\" bis Dm\",'TGM Langdrehen '!D81,\",\",'TGM Langdrehen '!E81, \" lang überdrehen\"))","v":0},{"$f":"'TGM Langdrehen '!I81","v":0},{"$f":"'TGM Langdrehen '!L81","v":0},"J"]
[{"$f":"'TGM Langdrehen '!A82","v":0},{"$f":"IF(C392=0,0,CONCATENATE(\"Dm\",'TGM Langdrehen '!C82,\" bis Dm\",'TGM Langdrehen '!D82,\",\",'TGM Langdrehen '!E82, \" lang überdrehen\"))","v":0},{"$f":"'TGM Langdrehen '!I82","v":0},{"$f":"'TGM Langdrehen '!L82","v":0},"J"]
[{"$f":"'TGM Langdrehen '!A83","v":0},{"$f":"IF(C393=0,0,CONCATENATE(\"Dm\",'TGM Langdrehen '!C83,\" bis Dm\",'TGM Langdrehen '!D83,\",\",'TGM Langdrehen '!E83, \" lang überdrehen\"))","v":0},{"$f":"'TGM Langdrehen '!I83","v":0},{"$f":"'TGM Langdrehen '!L83","v":0},"J"]
[{"$f":"'TGM Langdrehen '!A84","v":0},{"$f":"IF(C394=0,0,CONCATENATE(\"Dm\",'TGM Langdrehen '!C84,\" bis Dm\",'TGM Langdrehen '!D84,\",\",'TGM Langdrehen '!E84, \" lang überdrehen\"))","v":0},{"$f":"'TGM Langdrehen '!I84","v":0},{"$f":"'TGM Langdrehen '!L84","v":0},"J"]
[{"$f":"'TGM Langdrehen '!A85","v":0},{"$f":"IF(C395=0,0,CONCATENATE(\"Dm\",'TGM Langdrehen '!C85,\" bis Dm\",'TGM Langdrehen '!D85,\",\",'TGM Langdrehen '!E85, \" lang überdrehen\"))","v":0},{"$f":"'TGM Langdrehen '!I85","v":0},{"$f":"'TGM Langdrehen '!L85","v":0},"J"]
[{"$f":"'TGM Langdrehen '!A86","v":0},{"$f":"IF(C396=0,0,CONCATENATE(\"Dm\",'TGM Langdrehen '!C86,\" bis Dm\",'TGM Langdrehen '!D86,\",\",'TGM Langdrehen '!E86, \" lang überdrehen\"))","v":0},{"$f":"'TGM Langdrehen '!I86","v":0},{"$f":"'TGM Langdrehen '!L86","v":0},"J"]
[{"$f":"'TGM Langdrehen '!A87","v":0},{"$f":"IF(C397=0,0,CONCATENATE(\"Dm\",'TGM Langdrehen '!C87,\" bis Dm\",'TGM Langdrehen '!D87,\",\",'TGM Langdrehen '!E87, \" lang überdrehen\"))","v":0},{"$f":"'TGM Langdrehen '!I87","v":0},{"$f":"'TGM Langdrehen '!L87","v":0},"J"]
[{"$f":"'TGM Langdrehen '!A88","v":0},{"$f":"IF(C398=0,0,CONCATENATE(\"Dm\",'TGM Langdrehen '!C88,\" bis Dm\",'TGM Langdrehen '!D88,\",\",'TGM Langdrehen '!E88, \" lang überdrehen\"))","v":0},{"$f":"'TGM Langdrehen '!I88","v":0},{"$f":"'TGM Langdrehen '!L88","v":0},"J"]
[{"$f":"'TGM Langdrehen '!A89","v":0},{"$f":"IF(C399=0,0,CONCATENATE(\"Dm\",'TGM Langdrehen '!C89,\" bis Dm\",'TGM Langdrehen '!D89,\",\",'TGM Langdrehen '!E89, \" lang überdrehen\"))","v":0},{"$f":"'TGM Langdrehen '!I89","v":0},{"$f":"'TGM Langdrehen '!L89","v":0},"J"]
[{"$f":"'TGM Langdrehen '!A90","v":0},{"$f":"IF(C400=0,0,CONCATENATE(\"Dm\",'TGM Langdrehen '!C90,\" bis Dm\",'TGM Langdrehen '!D90,\",\",'TGM Langdrehen '!E90, \" lang überdrehen\"))","v":0},{"$f":"'TGM Langdrehen '!I90","v":0},{"$f":"'TGM Langdrehen '!L90","v":0},"J"]
[{"$f":"'TGM Langdrehen '!A91","v":0},{"$f":"IF(C401=0,0,CONCATENATE(\"Dm\",'TGM Langdrehen '!C91,\" bis Dm\",'TGM Langdrehen '!D91,\",\",'TGM Langdrehen '!E91, \" lang überdrehen\"))","v":0},{"$f":"'TGM Langdrehen '!I91","v":0},{"$f":"'TGM Langdrehen '!L91","v":0},"J"]
[{"$f":"'TGM Langdrehen '!A92","v":0},{"$f":"IF(C402=0,0,CONCATENATE(\"Dm\",'TGM Langdrehen '!C92,\" bis Dm\",'TGM Langdrehen '!D92,\",\",'TGM Langdrehen '!E92, \" lang überdrehen\"))","v":0},{"$f":"'TGM Langdrehen '!I92","v":0},{"$f":"'TGM Langdrehen '!L92","v":0},"J"]
[{"$f":"'TGM Langdrehen '!A93","v":0},{"$f":"IF(C403=0,0,CONCATENATE(\"Dm\",'TGM Langdrehen '!C93,\" bis Dm\",'TGM Langdrehen '!D93,\",\",'TGM Langdrehen '!E93, \" lang überdrehen\"))","v":0},{"$f":"'TGM Langdrehen '!I93","v":0},{"$f":"'TGM Langdrehen '!L93","v":0},"J"]
[{"$f":"'TGM Langdrehen '!A94","v":0},{"$f":"IF(C404=0,0,CONCATENATE(\"Dm\",'TGM Langdrehen '!C94,\" bis Dm\",'TGM Langdrehen '!D94,\",\",'TGM Langdrehen '!E94, \" lang überdrehen\"))","v":0},{"$f":"'TGM Langdrehen '!I94","v":0},{"$f":"'TGM Langdrehen '!L94","v":0},"J"]
[{"$f":"'TGM Langdrehen '!A95","v":0},{"$f":"IF(C405=0,0,CONCATENATE(\"Dm\",'TGM Langdrehen '!C95,\" bis Dm\",'TGM Langdrehen '!D95,\",\",'TGM Langdrehen '!E95, \" lang überdrehen\"))","v":0},{"$f":"'TGM Langdrehen '!I95","v":0},{"$f":"'TGM Langdrehen '!L95","v":0},"J"]
[{"$f":"'TGM Langdrehen '!A96","v":0},{"$f":"IF(C406=0,0,CONCATENATE(\"Dm\",'TGM Langdrehen '!C96,\" bis Dm\",'TGM Langdrehen '!D96,\",\",'TGM Langdrehen '!E96, \" lang überdrehen\"))","v":0},{"$f":"'TGM Langdrehen '!I96","v":0},{"$f":"'TGM Langdrehen '!L96","v":0},"J"]
[{"$f":"'TGM Langdrehen '!A97","v":0},{"$f":"IF(C407=0,0,CONCATENATE(\"Dm\",'TGM Langdrehen '!C97,\" bis Dm\",'TGM Langdrehen '!D97,\",\",'TGM Langdrehen '!E97, \" lang überdrehen\"))","v":0},{"$f":"'TGM Langdrehen '!I97","v":0},{"$f":"'TGM Langdrehen '!L97","v":0},"J"]
[{"$f":"'TGM Langdrehen '!A98","v":0},{"$f":"IF(C408=0,0,CONCATENATE(\"Dm\",'TGM Langdrehen '!C98,\" bis Dm\",'TGM Langdrehen '!D98,\",\",'TGM Langdrehen '!E98, \" lang überdrehen\"))","v":0},{"$f":"'TGM Langdrehen '!I98","v":0},{"$f":"'TGM Langdrehen '!L98","v":0},"J"]
[{"$f":"'TGM Langdrehen '!A99","v":0},{"$f":"IF(C409=0,0,CONCATENATE(\"Dm\",'TGM Langdrehen '!C99,\" bis Dm\",'TGM Langdrehen '!D99,\",\",'TGM Langdrehen '!E99, \" lang überdrehen\"))","v":0},{"$f":"'TGM Langdrehen '!I99","v":0},{"$f":"'TGM Langdrehen '!L99","v":0},"J"]
[{"$f":"'TGM Langdrehen '!A100","v":0},{"$f":"IF(C410=0,0,CONCATENATE(\"Dm\",'TGM Langdrehen '!C100,\" bis Dm\",'TGM Langdrehen '!D100,\",\",'TGM Langdrehen '!E100, \" lang überdrehen\"))","v":0},{"$f":"'TGM Langdrehen '!I100","v":0},{"$f":"'TGM Langdrehen '!L100","v":0},"J"]
[{"$f":"'TGM Langdrehen '!A101","v":0},{"$f":"IF(C411=0,0,CONCATENATE(\"Dm\",'TGM Langdrehen '!C101,\" bis Dm\",'TGM Langdrehen '!D101,\",\",'TGM Langdrehen '!E101, \" lang überdrehen\"))","v":0},{"$f":"'TGM Langdrehen '!I101","v":0},{"$f":"'TGM Langdrehen '!L101","v":0},"J"]
[{"$f":"'TGM Langdrehen '!A102","v":0},{"$f":"IF(C412=0,0,CONCATENATE(\"Dm\",'TGM Langdrehen '!C102,\" bis Dm\",'TGM Langdrehen '!D102,\",\",'TGM Langdrehen '!E102, \" lang überdrehen\"))","v":0},{"$f":"'TGM Langdrehen '!I102","v":0},{"$f":"'TGM Langdrehen '!L102","v":0},"J"]
[{"$f":"'TGM Langdrehen '!A103","v":0},{"$f":"IF(C413=0,0,CONCATENATE(\"Dm\",'TGM Langdrehen '!C103,\" bis Dm\",'TGM Langdrehen '!D103,\",\",'TGM Langdrehen '!E103, \" lang überdrehen\"))","v":0},{"$f":"'TGM Langdrehen '!I103","v":0},{"$f":"'TGM Langdrehen '!L103","v":0},"J"]
[{"$f":"'TGM Langdrehen '!A104","v":0},{"$f":"IF(C414=0,0,CONCATENATE(\"Dm\",'TGM Langdrehen '!C104,\" bis Dm\",'TGM Langdrehen '!D104,\",\",'TGM Langdrehen '!E104, \" lang überdrehen\"))","v":0},{"$f":"'TGM Langdrehen '!I104","v":0},{"$f":"'TGM Langdrehen '!L104","v":0},"J"]
[{"$f":"'TGM Langdrehen '!A105","v":0},{"$f":"IF(C415=0,0,CONCATENATE(\"Dm\",'TGM Langdrehen '!C105,\" bis Dm\",'TGM Langdrehen '!D105,\",\",'TGM Langdrehen '!E105, \" lang überdrehen\"))","v":0},{"$f":"'TGM Langdrehen '!I105","v":0},{"$f":"'TGM Langdrehen '!L105","v":0},"J"]
[{"$f":"'TGM Langdrehen '!A106","v":0},{"$f":"IF(C416=0,0,CONCATENATE(\"Dm\",'TGM Langdrehen '!C106,\" bis Dm\",'TGM Langdrehen '!D106,\",\",'TGM Langdrehen '!E106, \" lang überdrehen\"))","v":0},{"$f":"'TGM Langdrehen '!I106","v":0},{"$f":"'TGM Langdrehen '!L106","v":0},"J"]
[{"$f":"'TGM Langdrehen '!A107","v":0},{"$f":"IF(C417=0,0,CONCATENATE(\"Dm\",'TGM Langdrehen '!C107,\" bis Dm\",'TGM Langdrehen '!D107,\",\",'TGM Langdrehen '!E107, \" lang überdrehen\"))","v":0},{"$f":"'TGM Langdrehen '!I107","v":0},{"$f":"'TGM Langdrehen '!L107","v":0},"J"]
[{"$f":"'TGM Langdrehen '!A108","v":0},{"$f":"IF(C418=0,0,CONCATENATE(\"Dm\",'TGM Langdrehen '!C108,\" bis Dm\",'TGM Langdrehen '!D108,\",\",'TGM Langdrehen '!E108, \" lang überdrehen\"))","v":0},{"$f":"'TGM Langdrehen '!I108","v":0},{"$f":"'TGM Langdrehen '!L108","v":0},"J"]
[{"$f":"'TGM Langdrehen '!A109","v":0},{"$f":"IF(C419=0,0,CONCATENATE(\"Dm\",'TGM Langdrehen '!C109,\" bis Dm\",'TGM Langdrehen '!D109,\",\",'TGM Langdrehen '!E109, \" lang überdrehen\"))","v":0},{"$f":"'TGM Langdrehen '!I109","v":0},{"$f":"'TGM Langdrehen '!L109","v":0},"J"]
[{"$f":"'TGM Langdrehen '!A110","v":0},{"$f":"IF(C420=0,0,CONCATENATE(\"Dm\",'TGM Langdrehen '!C110,\" bis Dm\",'TGM Langdrehen '!D110,\",\",'TGM Langdrehen '!E110, \" lang überdrehen\"))","v":0},{"$f":"'TGM Langdrehen '!I110","v":0},{"$f":"'TGM Langdrehen '!L110","v":0},"J"]
[{"$f":"'TGM Langdrehen '!A111","v":0},{"$f":"IF(C421=0,0,CONCATENATE(\"Dm\",'TGM Langdrehen '!C111,\" bis Dm\",'TGM Langdrehen '!D111,\",\",'TGM Langdrehen '!E111, \" lang überdrehen\"))","v":0},{"$f":"'TGM Langdrehen '!I111","v":0},{"$f":"'TGM Langdrehen '!L111","v":0},"J"]
[{"$f":"'TGM Langdrehen '!A112","v":0},{"$f":"IF(C422=0,0,CONCATENATE(\"Dm\",'TGM Langdrehen '!C112,\" bis Dm\",'TGM Langdrehen '!D112,\",\",'TGM Langdrehen '!E112, \" lang überdrehen\"))","v":0},{"$f":"'TGM Langdrehen '!I112","v":0},{"$f":"'TGM Langdrehen '!L112","v":0},"J"]
[{"$f":"'TGM Langdrehen '!A113","v":0},{"$f":"IF(C423=0,0,CONCATENATE(\"Dm\",'TGM Langdrehen '!C113,\" bis Dm\",'TGM Langdrehen '!D113,\",\",'TGM Langdrehen '!E113, \" lang überdrehen\"))","v":0},{"$f":"'TGM Langdrehen '!I113","v":0},{"$f":"'TGM Langdrehen '!L113","v":0},"J"]
[{"$f":"'TGM Langdrehen '!A114","v":0},{"$f":"IF(C424=0,0,CONCATENATE(\"Dm\",'TGM Langdrehen '!C114,\" bis Dm\",'TGM Langdrehen '!D114,\",\",'TGM Langdrehen '!E114, \" lang überdrehen\"))","v":0},{"$f":"'TGM Langdrehen '!I114","v":0},{"$f":"'TGM Langdrehen '!L114","v":0},"J"]
[{"$f":"'TGM Langdrehen '!A115","v":0},{"$f":"IF(C425=0,0,CONCATENATE(\"Dm\",'TGM Langdrehen '!C115,\" bis Dm\",'TGM Langdrehen '!D115,\",\",'TGM Langdrehen '!E115, \" lang überdrehen\"))","v":0},{"$f":"'TGM Langdrehen '!I115","v":0},{"$f":"'TGM Langdrehen '!L115","v":0},"J"]
[{"$f":"'TGM Langdrehen '!A116","v":0},{"$f":"IF(C426=0,0,CONCATENATE(\"Dm\",'TGM Langdrehen '!C116,\" bis Dm\",'TGM Langdrehen '!D116,\",\",'TGM Langdrehen '!E116, \" lang überdrehen\"))","v":0},{"$f":"'TGM Langdrehen '!I116","v":0},{"$f":"'TGM Langdrehen '!L116","v":0},"J"]
[null,null,null,null,{"$f":"IF(B324=0,\"J\",\"N\")","v":"J"}]
[{"$f":"'Aufmaß Zeitspanvolumen Drehen'!A1","v":"Aufmaß Zeitspanvolumenberechnung beim Drehen"},null,null,null,{"$f":"IF(B429=0,\"J\",\"N\")","v":"J"}]
["Gesamtzeit in Minuten =",{"$f":"'Aufmaß Zeitspanvolumen Drehen'!C3","v":0},null,null,{"$f":"IF(B429=0,\"J\",\"N\")","v":"J"}]
["Bemerkung","Drehbereich","Zeitspanvolumen in dm³","Zeit",{"$f":"IF(B429=0,\"J\",\"N\")","v":"J"}]
[{"$f":"'Aufmaß Zeitspanvolumen Drehen'!A8","v":0},{"$f":"IF(C431=0,0,CONCATENATE(\"Vc=\",'Aufmaß Zeitspanvolumen Drehen'!B8,\"/ap=\",'Aufmaß Zeitspanvolumen Drehen'!C8,\"/f=\",'Aufmaß Zeitspanvolumen Drehen'!D8,\"/Øa=\",'Aufmaß Zeitspanvolumen Drehen'!F8,\"/L=\",'Aufmaß Zeitspanvolumen Drehen'!G8,\"/Aufmaß=\",'Aufmaß Zeitspanvolumen Drehen'!H8,\"/Øi=\",'Aufmaß Zeitspanvolumen Drehen'!I8,\"/+\",'Aufmaß Zeitspanvolumen Drehen'!E8,\"%\"))","v":0},{"$f":"'Aufmaß Zeitspanvolumen Drehen'!L8","v":0},{"$f":"'Aufmaß Zeitspanvolumen Drehen'!M8","v":0},{"$f":"IF(D431=0,\"J\",\"N\")","v":"J"}]
[{"$f":"'Aufmaß Zeitspanvolumen Drehen'!A9","v":0},{"$f":"IF(C432=0,0,CONCATENATE(\"Vc=\",'Aufmaß Zeitspanvolumen Drehen'!B9,\"/ap=\",'Aufmaß Zeitspanvolumen Drehen'!C9,\"/f=\",'Aufmaß Zeitspanvolumen Drehen'!D9,\"/Øa=\",'Aufmaß Zeitspanvolumen Drehen'!F9,\"/L=\",'Aufmaß Zeitspanvolumen Drehen'!G9,\"/Aufmaß=\",'Aufmaß Zeitspanvolumen Drehen'!H9,\"/Øi=\",'Aufmaß Zeitspanvolumen Drehen'!I9,\"/+\",'Aufmaß Zeitspanvolumen Drehen'!E9,\"%\"))","v":0},{"$f":"'Aufmaß Zeitspanvolumen Drehen'!L9","v":0},{"$f":"'Aufmaß Zeitspanvolumen Drehen'!M9","v":0},"J"]
[{"$f":"'Aufmaß Zeitspanvolumen Drehen'!A10","v":0},{"$f":"IF(C433=0,0,CONCATENATE(\"Vc=\",'Aufmaß Zeitspanvolumen Drehen'!B10,\"/ap=\",'Aufmaß Zeitspanvolumen Drehen'!C10,\"/f=\",'Aufmaß Zeitspanvolumen Drehen'!D10,\"/Øa=\",'Aufmaß Zeitspanvolumen Drehen'!F10,\"/L=\",'Aufmaß Zeitspanvolumen Drehen'!G10,\"/Aufmaß=\",'Aufmaß Zeitspanvolumen Drehen'!H10,\"/Øi=\",'Aufmaß Zeitspanvolumen Drehen'!I10,\"/+\",'Aufmaß Zeitspanvolumen Drehen'!E10,\"%\"))","v":0},{"$f":"'Aufmaß Zeitspanvolumen Drehen'!L10","v":0},{"$f":"'Aufmaß Zeitspanvolumen Drehen'!M10","v":0},"J"]
[{"$f":"'Aufmaß Zeitspanvolumen Drehen'!A11","v":0},{"$f":"IF(C434=0,0,CONCATENATE(\"Vc=\",'Aufmaß Zeitspanvolumen Drehen'!B11,\"/ap=\",'Aufmaß Zeitspanvolumen Drehen'!C11,\"/f=\",'Aufmaß Zeitspanvolumen Drehen'!D11,\"/Øa=\",'Aufmaß Zeitspanvolumen Drehen'!F11,\"/L=\",'Aufmaß Zeitspanvolumen Drehen'!G11,\"/Aufmaß=\",'Aufmaß Zeitspanvolumen Drehen'!H11,\"/Øi=\",'Aufmaß Zeitspanvolumen Drehen'!I11,\"/+\",'Aufmaß Zeitspanvolumen Drehen'!E11,\"%\"))","v":0},{"$f":"'Aufmaß Zeitspanvolumen Drehen'!L11","v":0},{"$f":"'Aufmaß Zeitspanvolumen Drehen'!M11","v":0},"J"]
[{"$f":"'Aufmaß Zeitspanvolumen Drehen'!A12","v":0},{"$f":"IF(C435=0,0,CONCATENATE(\"Vc=\",'Aufmaß Zeitspanvolumen Drehen'!B12,\"/ap=\",'Aufmaß Zeitspanvolumen Drehen'!C12,\"/f=\",'Aufmaß Zeitspanvolumen Drehen'!D12,\"/Øa=\",'Aufmaß Zeitspanvolumen Drehen'!F12,\"/L=\",'Aufmaß Zeitspanvolumen Drehen'!G12,\"/Aufmaß=\",'Aufmaß Zeitspanvolumen Drehen'!H12,\"/Øi=\",'Aufmaß Zeitspanvolumen Drehen'!I12,\"/+\",'Aufmaß Zeitspanvolumen Drehen'!E12,\"%\"))","v":0},{"$f":"'Aufmaß Zeitspanvolumen Drehen'!L12","v":0},{"$f":"'Aufmaß Zeitspanvolumen Drehen'!M12","v":0},"J"]
[{"$f":"'Aufmaß Zeitspanvolumen Drehen'!A13","v":0},{"$f":"IF(C436=0,0,CONCATENATE(\"Vc=\",'Aufmaß Zeitspanvolumen Drehen'!B13,\"/ap=\",'Aufmaß Zeitspanvolumen Drehen'!C13,\"/f=\",'Aufmaß Zeitspanvolumen Drehen'!D13,\"/Øa=\",'Aufmaß Zeitspanvolumen Drehen'!F13,\"/L=\",'Aufmaß Zeitspanvolumen Drehen'!G13,\"/Aufmaß=\",'Aufmaß Zeitspanvolumen Drehen'!H13,\"/Øi=\",'Aufmaß Zeitspanvolumen Drehen'!I13,\"/+\",'Aufmaß Zeitspanvolumen Drehen'!E13,\"%\"))","v":0},{"$f":"'Aufmaß Zeitspanvolumen Drehen'!L13","v":0},{"$f":"'Aufmaß Zeitspanvolumen Drehen'!M13","v":0},"J"]
[{"$f":"'Aufmaß Zeitspanvolumen Drehen'!A14","v":0},{"$f":"IF(C437=0,0,CONCATENATE(\"Vc=\",'Aufmaß Zeitspanvolumen Drehen'!B14,\"/ap=\",'Aufmaß Zeitspanvolumen Drehen'!C14,\"/f=\",'Aufmaß Zeitspanvolumen Drehen'!D14,\"/Øa=\",'Aufmaß Zeitspanvolumen Drehen'!F14,\"/L=\",'Aufmaß Zeitspanvolumen Drehen'!G14,\"/Aufmaß=\",'Aufmaß Zeitspanvolumen Drehen'!H14,\"/Øi=\",'Aufmaß Zeitspanvolumen Drehen'!I14,\"/+\",'Aufmaß Zeitspanvolumen Drehen'!E14,\"%\"))","v":0},{"$f":"'Aufmaß Zeitspanvolumen Drehen'!L14","v":0},{"$f":"'Aufmaß Zeitspanvolumen Drehen'!M14","v":0},"J"]
[{"$f":"'Aufmaß Zeitspanvolumen Drehen'!A15","v":0},{"$f":"IF(C438=0,0,CONCATENATE(\"Vc=\",'Aufmaß Zeitspanvolumen Drehen'!B15,\"/ap=\",'Aufmaß Zeitspanvolumen Drehen'!C15,\"/f=\",'Aufmaß Zeitspanvolumen Drehen'!D15,\"/Øa=\",'Aufmaß Zeitspanvolumen Drehen'!F15,\"/L=\",'Aufmaß Zeitspanvolumen Drehen'!G15,\"/Aufmaß=\",'Aufmaß Zeitspanvolumen Drehen'!H15,\"/Øi=\",'Aufmaß Zeitspanvolumen Drehen'!I15,\"/+\",'Aufmaß Zeitspanvolumen Drehen'!E15,\"%\"))","v":0},{"$f":"'Aufmaß Zeitspanvolumen Drehen'!L15","v":0},{"$f":"'Aufmaß Zeitspanvolumen Drehen'!M15","v":0},"J"]
[{"$f":"'Aufmaß Zeitspanvolumen Drehen'!A16","v":0},{"$f":"IF(C439=0,0,CONCATENATE(\"Vc=\",'Aufmaß Zeitspanvolumen Drehen'!B16,\"/ap=\",'Aufmaß Zeitspanvolumen Drehen'!C16,\"/f=\",'Aufmaß Zeitspanvolumen Drehen'!D16,\"/Øa=\",'Aufmaß Zeitspanvolumen Drehen'!F16,\"/L=\",'Aufmaß Zeitspanvolumen Drehen'!G16,\"/Aufmaß=\",'Aufmaß Zeitspanvolumen Drehen'!H16,\"/Øi=\",'Aufmaß Zeitspanvolumen Drehen'!I16,\"/+\",'Aufmaß Zeitspanvolumen Drehen'!E16,\"%\"))","v":0},{"$f":"'Aufmaß Zeitspanvolumen Drehen'!L16","v":0},{"$f":"'Aufmaß Zeitspanvolumen Drehen'!M16","v":0},"J"]
[{"$f":"'Aufmaß Zeitspanvolumen Drehen'!A17","v":0},{"$f":"IF(C440=0,0,CONCATENATE(\"Vc=\",'Aufmaß Zeitspanvolumen Drehen'!B17,\"/ap=\",'Aufmaß Zeitspanvolumen Drehen'!C17,\"/f=\",'Aufmaß Zeitspanvolumen Drehen'!D17,\"/Øa=\",'Aufmaß Zeitspanvolumen Drehen'!F17,\"/L=\",'Aufmaß Zeitspanvolumen Drehen'!G17,\"/Aufmaß=\",'Aufmaß Zeitspanvolumen Drehen'!H17,\"/Øi=\",'Aufmaß Zeitspanvolumen Drehen'!I17,\"/+\",'Aufmaß Zeitspanvolumen Drehen'!E17,\"%\"))","v":0},{"$f":"'Aufmaß Zeitspanvolumen Drehen'!L17","v":0},{"$f":"'Aufmaß Zeitspanvolumen Drehen'!M17","v":0},"J"]
[{"$f":"'Aufmaß Zeitspanvolumen Drehen'!A18","v":0},{"$f":"IF(C441=0,0,CONCATENATE(\"Vc=\",'Aufmaß Zeitspanvolumen Drehen'!B18,\"/ap=\",'Aufmaß Zeitspanvolumen Drehen'!C18,\"/f=\",'Aufmaß Zeitspanvolumen Drehen'!D18,\"/Øa=\",'Aufmaß Zeitspanvolumen Drehen'!F18,\"/L=\",'Aufmaß Zeitspanvolumen Drehen'!G18,\"/Aufmaß=\",'Aufmaß Zeitspanvolumen Drehen'!H18,\"/Øi=\",'Aufmaß Zeitspanvolumen Drehen'!I18,\"/+\",'Aufmaß Zeitspanvolumen Drehen'!E18,\"%\"))","v":0},{"$f":"'Aufmaß Zeitspanvolumen Drehen'!L18","v":0},{"$f":"'Aufmaß Zeitspanvolumen Drehen'!M18","v":0},"J"]
[{"$f":"'Aufmaß Zeitspanvolumen Drehen'!A19","v":0},{"$f":"IF(C442=0,0,CONCATENATE(\"Vc=\",'Aufmaß Zeitspanvolumen Drehen'!B19,\"/ap=\",'Aufmaß Zeitspanvolumen Drehen'!C19,\"/f=\",'Aufmaß Zeitspanvolumen Drehen'!D19,\"/Øa=\",'Aufmaß Zeitspanvolumen Drehen'!F19,\"/L=\",'Aufmaß Zeitspanvolumen Drehen'!G19,\"/Aufmaß=\",'Aufmaß Zeitspanvolumen Drehen'!H19,\"/Øi=\",'Aufmaß Zeitspanvolumen Drehen'!I19,\"/+\",'Aufmaß Zeitspanvolumen Drehen'!E19,\"%\"))","v":0},{"$f":"'Aufmaß Zeitspanvolumen Drehen'!L19","v":0},{"$f":"'Aufmaß Zeitspanvolumen Drehen'!M19","v":0},"J"]
[{"$f":"'Aufmaß Zeitspanvolumen Drehen'!A20","v":0},{"$f":"IF(C443=0,0,CONCATENATE(\"Vc=\",'Aufmaß Zeitspanvolumen Drehen'!B20,\"/ap=\",'Aufmaß Zeitspanvolumen Drehen'!C20,\"/f=\",'Aufmaß Zeitspanvolumen Drehen'!D20,\"/Øa=\",'Aufmaß Zeitspanvolumen Drehen'!F20,\"/L=\",'Aufmaß Zeitspanvolumen Drehen'!G20,\"/Aufmaß=\",'Aufmaß Zeitspanvolumen Drehen'!H20,\"/Øi=\",'Aufmaß Zeitspanvolumen Drehen'!I20,\"/+\",'Aufmaß Zeitspanvolumen Drehen'!E20,\"%\"))","v":0},{"$f":"'Aufmaß Zeitspanvolumen Drehen'!L20","v":0},{"$f":"'Aufmaß Zeitspanvolumen Drehen'!M20","v":0},"J"]
[{"$f":"'Aufmaß Zeitspanvolumen Drehen'!A21","v":0},{"$f":"IF(C444=0,0,CONCATENATE(\"Vc=\",'Aufmaß Zeitspanvolumen Drehen'!B21,\"/ap=\",'Aufmaß Zeitspanvolumen Drehen'!C21,\"/f=\",'Aufmaß Zeitspanvolumen Drehen'!D21,\"/Øa=\",'Aufmaß Zeitspanvolumen Drehen'!F21,\"/L=\",'Aufmaß Zeitspanvolumen Drehen'!G21,\"/Aufmaß=\",'Aufmaß Zeitspanvolumen Drehen'!H21,\"/Øi=\",'Aufmaß Zeitspanvolumen Drehen'!I21,\"/+\",'Aufmaß Zeitspanvolumen Drehen'!E21,\"%\"))","v":0},{"$f":"'Aufmaß Zeitspanvolumen Drehen'!L21","v":0},{"$f":"'Aufmaß Zeitspanvolumen Drehen'!M21","v":0},"J"]
[{"$f":"'Aufmaß Zeitspanvolumen Drehen'!A22","v":0},{"$f":"IF(C445=0,0,CONCATENATE(\"Vc=\",'Aufmaß Zeitspanvolumen Drehen'!B22,\"/ap=\",'Aufmaß Zeitspanvolumen Drehen'!C22,\"/f=\",'Aufmaß Zeitspanvolumen Drehen'!D22,\"/Øa=\",'Aufmaß Zeitspanvolumen Drehen'!F22,\"/L=\",'Aufmaß Zeitspanvolumen Drehen'!G22,\"/Aufmaß=\",'Aufmaß Zeitspanvolumen Drehen'!H22,\"/Øi=\",'Aufmaß Zeitspanvolumen Drehen'!I22,\"/+\",'Aufmaß Zeitspanvolumen Drehen'!E22,\"%\"))","v":0},{"$f":"'Aufmaß Zeitspanvolumen Drehen'!L22","v":0},{"$f":"'Aufmaß Zeitspanvolumen Drehen'!M22","v":0},"J"]
[{"$f":"'Aufmaß Zeitspanvolumen Drehen'!A23","v":0},{"$f":"IF(C446=0,0,CONCATENATE(\"Vc=\",'Aufmaß Zeitspanvolumen Drehen'!B23,\"/ap=\",'Aufmaß Zeitspanvolumen Drehen'!C23,\"/f=\",'Aufmaß Zeitspanvolumen Drehen'!D23,\"/Øa=\",'Aufmaß Zeitspanvolumen Drehen'!F23,\"/L=\",'Aufmaß Zeitspanvolumen Drehen'!G23,\"/Aufmaß=\",'Aufmaß Zeitspanvolumen Drehen'!H23,\"/Øi=\",'Aufmaß Zeitspanvolumen Drehen'!I23,\"/+\",'Aufmaß Zeitspanvolumen Drehen'!E23,\"%\"))","v":0},{"$f":"'Aufmaß Zeitspanvolumen Drehen'!L23","v":0},{"$f":"'Aufmaß Zeitspanvolumen Drehen'!M23","v":0},"J"]
[{"$f":"'Aufmaß Zeitspanvolumen Drehen'!A24","v":0},{"$f":"IF(C447=0,0,CONCATENATE(\"Vc=\",'Aufmaß Zeitspanvolumen Drehen'!B24,\"/ap=\",'Aufmaß Zeitspanvolumen Drehen'!C24,\"/f=\",'Aufmaß Zeitspanvolumen Drehen'!D24,\"/Øa=\",'Aufmaß Zeitspanvolumen Drehen'!F24,\"/L=\",'Aufmaß Zeitspanvolumen Drehen'!G24,\"/Aufmaß=\",'Aufmaß Zeitspanvolumen Drehen'!H24,\"/Øi=\",'Aufmaß Zeitspanvolumen Drehen'!I24,\"/+\",'Aufmaß Zeitspanvolumen Drehen'!E24,\"%\"))","v":0},{"$f":"'Aufmaß Zeitspanvolumen Drehen'!L24","v":0},{"$f":"'Aufmaß Zeitspanvolumen Drehen'!M24","v":0},"J"]
[{"$f":"'Aufmaß Zeitspanvolumen Drehen'!A25","v":0},{"$f":"IF(C448=0,0,CONCATENATE(\"Vc=\",'Aufmaß Zeitspanvolumen Drehen'!B25,\"/ap=\",'Aufmaß Zeitspanvolumen Drehen'!C25,\"/f=\",'Aufmaß Zeitspanvolumen Drehen'!D25,\"/Øa=\",'Aufmaß Zeitspanvolumen Drehen'!F25,\"/L=\",'Aufmaß Zeitspanvolumen Drehen'!G25,\"/Aufmaß=\",'Aufmaß Zeitspanvolumen Drehen'!H25,\"/Øi=\",'Aufmaß Zeitspanvolumen Drehen'!I25,\"/+\",'Aufmaß Zeitspanvolumen Drehen'!E25,\"%\"))","v":0},{"$f":"'Aufmaß Zeitspanvolumen Drehen'!L25","v":0},{"$f":"'Aufmaß Zeitspanvolumen Drehen'!M25","v":0},"J"]
[{"$f":"'Aufmaß Zeitspanvolumen Drehen'!A26","v":0},{"$f":"IF(C449=0,0,CONCATENATE(\"Vc=\",'Aufmaß Zeitspanvolumen Drehen'!B26,\"/ap=\",'Aufmaß Zeitspanvolumen Drehen'!C26,\"/f=\",'Aufmaß Zeitspanvolumen Drehen'!D26,\"/Øa=\",'Aufmaß Zeitspanvolumen Drehen'!F26,\"/L=\",'Aufmaß Zeitspanvolumen Drehen'!G26,\"/Aufmaß=\",'Aufmaß Zeitspanvolumen Drehen'!H26,\"/Øi=\",'Aufmaß Zeitspanvolumen Drehen'!I26,\"/+\",'Aufmaß Zeitspanvolumen Drehen'!E26,\"%\"))","v":0},{"$f":"'Aufmaß Zeitspanvolumen Drehen'!L26","v":0},{"$f":"'Aufmaß Zeitspanvolumen Drehen'!M26","v":0},"J"]
[{"$f":"'Aufmaß Zeitspanvolumen Drehen'!A27","v":0},{"$f":"IF(C450=0,0,CONCATENATE(\"Vc=\",'Aufmaß Zeitspanvolumen Drehen'!B27,\"/ap=\",'Aufmaß Zeitspanvolumen Drehen'!C27,\"/f=\",'Aufmaß Zeitspanvolumen Drehen'!D27,\"/Øa=\",'Aufmaß Zeitspanvolumen Drehen'!F27,\"/L=\",'Aufmaß Zeitspanvolumen Drehen'!G27,\"/Aufmaß=\",'Aufmaß Zeitspanvolumen Drehen'!H27,\"/Øi=\",'Aufmaß Zeitspanvolumen Drehen'!I27,\"/+\",'Aufmaß Zeitspanvolumen Drehen'!E27,\"%\"))","v":0},{"$f":"'Aufmaß Zeitspanvolumen Drehen'!L27","v":0},{"$f":"'Aufmaß Zeitspanvolumen Drehen'!M27","v":0},"J"]
[{"$f":"'Aufmaß Zeitspanvolumen Drehen'!A28","v":0},{"$f":"IF(C451=0,0,CONCATENATE(\"Vc=\",'Aufmaß Zeitspanvolumen Drehen'!B28,\"/ap=\",'Aufmaß Zeitspanvolumen Drehen'!C28,\"/f=\",'Aufmaß Zeitspanvolumen Drehen'!D28,\"/Øa=\",'Aufmaß Zeitspanvolumen Drehen'!F28,\"/L=\",'Aufmaß Zeitspanvolumen Drehen'!G28,\"/Aufmaß=\",'Aufmaß Zeitspanvolumen Drehen'!H28,\"/Øi=\",'Aufmaß Zeitspanvolumen Drehen'!I28,\"/+\",'Aufmaß Zeitspanvolumen Drehen'!E28,\"%\"))","v":0},{"$f":"'Aufmaß Zeitspanvolumen Drehen'!L28","v":0},{"$f":"'Aufmaß Zeitspanvolumen Drehen'!M28","v":0},"J"]
[{"$f":"'Aufmaß Zeitspanvolumen Drehen'!A29","v":0},{"$f":"IF(C452=0,0,CONCATENATE(\"Vc=\",'Aufmaß Zeitspanvolumen Drehen'!B29,\"/ap=\",'Aufmaß Zeitspanvolumen Drehen'!C29,\"/f=\",'Aufmaß Zeitspanvolumen Drehen'!D29,\"/Øa=\",'Aufmaß Zeitspanvolumen Drehen'!F29,\"/L=\",'Aufmaß Zeitspanvolumen Drehen'!G29,\"/Aufmaß=\",'Aufmaß Zeitspanvolumen Drehen'!H29,\"/Øi=\",'Aufmaß Zeitspanvolumen Drehen'!I29,\"/+\",'Aufmaß Zeitspanvolumen Drehen'!E29,\"%\"))","v":0},{"$f":"'Aufmaß Zeitspanvolumen Drehen'!L29","v":0},{"$f":"'Aufmaß Zeitspanvolumen Drehen'!M29","v":0},"J"]
[{"$f":"'Aufmaß Zeitspanvolumen Drehen'!A30","v":0},{"$f":"IF(C453=0,0,CONCATENATE(\"Vc=\",'Aufmaß Zeitspanvolumen Drehen'!B30,\"/ap=\",'Aufmaß Zeitspanvolumen Drehen'!C30,\"/f=\",'Aufmaß Zeitspanvolumen Drehen'!D30,\"/Øa=\",'Aufmaß Zeitspanvolumen Drehen'!F30,\"/L=\",'Aufmaß Zeitspanvolumen Drehen'!G30,\"/Aufmaß=\",'Aufmaß Zeitspanvolumen Drehen'!H30,\"/Øi=\",'Aufmaß Zeitspanvolumen Drehen'!I30,\"/+\",'Aufmaß Zeitspanvolumen Drehen'!E30,\"%\"))","v":0},{"$f":"'Aufmaß Zeitspanvolumen Drehen'!L30","v":0},{"$f":"'Aufmaß Zeitspanvolumen Drehen'!M30","v":0},"J"]
[{"$f":"'Aufmaß Zeitspanvolumen Drehen'!A31","v":0},{"$f":"IF(C454=0,0,CONCATENATE(\"Vc=\",'Aufmaß Zeitspanvolumen Drehen'!B31,\"/ap=\",'Aufmaß Zeitspanvolumen Drehen'!C31,\"/f=\",'Aufmaß Zeitspanvolumen Drehen'!D31,\"/Øa=\",'Aufmaß Zeitspanvolumen Drehen'!F31,\"/L=\",'Aufmaß Zeitspanvolumen Drehen'!G31,\"/Aufmaß=\",'Aufmaß Zeitspanvolumen Drehen'!H31,\"/Øi=\",'Aufmaß Zeitspanvolumen Drehen'!I31,\"/+\",'Aufmaß Zeitspanvolumen Drehen'!E31,\"%\"))","v":0},{"$f":"'Aufmaß Zeitspanvolumen Drehen'!L31","v":0},{"$f":"'Aufmaß Zeitspanvolumen Drehen'!M31","v":0},"J"]
[{"$f":"'Aufmaß Zeitspanvolumen Drehen'!A32","v":0},{"$f":"IF(C455=0,0,CONCATENATE(\"Vc=\",'Aufmaß Zeitspanvolumen Drehen'!B32,\"/ap=\",'Aufmaß Zeitspanvolumen Drehen'!C32,\"/f=\",'Aufmaß Zeitspanvolumen Drehen'!D32,\"/Øa=\",'Aufmaß Zeitspanvolumen Drehen'!F32,\"/L=\",'Aufmaß Zeitspanvolumen Drehen'!G32,\"/Aufmaß=\",'Aufmaß Zeitspanvolumen Drehen'!H32,\"/Øi=\",'Aufmaß Zeitspanvolumen Drehen'!I32,\"/+\",'Aufmaß Zeitspanvolumen Drehen'!E32,\"%\"))","v":0},{"$f":"'Aufmaß Zeitspanvolumen Drehen'!L32","v":0},{"$f":"'Aufmaß Zeitspanvolumen Drehen'!M32","v":0},"J"]
[{"$f":"'Aufmaß Zeitspanvolumen Drehen'!A33","v":0},{"$f":"IF(C456=0,0,CONCATENATE(\"Vc=\",'Aufmaß Zeitspanvolumen Drehen'!B33,\"/ap=\",'Aufmaß Zeitspanvolumen Drehen'!C33,\"/f=\",'Aufmaß Zeitspanvolumen Drehen'!D33,\"/Øa=\",'Aufmaß Zeitspanvolumen Drehen'!F33,\"/L=\",'Aufmaß Zeitspanvolumen Drehen'!G33,\"/Aufmaß=\",'Aufmaß Zeitspanvolumen Drehen'!H33,\"/Øi=\",'Aufmaß Zeitspanvolumen Drehen'!I33,\"/+\",'Aufmaß Zeitspanvolumen Drehen'!E33,\"%\"))","v":0},{"$f":"'Aufmaß Zeitspanvolumen Drehen'!L33","v":0},{"$f":"'Aufmaß Zeitspanvolumen Drehen'!M33","v":0},"J"]
[{"$f":"'Aufmaß Zeitspanvolumen Drehen'!A34","v":0},{"$f":"IF(C457=0,0,CONCATENATE(\"Vc=\",'Aufmaß Zeitspanvolumen Drehen'!B34,\"/ap=\",'Aufmaß Zeitspanvolumen Drehen'!C34,\"/f=\",'Aufmaß Zeitspanvolumen Drehen'!D34,\"/Øa=\",'Aufmaß Zeitspanvolumen Drehen'!F34,\"/L=\",'Aufmaß Zeitspanvolumen Drehen'!G34,\"/Aufmaß=\",'Aufmaß Zeitspanvolumen Drehen'!H34,\"/Øi=\",'Aufmaß Zeitspanvolumen Drehen'!I34,\"/+\",'Aufmaß Zeitspanvolumen Drehen'!E34,\"%\"))","v":0},{"$f":"'Aufmaß Zeitspanvolumen Drehen'!L34","v":0},{"$f":"'Aufmaß Zeitspanvolumen Drehen'!M34","v":0},"J"]
[{"$f":"'Aufmaß Zeitspanvolumen Drehen'!A35","v":0},{"$f":"IF(C458=0,0,CONCATENATE(\"Vc=\",'Aufmaß Zeitspanvolumen Drehen'!B35,\"/ap=\",'Aufmaß Zeitspanvolumen Drehen'!C35,\"/f=\",'Aufmaß Zeitspanvolumen Drehen'!D35,\"/Øa=\",'Aufmaß Zeitspanvolumen Drehen'!F35,\"/L=\",'Aufmaß Zeitspanvolumen Drehen'!G35,\"/Aufmaß=\",'Aufmaß Zeitspanvolumen Drehen'!H35,\"/Øi=\",'Aufmaß Zeitspanvolumen Drehen'!I35,\"/+\",'Aufmaß Zeitspanvolumen Drehen'!E35,\"%\"))","v":0},{"$f":"'Aufmaß Zeitspanvolumen Drehen'!L35","v":0},{"$f":"'Aufmaß Zeitspanvolumen Drehen'!M35","v":0},"J"]
[{"$f":"'Aufmaß Zeitspanvolumen Drehen'!A36","v":0},{"$f":"IF(C459=0,0,CONCATENATE(\"Vc=\",'Aufmaß Zeitspanvolumen Drehen'!B36,\"/ap=\",'Aufmaß Zeitspanvolumen Drehen'!C36,\"/f=\",'Aufmaß Zeitspanvolumen Drehen'!D36,\"/Øa=\",'Aufmaß Zeitspanvolumen Drehen'!F36,\"/L=\",'Aufmaß Zeitspanvolumen Drehen'!G36,\"/Aufmaß=\",'Aufmaß Zeitspanvolumen Drehen'!H36,\"/Øi=\",'Aufmaß Zeitspanvolumen Drehen'!I36,\"/+\",'Aufmaß Zeitspanvolumen Drehen'!E36,\"%\"))","v":0},{"$f":"'Aufmaß Zeitspanvolumen Drehen'!L36","v":0},{"$f":"'Aufmaß Zeitspanvolumen Drehen'!M36","v":0},"J"]
[{"$f":"'Aufmaß Zeitspanvolumen Drehen'!A37","v":0},{"$f":"IF(C460=0,0,CONCATENATE(\"Vc=\",'Aufmaß Zeitspanvolumen Drehen'!B37,\"/ap=\",'Aufmaß Zeitspanvolumen Drehen'!C37,\"/f=\",'Aufmaß Zeitspanvolumen Drehen'!D37,\"/Øa=\",'Aufmaß Zeitspanvolumen Drehen'!F37,\"/L=\",'Aufmaß Zeitspanvolumen Drehen'!G37,\"/Aufmaß=\",'Aufmaß Zeitspanvolumen Drehen'!H37,\"/Øi=\",'Aufmaß Zeitspanvolumen Drehen'!I37,\"/+\",'Aufmaß Zeitspanvolumen Drehen'!E37,\"%\"))","v":0},{"$f":"'Aufmaß Zeitspanvolumen Drehen'!L37","v":0},{"$f":"'Aufmaß Zeitspanvolumen Drehen'!M37","v":0},"J"]
[{"$f":"'Aufmaß Zeitspanvolumen Drehen'!A38","v":0},{"$f":"IF(C461=0,0,CONCATENATE(\"Vc=\",'Aufmaß Zeitspanvolumen Drehen'!B38,\"/ap=\",'Aufmaß Zeitspanvolumen Drehen'!C38,\"/f=\",'Aufmaß Zeitspanvolumen Drehen'!D38,\"/Øa=\",'Aufmaß Zeitspanvolumen Drehen'!F38,\"/L=\",'Aufmaß Zeitspanvolumen Drehen'!G38,\"/Aufmaß=\",'Aufmaß Zeitspanvolumen Drehen'!H38,\"/Øi=\",'Aufmaß Zeitspanvolumen Drehen'!I38,\"/+\",'Aufmaß Zeitspanvolumen Drehen'!E38,\"%\"))","v":0},{"$f":"'Aufmaß Zeitspanvolumen Drehen'!L38","v":0},{"$f":"'Aufmaß Zeitspanvolumen Drehen'!M38","v":0},"J"]
[{"$f":"'Aufmaß Zeitspanvolumen Drehen'!A39","v":0},{"$f":"IF(C462=0,0,CONCATENATE(\"Vc=\",'Aufmaß Zeitspanvolumen Drehen'!B39,\"/ap=\",'Aufmaß Zeitspanvolumen Drehen'!C39,\"/f=\",'Aufmaß Zeitspanvolumen Drehen'!D39,\"/Øa=\",'Aufmaß Zeitspanvolumen Drehen'!F39,\"/L=\",'Aufmaß Zeitspanvolumen Drehen'!G39,\"/Aufmaß=\",'Aufmaß Zeitspanvolumen Drehen'!H39,\"/Øi=\",'Aufmaß Zeitspanvolumen Drehen'!I39,\"/+\",'Aufmaß Zeitspanvolumen Drehen'!E39,\"%\"))","v":0},{"$f":"'Aufmaß Zeitspanvolumen Drehen'!L39","v":0},{"$f":"'Aufmaß Zeitspanvolumen Drehen'!M39","v":0},"J"]
[{"$f":"'Aufmaß Zeitspanvolumen Drehen'!A40","v":0},{"$f":"IF(C463=0,0,CONCATENATE(\"Vc=\",'Aufmaß Zeitspanvolumen Drehen'!B40,\"/ap=\",'Aufmaß Zeitspanvolumen Drehen'!C40,\"/f=\",'Aufmaß Zeitspanvolumen Drehen'!D40,\"/Øa=\",'Aufmaß Zeitspanvolumen Drehen'!F40,\"/L=\",'Aufmaß Zeitspanvolumen Drehen'!G40,\"/Aufmaß=\",'Aufmaß Zeitspanvolumen Drehen'!H40,\"/Øi=\",'Aufmaß Zeitspanvolumen Drehen'!I40,\"/+\",'Aufmaß Zeitspanvolumen Drehen'!E40,\"%\"))","v":0},{"$f":"'Aufmaß Zeitspanvolumen Drehen'!L40","v":0},{"$f":"'Aufmaß Zeitspanvolumen Drehen'!M40","v":0},"J"]
[{"$f":"'Aufmaß Zeitspanvolumen Drehen'!A41","v":0},{"$f":"IF(C464=0,0,CONCATENATE(\"Vc=\",'Aufmaß Zeitspanvolumen Drehen'!B41,\"/ap=\",'Aufmaß Zeitspanvolumen Drehen'!C41,\"/f=\",'Aufmaß Zeitspanvolumen Drehen'!D41,\"/Øa=\",'Aufmaß Zeitspanvolumen Drehen'!F41,\"/L=\",'Aufmaß Zeitspanvolumen Drehen'!G41,\"/Aufmaß=\",'Aufmaß Zeitspanvolumen Drehen'!H41,\"/Øi=\",'Aufmaß Zeitspanvolumen Drehen'!I41,\"/+\",'Aufmaß Zeitspanvolumen Drehen'!E41,\"%\"))","v":0},{"$f":"'Aufmaß Zeitspanvolumen Drehen'!L41","v":0},{"$f":"'Aufmaß Zeitspanvolumen Drehen'!M41","v":0},"J"]
[{"$f":"'Aufmaß Zeitspanvolumen Drehen'!A42","v":0},{"$f":"IF(C465=0,0,CONCATENATE(\"Vc=\",'Aufmaß Zeitspanvolumen Drehen'!B42,\"/ap=\",'Aufmaß Zeitspanvolumen Drehen'!C42,\"/f=\",'Aufmaß Zeitspanvolumen Drehen'!D42,\"/Øa=\",'Aufmaß Zeitspanvolumen Drehen'!F42,\"/L=\",'Aufmaß Zeitspanvolumen Drehen'!G42,\"/Aufmaß=\",'Aufmaß Zeitspanvolumen Drehen'!H42,\"/Øi=\",'Aufmaß Zeitspanvolumen Drehen'!I42,\"/+\",'Aufmaß Zeitspanvolumen Drehen'!E42,\"%\"))","v":0},{"$f":"'Aufmaß Zeitspanvolumen Drehen'!L42","v":0},{"$f":"'Aufmaß Zeitspanvolumen Drehen'!M42","v":0},"J"]
[{"$f":"'Aufmaß Zeitspanvolumen Drehen'!A43","v":0},{"$f":"IF(C466=0,0,CONCATENATE(\"Vc=\",'Aufmaß Zeitspanvolumen Drehen'!B43,\"/ap=\",'Aufmaß Zeitspanvolumen Drehen'!C43,\"/f=\",'Aufmaß Zeitspanvolumen Drehen'!D43,\"/Øa=\",'Aufmaß Zeitspanvolumen Drehen'!F43,\"/L=\",'Aufmaß Zeitspanvolumen Drehen'!G43,\"/Aufmaß=\",'Aufmaß Zeitspanvolumen Drehen'!H43,\"/Øi=\",'Aufmaß Zeitspanvolumen Drehen'!I43,\"/+\",'Aufmaß Zeitspanvolumen Drehen'!E43,\"%\"))","v":0},{"$f":"'Aufmaß Zeitspanvolumen Drehen'!L43","v":0},{"$f":"'Aufmaß Zeitspanvolumen Drehen'!M43","v":0},"J"]
[{"$f":"'Aufmaß Zeitspanvolumen Drehen'!A44","v":0},{"$f":"IF(C467=0,0,CONCATENATE(\"Vc=\",'Aufmaß Zeitspanvolumen Drehen'!B44,\"/ap=\",'Aufmaß Zeitspanvolumen Drehen'!C44,\"/f=\",'Aufmaß Zeitspanvolumen Drehen'!D44,\"/Øa=\",'Aufmaß Zeitspanvolumen Drehen'!F44,\"/L=\",'Aufmaß Zeitspanvolumen Drehen'!G44,\"/Aufmaß=\",'Aufmaß Zeitspanvolumen Drehen'!H44,\"/Øi=\",'Aufmaß Zeitspanvolumen Drehen'!I44,\"/+\",'Aufmaß Zeitspanvolumen Drehen'!E44,\"%\"))","v":0},{"$f":"'Aufmaß Zeitspanvolumen Drehen'!L44","v":0},{"$f":"'Aufmaß Zeitspanvolumen Drehen'!M44","v":0},"J"]
[{"$f":"'Aufmaß Zeitspanvolumen Drehen'!A45","v":0},{"$f":"IF(C468=0,0,CONCATENATE(\"Vc=\",'Aufmaß Zeitspanvolumen Drehen'!B45,\"/ap=\",'Aufmaß Zeitspanvolumen Drehen'!C45,\"/f=\",'Aufmaß Zeitspanvolumen Drehen'!D45,\"/Øa=\",'Aufmaß Zeitspanvolumen Drehen'!F45,\"/L=\",'Aufmaß Zeitspanvolumen Drehen'!G45,\"/Aufmaß=\",'Aufmaß Zeitspanvolumen Drehen'!H45,\"/Øi=\",'Aufmaß Zeitspanvolumen Drehen'!I45,\"/+\",'Aufmaß Zeitspanvolumen Drehen'!E45,\"%\"))","v":0},{"$f":"'Aufmaß Zeitspanvolumen Drehen'!L45","v":0},{"$f":"'Aufmaß Zeitspanvolumen Drehen'!M45","v":0},"J"]
[{"$f":"'Aufmaß Zeitspanvolumen Drehen'!A46","v":0},{"$f":"IF(C469=0,0,CONCATENATE(\"Vc=\",'Aufmaß Zeitspanvolumen Drehen'!B46,\"/ap=\",'Aufmaß Zeitspanvolumen Drehen'!C46,\"/f=\",'Aufmaß Zeitspanvolumen Drehen'!D46,\"/Øa=\",'Aufmaß Zeitspanvolumen Drehen'!F46,\"/L=\",'Aufmaß Zeitspanvolumen Drehen'!G46,\"/Aufmaß=\",'Aufmaß Zeitspanvolumen Drehen'!H46,\"/Øi=\",'Aufmaß Zeitspanvolumen Drehen'!I46,\"/+\",'Aufmaß Zeitspanvolumen Drehen'!E46,\"%\"))","v":0},{"$f":"'Aufmaß Zeitspanvolumen Drehen'!L46","v":0},{"$f":"'Aufmaß Zeitspanvolumen Drehen'!M46","v":0},"J"]
[{"$f":"'Aufmaß Zeitspanvolumen Drehen'!A47","v":0},{"$f":"IF(C470=0,0,CONCATENATE(\"Vc=\",'Aufmaß Zeitspanvolumen Drehen'!B47,\"/ap=\",'Aufmaß Zeitspanvolumen Drehen'!C47,\"/f=\",'Aufmaß Zeitspanvolumen Drehen'!D47,\"/Øa=\",'Aufmaß Zeitspanvolumen Drehen'!F47,\"/L=\",'Aufmaß Zeitspanvolumen Drehen'!G47,\"/Aufmaß=\",'Aufmaß Zeitspanvolumen Drehen'!H47,\"/Øi=\",'Aufmaß Zeitspanvolumen Drehen'!I47,\"/+\",'Aufmaß Zeitspanvolumen Drehen'!E47,\"%\"))","v":0},{"$f":"'Aufmaß Zeitspanvolumen Drehen'!L47","v":0},{"$f":"'Aufmaß Zeitspanvolumen Drehen'!M47","v":0},"J"]
[{"$f":"'Aufmaß Zeitspanvolumen Drehen'!A48","v":0},{"$f":"IF(C471=0,0,CONCATENATE(\"Vc=\",'Aufmaß Zeitspanvolumen Drehen'!B48,\"/ap=\",'Aufmaß Zeitspanvolumen Drehen'!C48,\"/f=\",'Aufmaß Zeitspanvolumen Drehen'!D48,\"/Øa=\",'Aufmaß Zeitspanvolumen Drehen'!F48,\"/L=\",'Aufmaß Zeitspanvolumen Drehen'!G48,\"/Aufmaß=\",'Aufmaß Zeitspanvolumen Drehen'!H48,\"/Øi=\",'Aufmaß Zeitspanvolumen Drehen'!I48,\"/+\",'Aufmaß Zeitspanvolumen Drehen'!E48,\"%\"))","v":0},{"$f":"'Aufmaß Zeitspanvolumen Drehen'!L48","v":0},{"$f":"'Aufmaß Zeitspanvolumen Drehen'!M48","v":0},"J"]
[{"$f":"'Aufmaß Zeitspanvolumen Drehen'!A49","v":0},{"$f":"IF(C472=0,0,CONCATENATE(\"Vc=\",'Aufmaß Zeitspanvolumen Drehen'!B49,\"/ap=\",'Aufmaß Zeitspanvolumen Drehen'!C49,\"/f=\",'Aufmaß Zeitspanvolumen Drehen'!D49,\"/Øa=\",'Aufmaß Zeitspanvolumen Drehen'!F49,\"/L=\",'Aufmaß Zeitspanvolumen Drehen'!G49,\"/Aufmaß=\",'Aufmaß Zeitspanvolumen Drehen'!H49,\"/Øi=\",'Aufmaß Zeitspanvolumen Drehen'!I49,\"/+\",'Aufmaß Zeitspanvolumen Drehen'!E49,\"%\"))","v":0},{"$f":"'Aufmaß Zeitspanvolumen Drehen'!L49","v":0},{"$f":"'Aufmaß Zeitspanvolumen Drehen'!M49","v":0},"J"]
[{"$f":"'Aufmaß Zeitspanvolumen Drehen'!A50","v":0},{"$f":"IF(C473=0,0,CONCATENATE(\"Vc=\",'Aufmaß Zeitspanvolumen Drehen'!B50,\"/ap=\",'Aufmaß Zeitspanvolumen Drehen'!C50,\"/f=\",'Aufmaß Zeitspanvolumen Drehen'!D50,\"/Øa=\",'Aufmaß Zeitspanvolumen Drehen'!F50,\"/L=\",'Aufmaß Zeitspanvolumen Drehen'!G50,\"/Aufmaß=\",'Aufmaß Zeitspanvolumen Drehen'!H50,\"/Øi=\",'Aufmaß Zeitspanvolumen Drehen'!I50,\"/+\",'Aufmaß Zeitspanvolumen Drehen'!E50,\"%\"))","v":0},{"$f":"'Aufmaß Zeitspanvolumen Drehen'!L50","v":0},{"$f":"'Aufmaß Zeitspanvolumen Drehen'!M50","v":0},"J"]
[{"$f":"'Aufmaß Zeitspanvolumen Drehen'!A51","v":0},{"$f":"IF(C474=0,0,CONCATENATE(\"Vc=\",'Aufmaß Zeitspanvolumen Drehen'!B51,\"/ap=\",'Aufmaß Zeitspanvolumen Drehen'!C51,\"/f=\",'Aufmaß Zeitspanvolumen Drehen'!D51,\"/Øa=\",'Aufmaß Zeitspanvolumen Drehen'!F51,\"/L=\",'Aufmaß Zeitspanvolumen Drehen'!G51,\"/Aufmaß=\",'Aufmaß Zeitspanvolumen Drehen'!H51,\"/Øi=\",'Aufmaß Zeitspanvolumen Drehen'!I51,\"/+\",'Aufmaß Zeitspanvolumen Drehen'!E51,\"%\"))","v":0},{"$f":"'Aufmaß Zeitspanvolumen Drehen'!L51","v":0},{"$f":"'Aufmaß Zeitspanvolumen Drehen'!M51","v":0},"J"]
[{"$f":"'Aufmaß Zeitspanvolumen Drehen'!A52","v":0},{"$f":"IF(C475=0,0,CONCATENATE(\"Vc=\",'Aufmaß Zeitspanvolumen Drehen'!B52,\"/ap=\",'Aufmaß Zeitspanvolumen Drehen'!C52,\"/f=\",'Aufmaß Zeitspanvolumen Drehen'!D52,\"/Øa=\",'Aufmaß Zeitspanvolumen Drehen'!F52,\"/L=\",'Aufmaß Zeitspanvolumen Drehen'!G52,\"/Aufmaß=\",'Aufmaß Zeitspanvolumen Drehen'!H52,\"/Øi=\",'Aufmaß Zeitspanvolumen Drehen'!I52,\"/+\",'Aufmaß Zeitspanvolumen Drehen'!E52,\"%\"))","v":0},{"$f":"'Aufmaß Zeitspanvolumen Drehen'!L52","v":0},{"$f":"'Aufmaß Zeitspanvolumen Drehen'!M52","v":0},"J"]
[{"$f":"'Aufmaß Zeitspanvolumen Drehen'!A53","v":0},{"$f":"IF(C476=0,0,CONCATENATE(\"Vc=\",'Aufmaß Zeitspanvolumen Drehen'!B53,\"/ap=\",'Aufmaß Zeitspanvolumen Drehen'!C53,\"/f=\",'Aufmaß Zeitspanvolumen Drehen'!D53,\"/Øa=\",'Aufmaß Zeitspanvolumen Drehen'!F53,\"/L=\",'Aufmaß Zeitspanvolumen Drehen'!G53,\"/Aufmaß=\",'Aufmaß Zeitspanvolumen Drehen'!H53,\"/Øi=\",'Aufmaß Zeitspanvolumen Drehen'!I53,\"/+\",'Aufmaß Zeitspanvolumen Drehen'!E53,\"%\"))","v":0},{"$f":"'Aufmaß Zeitspanvolumen Drehen'!L53","v":0},{"$f":"'Aufmaß Zeitspanvolumen Drehen'!M53","v":0},"J"]
[{"$f":"'Aufmaß Zeitspanvolumen Drehen'!A54","v":0},{"$f":"IF(C477=0,0,CONCATENATE(\"Vc=\",'Aufmaß Zeitspanvolumen Drehen'!B54,\"/ap=\",'Aufmaß Zeitspanvolumen Drehen'!C54,\"/f=\",'Aufmaß Zeitspanvolumen Drehen'!D54,\"/Øa=\",'Aufmaß Zeitspanvolumen Drehen'!F54,\"/L=\",'Aufmaß Zeitspanvolumen Drehen'!G54,\"/Aufmaß=\",'Aufmaß Zeitspanvolumen Drehen'!H54,\"/Øi=\",'Aufmaß Zeitspanvolumen Drehen'!I54,\"/+\",'Aufmaß Zeitspanvolumen Drehen'!E54,\"%\"))","v":0},{"$f":"'Aufmaß Zeitspanvolumen Drehen'!L54","v":0},{"$f":"'Aufmaß Zeitspanvolumen Drehen'!M54","v":0},"J"]
[{"$f":"'Aufmaß Zeitspanvolumen Drehen'!A55","v":0},{"$f":"IF(C478=0,0,CONCATENATE(\"Vc=\",'Aufmaß Zeitspanvolumen Drehen'!B55,\"/ap=\",'Aufmaß Zeitspanvolumen Drehen'!C55,\"/f=\",'Aufmaß Zeitspanvolumen Drehen'!D55,\"/Øa=\",'Aufmaß Zeitspanvolumen Drehen'!F55,\"/L=\",'Aufmaß Zeitspanvolumen Drehen'!G55,\"/Aufmaß=\",'Aufmaß Zeitspanvolumen Drehen'!H55,\"/Øi=\",'Aufmaß Zeitspanvolumen Drehen'!I55,\"/+\",'Aufmaß Zeitspanvolumen Drehen'!E55,\"%\"))","v":0},{"$f":"'Aufmaß Zeitspanvolumen Drehen'!L55","v":0},{"$f":"'Aufmaß Zeitspanvolumen Drehen'!M55","v":0},"J"]
[{"$f":"'Aufmaß Zeitspanvolumen Drehen'!A56","v":0},{"$f":"IF(C479=0,0,CONCATENATE(\"Vc=\",'Aufmaß Zeitspanvolumen Drehen'!B56,\"/ap=\",'Aufmaß Zeitspanvolumen Drehen'!C56,\"/f=\",'Aufmaß Zeitspanvolumen Drehen'!D56,\"/Øa=\",'Aufmaß Zeitspanvolumen Drehen'!F56,\"/L=\",'Aufmaß Zeitspanvolumen Drehen'!G56,\"/Aufmaß=\",'Aufmaß Zeitspanvolumen Drehen'!H56,\"/Øi=\",'Aufmaß Zeitspanvolumen Drehen'!I56,\"/+\",'Aufmaß Zeitspanvolumen Drehen'!E56,\"%\"))","v":0},{"$f":"'Aufmaß Zeitspanvolumen Drehen'!L56","v":0},{"$f":"'Aufmaß Zeitspanvolumen Drehen'!M56","v":0},"J"]
[{"$f":"'Aufmaß Zeitspanvolumen Drehen'!A57","v":0},{"$f":"IF(C480=0,0,CONCATENATE(\"Vc=\",'Aufmaß Zeitspanvolumen Drehen'!B57,\"/ap=\",'Aufmaß Zeitspanvolumen Drehen'!C57,\"/f=\",'Aufmaß Zeitspanvolumen Drehen'!D57,\"/Øa=\",'Aufmaß Zeitspanvolumen Drehen'!F57,\"/L=\",'Aufmaß Zeitspanvolumen Drehen'!G57,\"/Aufmaß=\",'Aufmaß Zeitspanvolumen Drehen'!H57,\"/Øi=\",'Aufmaß Zeitspanvolumen Drehen'!I57,\"/+\",'Aufmaß Zeitspanvolumen Drehen'!E57,\"%\"))","v":0},{"$f":"'Aufmaß Zeitspanvolumen Drehen'!L57","v":0},{"$f":"'Aufmaß Zeitspanvolumen Drehen'!M57","v":0},"J"]
[{"$f":"'Aufmaß Zeitspanvolumen Drehen'!A58","v":0},{"$f":"IF(C481=0,0,CONCATENATE(\"Vc=\",'Aufmaß Zeitspanvolumen Drehen'!B58,\"/ap=\",'Aufmaß Zeitspanvolumen Drehen'!C58,\"/f=\",'Aufmaß Zeitspanvolumen Drehen'!D58,\"/Øa=\",'Aufmaß Zeitspanvolumen Drehen'!F58,\"/L=\",'Aufmaß Zeitspanvolumen Drehen'!G58,\"/Aufmaß=\",'Aufmaß Zeitspanvolumen Drehen'!H58,\"/Øi=\",'Aufmaß Zeitspanvolumen Drehen'!I58,\"/+\",'Aufmaß Zeitspanvolumen Drehen'!E58,\"%\"))","v":0},{"$f":"'Aufmaß Zeitspanvolumen Drehen'!L58","v":0},{"$f":"'Aufmaß Zeitspanvolumen Drehen'!M58","v":0},"J"]
[null,null,null,null,{"$f":"IF(B429=0,\"J\",\"N\")","v":"J"}]
[{"$f":"'TGM Fräsen_F pro Zahn'!A2","v":"Schnittzeitberechnung Fräsen (F pro Zahn)"},null,null,null,{"$f":"IF(B484=0,\"J\",\"N\")","v":"J"}]
["Gesamtzeit in Minuten =",{"$f":"'TGM Fräsen_F pro Zahn'!I2","v":0},null,null,{"$f":"IF(B484=0,\"J\",\"N\")","v":"J"}]
["Bemerkung","Fräslänge mit Vorschub pro Minute","Anzahl der Schnitte","Zeit",{"$f":"IF(B484=0,\"J\",\"N\")","v":"J"}]
[{"$f":"'TGM Fräsen_F pro Zahn'!A6","v":0},{"$f":"IF(C486=0,0,CONCATENATE('TGM Fräsen_F pro Zahn'!D6,\"mm mit \",'TGM Fräsen_F pro Zahn'!G6,\"mm/Min.\"))","v":0},{"$f":"'TGM Fräsen_F pro Zahn'!E6","v":0},{"$f":"'TGM Fräsen_F pro Zahn'!H6","v":0},{"$f":"IF(D486=0,\"J\",\"N\")","v":"J"}]
[{"$f":"'TGM Fräsen_F pro Zahn'!A7","v":0},{"$f":"IF(C487=0,0,CONCATENATE('TGM Fräsen_F pro Zahn'!D7,\"mm mit \",'TGM Fräsen_F pro Zahn'!G7,\"mm/Min.\"))","v":0},{"$f":"'TGM Fräsen_F pro Zahn'!E7","v":0},{"$f":"'TGM Fräsen_F pro Zahn'!H7","v":0},"J"]
[{"$f":"'TGM Fräsen_F pro Zahn'!A8","v":0},{"$f":"IF(C488=0,0,CONCATENATE('TGM Fräsen_F pro Zahn'!D8,\"mm mit \",'TGM Fräsen_F pro Zahn'!G8,\"mm/Min.\"))","v":0},{"$f":"'TGM Fräsen_F pro Zahn'!E8","v":0},{"$f":"'TGM Fräsen_F pro Zahn'!H8","v":0},"J"]
[{"$f":"'TGM Fräsen_F pro Zahn'!A9","v":0},{"$f":"IF(C489=0,0,CONCATENATE('TGM Fräsen_F pro Zahn'!D9,\"mm mit \",'TGM Fräsen_F pro Zahn'!G9,\"mm/Min.\"))","v":0},{"$f":"'TGM Fräsen_F pro Zahn'!E9","v":0},{"$f":"'TGM Fräsen_F pro Zahn'!H9","v":0},"J"]
[{"$f":"'TGM Fräsen_F pro Zahn'!A10","v":0},{"$f":"IF(C490=0,0,CONCATENATE('TGM Fräsen_F pro Zahn'!D10,\"mm mit \",'TGM Fräsen_F pro Zahn'!G10,\"mm/Min.\"))","v":0},{"$f":"'TGM Fräsen_F pro Zahn'!E10","v":0},{"$f":"'TGM Fräsen_F pro Zahn'!H10","v":0},"J"]
[{"$f":"'TGM Fräsen_F pro Zahn'!A11","v":0},{"$f":"IF(C491=0,0,CONCATENATE('TGM Fräsen_F pro Zahn'!D11,\"mm mit \",'TGM Fräsen_F pro Zahn'!G11,\"mm/Min.\"))","v":0},{"$f":"'TGM Fräsen_F pro Zahn'!E11","v":0},{"$f":"'TGM Fräsen_F pro Zahn'!H11","v":0},"J"]
[{"$f":"'TGM Fräsen_F pro Zahn'!A12","v":0},{"$f":"IF(C492=0,0,CONCATENATE('TGM Fräsen_F pro Zahn'!D12,\"mm mit \",'TGM Fräsen_F pro Zahn'!G12,\"mm/Min.\"))","v":0},{"$f":"'TGM Fräsen_F pro Zahn'!E12","v":0},{"$f":"'TGM Fräsen_F pro Zahn'!H12","v":0},"J"]
[{"$f":"'TGM Fräsen_F pro Zahn'!A13","v":0},{"$f":"IF(C493=0,0,CONCATENATE('TGM Fräsen_F pro Zahn'!D13,\"mm mit \",'TGM Fräsen_F pro Zahn'!G13,\"mm/Min.\"))","v":0},{"$f":"'TGM Fräsen_F pro Zahn'!E13","v":0},{"$f":"'TGM Fräsen_F pro Zahn'!H13","v":0},"J"]
[{"$f":"'TGM Fräsen_F pro Zahn'!A14","v":0},{"$f":"IF(C494=0,0,CONCATENATE('TGM Fräsen_F pro Zahn'!D14,\"mm mit \",'TGM Fräsen_F pro Zahn'!G14,\"mm/Min.\"))","v":0},{"$f":"'TGM Fräsen_F pro Zahn'!E14","v":0},{"$f":"'TGM Fräsen_F pro Zahn'!H14","v":0},"J"]
[{"$f":"'TGM Fräsen_F pro Zahn'!A15","v":0},{"$f":"IF(C495=0,0,CONCATENATE('TGM Fräsen_F pro Zahn'!D15,\"mm mit \",'TGM Fräsen_F pro Zahn'!G15,\"mm/Min.\"))","v":0},{"$f":"'TGM Fräsen_F pro Zahn'!E15","v":0},{"$f":"'TGM Fräsen_F pro Zahn'!H15","v":0},"J"]
[{"$f":"'TGM Fräsen_F pro Zahn'!A16","v":0},{"$f":"IF(C496=0,0,CONCATENATE('TGM Fräsen_F pro Zahn'!D16,\"mm mit \",'TGM Fräsen_F pro Zahn'!G16,\"mm/Min.\"))","v":0},{"$f":"'TGM Fräsen_F pro Zahn'!E16","v":0},{"$f":"'TGM Fräsen_F pro Zahn'!H16","v":0},"J"]
[{"$f":"'TGM Fräsen_F pro Zahn'!A17","v":0},{"$f":"IF(C497=0,0,CONCATENATE('TGM Fräsen_F pro Zahn'!D17,\"mm mit \",'TGM Fräsen_F pro Zahn'!G17,\"mm/Min.\"))","v":0},{"$f":"'TGM Fräsen_F pro Zahn'!E17","v":0},{"$f":"'TGM Fräsen_F pro Zahn'!H17","v":0},"J"]
[{"$f":"'TGM Fräsen_F pro Zahn'!A18","v":0},{"$f":"IF(C498=0,0,CONCATENATE('TGM Fräsen_F pro Zahn'!D18,\"mm mit \",'TGM Fräsen_F pro Zahn'!G18,\"mm/Min.\"))","v":0},{"$f":"'TGM Fräsen_F pro Zahn'!E18","v":0},{"$f":"'TGM Fräsen_F pro Zahn'!H18","v":0},"J"]
[{"$f":"'TGM Fräsen_F pro Zahn'!A19","v":0},{"$f":"IF(C499=0,0,CONCATENATE('TGM Fräsen_F pro Zahn'!D19,\"mm mit \",'TGM Fräsen_F pro Zahn'!G19,\"mm/Min.\"))","v":0},{"$f":"'TGM Fräsen_F pro Zahn'!E19","v":0},{"$f":"'TGM Fräsen_F pro Zahn'!H19","v":0},"J"]
[{"$f":"'TGM Fräsen_F pro Zahn'!A20","v":0},{"$f":"IF(C500=0,0,CONCATENATE('TGM Fräsen_F pro Zahn'!D20,\"mm mit \",'TGM Fräsen_F pro Zahn'!G20,\"mm/Min.\"))","v":0},{"$f":"'TGM Fräsen_F pro Zahn'!E20","v":0},{"$f":"'TGM Fräsen_F pro Zahn'!H20","v":0},"J"]
[{"$f":"'TGM Fräsen_F pro Zahn'!A21","v":0},{"$f":"IF(C501=0,0,CONCATENATE('TGM Fräsen_F pro Zahn'!D21,\"mm mit \",'TGM Fräsen_F pro Zahn'!G21,\"mm/Min.\"))","v":0},{"$f":"'TGM Fräsen_F pro Zahn'!E21","v":0},{"$f":"'TGM Fräsen_F pro Zahn'!H21","v":0},"J"]
[{"$f":"'TGM Fräsen_F pro Zahn'!A22","v":0},{"$f":"IF(C502=0,0,CONCATENATE('TGM Fräsen_F pro Zahn'!D22,\"mm mit \",'TGM Fräsen_F pro Zahn'!G22,\"mm/Min.\"))","v":0},{"$f":"'TGM Fräsen_F pro Zahn'!E22","v":0},{"$f":"'TGM Fräsen_F pro Zahn'!H22","v":0},"J"]
[{"$f":"'TGM Fräsen_F pro Zahn'!A23","v":0},{"$f":"IF(C503=0,0,CONCATENATE('TGM Fräsen_F pro Zahn'!D23,\"mm mit \",'TGM Fräsen_F pro Zahn'!G23,\"mm/Min.\"))","v":0},{"$f":"'TGM Fräsen_F pro Zahn'!E23","v":0},{"$f":"'TGM Fräsen_F pro Zahn'!H23","v":0},"J"]
[{"$f":"'TGM Fräsen_F pro Zahn'!A24","v":0},{"$f":"IF(C504=0,0,CONCATENATE('TGM Fräsen_F pro Zahn'!D24,\"mm mit \",'TGM Fräsen_F pro Zahn'!G24,\"mm/Min.\"))","v":0},{"$f":"'TGM Fräsen_F pro Zahn'!E24","v":0},{"$f":"'TGM Fräsen_F pro Zahn'!H24","v":0},"J"]
[{"$f":"'TGM Fräsen_F pro Zahn'!A25","v":0},{"$f":"IF(C505=0,0,CONCATENATE('TGM Fräsen_F pro Zahn'!D25,\"mm mit \",'TGM Fräsen_F pro Zahn'!G25,\"mm/Min.\"))","v":0},{"$f":"'TGM Fräsen_F pro Zahn'!E25","v":0},{"$f":"'TGM Fräsen_F pro Zahn'!H25","v":0},"J"]
[{"$f":"'TGM Fräsen_F pro Zahn'!A26","v":0},{"$f":"IF(C506=0,0,CONCATENATE('TGM Fräsen_F pro Zahn'!D26,\"mm mit \",'TGM Fräsen_F pro Zahn'!G26,\"mm/Min.\"))","v":0},{"$f":"'TGM Fräsen_F pro Zahn'!E26","v":0},{"$f":"'TGM Fräsen_F pro Zahn'!H26","v":0},"J"]
[{"$f":"'TGM Fräsen_F pro Zahn'!A27","v":0},{"$f":"IF(C507=0,0,CONCATENATE('TGM Fräsen_F pro Zahn'!D27,\"mm mit \",'TGM Fräsen_F pro Zahn'!G27,\"mm/Min.\"))","v":0},{"$f":"'TGM Fräsen_F pro Zahn'!E27","v":0},{"$f":"'TGM Fräsen_F pro Zahn'!H27","v":0},"J"]
[{"$f":"'TGM Fräsen_F pro Zahn'!A28","v":0},{"$f":"IF(C508=0,0,CONCATENATE('TGM Fräsen_F pro Zahn'!D28,\"mm mit \",'TGM Fräsen_F pro Zahn'!G28,\"mm/Min.\"))","v":0},{"$f":"'TGM Fräsen_F pro Zahn'!E28","v":0},{"$f":"'TGM Fräsen_F pro Zahn'!H28","v":0},"J"]
[{"$f":"'TGM Fräsen_F pro Zahn'!A29","v":0},{"$f":"IF(C509=0,0,CONCATENATE('TGM Fräsen_F pro Zahn'!D29,\"mm mit \",'TGM Fräsen_F pro Zahn'!G29,\"mm/Min.\"))","v":0},{"$f":"'TGM Fräsen_F pro Zahn'!E29","v":0},{"$f":"'TGM Fräsen_F pro Zahn'!H29","v":0},"J"]
[{"$f":"'TGM Fräsen_F pro Zahn'!A30","v":0},{"$f":"IF(C510=0,0,CONCATENATE('TGM Fräsen_F pro Zahn'!D30,\"mm mit \",'TGM Fräsen_F pro Zahn'!G30,\"mm/Min.\"))","v":0},{"$f":"'TGM Fräsen_F pro Zahn'!E30","v":0},{"$f":"'TGM Fräsen_F pro Zahn'!H30","v":0},"J"]
[{"$f":"'TGM Fräsen_F pro Zahn'!A31","v":0},{"$f":"IF(C511=0,0,CONCATENATE('TGM Fräsen_F pro Zahn'!D31,\"mm mit \",'TGM Fräsen_F pro Zahn'!G31,\"mm/Min.\"))","v":0},{"$f":"'TGM Fräsen_F pro Zahn'!E31","v":0},{"$f":"'TGM Fräsen_F pro Zahn'!H31","v":0},"J"]
[{"$f":"'TGM Fräsen_F pro Zahn'!A32","v":0},{"$f":"IF(C512=0,0,CONCATENATE('TGM Fräsen_F pro Zahn'!D32,\"mm mit \",'TGM Fräsen_F pro Zahn'!G32,\"mm/Min.\"))","v":0},{"$f":"'TGM Fräsen_F pro Zahn'!E32","v":0},{"$f":"'TGM Fräsen_F pro Zahn'!H32","v":0},"J"]
[{"$f":"'TGM Fräsen_F pro Zahn'!A33","v":0},{"$f":"IF(C513=0,0,CONCATENATE('TGM Fräsen_F pro Zahn'!D33,\"mm mit \",'TGM Fräsen_F pro Zahn'!G33,\"mm/Min.\"))","v":0},{"$f":"'TGM Fräsen_F pro Zahn'!E33","v":0},{"$f":"'TGM Fräsen_F pro Zahn'!H33","v":0},"J"]
[{"$f":"'TGM Fräsen_F pro Zahn'!A34","v":0},{"$f":"IF(C514=0,0,CONCATENATE('TGM Fräsen_F pro Zahn'!D34,\"mm mit \",'TGM Fräsen_F pro Zahn'!G34,\"mm/Min.\"))","v":0},{"$f":"'TGM Fräsen_F pro Zahn'!E34","v":0},{"$f":"'TGM Fräsen_F pro Zahn'!H34","v":0},"J"]
[{"$f":"'TGM Fräsen_F pro Zahn'!A35","v":0},{"$f":"IF(C515=0,0,CONCATENATE('TGM Fräsen_F pro Zahn'!D35,\"mm mit \",'TGM Fräsen_F pro Zahn'!G35,\"mm/Min.\"))","v":0},{"$f":"'TGM Fräsen_F pro Zahn'!E35","v":0},{"$f":"'TGM Fräsen_F pro Zahn'!H35","v":0},"J"]
[{"$f":"'TGM Fräsen_F pro Zahn'!A36","v":0},{"$f":"IF(C516=0,0,CONCATENATE('TGM Fräsen_F pro Zahn'!D36,\"mm mit \",'TGM Fräsen_F pro Zahn'!G36,\"mm/Min.\"))","v":0},{"$f":"'TGM Fräsen_F pro Zahn'!E36","v":0},{"$f":"'TGM Fräsen_F pro Zahn'!H36","v":0},"J"]
[{"$f":"'TGM Fräsen_F pro Zahn'!A37","v":0},{"$f":"IF(C517=0,0,CONCATENATE('TGM Fräsen_F pro Zahn'!D37,\"mm mit \",'TGM Fräsen_F pro Zahn'!G37,\"mm/Min.\"))","v":0},{"$f":"'TGM Fräsen_F pro Zahn'!E37","v":0},{"$f":"'TGM Fräsen_F pro Zahn'!H37","v":0},"J"]
[{"$f":"'TGM Fräsen_F pro Zahn'!A38","v":0},{"$f":"IF(C518=0,0,CONCATENATE('TGM Fräsen_F pro Zahn'!D38,\"mm mit \",'TGM Fräsen_F pro Zahn'!G38,\"mm/Min.\"))","v":0},{"$f":"'TGM Fräsen_F pro Zahn'!E38","v":0},{"$f":"'TGM Fräsen_F pro Zahn'!H38","v":0},"J"]
[{"$f":"'TGM Fräsen_F pro Zahn'!A39","v":0},{"$f":"IF(C519=0,0,CONCATENATE('TGM Fräsen_F pro Zahn'!D39,\"mm mit \",'TGM Fräsen_F pro Zahn'!G39,\"mm/Min.\"))","v":0},{"$f":"'TGM Fräsen_F pro Zahn'!E39","v":0},{"$f":"'TGM Fräsen_F pro Zahn'!H39","v":0},"J"]
[{"$f":"'TGM Fräsen_F pro Zahn'!A40","v":0},{"$f":"IF(C520=0,0,CONCATENATE('TGM Fräsen_F pro Zahn'!D40,\"mm mit \",'TGM Fräsen_F pro Zahn'!G40,\"mm/Min.\"))","v":0},{"$f":"'TGM Fräsen_F pro Zahn'!E40","v":0},{"$f":"'TGM Fräsen_F pro Zahn'!H40","v":0},"J"]
[{"$f":"'TGM Fräsen_F pro Zahn'!A41","v":0},{"$f":"IF(C521=0,0,CONCATENATE('TGM Fräsen_F pro Zahn'!D41,\"mm mit \",'TGM Fräsen_F pro Zahn'!G41,\"mm/Min.\"))","v":0},{"$f":"'TGM Fräsen_F pro Zahn'!E41","v":0},{"$f":"'TGM Fräsen_F pro Zahn'!H41","v":0},"J"]
[{"$f":"'TGM Fräsen_F pro Zahn'!A42","v":0},{"$f":"IF(C522=0,0,CONCATENATE('TGM Fräsen_F pro Zahn'!D42,\"mm mit \",'TGM Fräsen_F pro Zahn'!G42,\"mm/Min.\"))","v":0},{"$f":"'TGM Fräsen_F pro Zahn'!E42","v":0},{"$f":"'TGM Fräsen_F pro Zahn'!H42","v":0},"J"]
[{"$f":"'TGM Fräsen_F pro Zahn'!A43","v":0},{"$f":"IF(C523=0,0,CONCATENATE('TGM Fräsen_F pro Zahn'!D43,\"mm mit \",'TGM Fräsen_F pro Zahn'!G43,\"mm/Min.\"))","v":0},{"$f":"'TGM Fräsen_F pro Zahn'!E43","v":0},{"$f":"'TGM Fräsen_F pro Zahn'!H43","v":0},"J"]
[{"$f":"'TGM Fräsen_F pro Zahn'!A44","v":0},{"$f":"IF(C524=0,0,CONCATENATE('TGM Fräsen_F pro Zahn'!D44,\"mm mit \",'TGM Fräsen_F pro Zahn'!G44,\"mm/Min.\"))","v":0},{"$f":"'TGM Fräsen_F pro Zahn'!E44","v":0},{"$f":"'TGM Fräsen_F pro Zahn'!H44","v":0},"J"]
[{"$f":"'TGM Fräsen_F pro Zahn'!A45","v":0},{"$f":"IF(C525=0,0,CONCATENATE('TGM Fräsen_F pro Zahn'!D45,\"mm mit \",'TGM Fräsen_F pro Zahn'!G45,\"mm/Min.\"))","v":0},{"$f":"'TGM Fräsen_F pro Zahn'!E45","v":0},{"$f":"'TGM Fräsen_F pro Zahn'!H45","v":0},"J"]
[{"$f":"'TGM Fräsen_F pro Zahn'!A46","v":0},{"$f":"IF(C526=0,0,CONCATENATE('TGM Fräsen_F pro Zahn'!D46,\"mm mit \",'TGM Fräsen_F pro Zahn'!G46,\"mm/Min.\"))","v":0},{"$f":"'TGM Fräsen_F pro Zahn'!E46","v":0},{"$f":"'TGM Fräsen_F pro Zahn'!H46","v":0},"J"]
[{"$f":"'TGM Fräsen_F pro Zahn'!A47","v":0},{"$f":"IF(C527=0,0,CONCATENATE('TGM Fräsen_F pro Zahn'!D47,\"mm mit \",'TGM Fräsen_F pro Zahn'!G47,\"mm/Min.\"))","v":0},{"$f":"'TGM Fräsen_F pro Zahn'!E47","v":0},{"$f":"'TGM Fräsen_F pro Zahn'!H47","v":0},"J"]
[{"$f":"'TGM Fräsen_F pro Zahn'!A48","v":0},{"$f":"IF(C528=0,0,CONCATENATE('TGM Fräsen_F pro Zahn'!D48,\"mm mit \",'TGM Fräsen_F pro Zahn'!G48,\"mm/Min.\"))","v":0},{"$f":"'TGM Fräsen_F pro Zahn'!E48","v":0},{"$f":"'TGM Fräsen_F pro Zahn'!H48","v":0},"J"]
[{"$f":"'TGM Fräsen_F pro Zahn'!A49","v":0},{"$f":"IF(C529=0,0,CONCATENATE('TGM Fräsen_F pro Zahn'!D49,\"mm mit \",'TGM Fräsen_F pro Zahn'!G49,\"mm/Min.\"))","v":0},{"$f":"'TGM Fräsen_F pro Zahn'!E49","v":0},{"$f":"'TGM Fräsen_F pro Zahn'!H49","v":0},"J"]
[{"$f":"'TGM Fräsen_F pro Zahn'!A50","v":0},{"$f":"IF(C530=0,0,CONCATENATE('TGM Fräsen_F pro Zahn'!D50,\"mm mit \",'TGM Fräsen_F pro Zahn'!G50,\"mm/Min.\"))","v":0},{"$f":"'TGM Fräsen_F pro Zahn'!E50","v":0},{"$f":"'TGM Fräsen_F pro Zahn'!H50","v":0},"J"]
[{"$f":"'TGM Fräsen_F pro Zahn'!A51","v":0},{"$f":"IF(C531=0,0,CONCATENATE('TGM Fräsen_F pro Zahn'!D51,\"mm mit \",'TGM Fräsen_F pro Zahn'!G51,\"mm/Min.\"))","v":0},{"$f":"'TGM Fräsen_F pro Zahn'!E51","v":0},{"$f":"'TGM Fräsen_F pro Zahn'!H51","v":0},"J"]
[{"$f":"'TGM Fräsen_F pro Zahn'!A52","v":0},{"$f":"IF(C532=0,0,CONCATENATE('TGM Fräsen_F pro Zahn'!D52,\"mm mit \",'TGM Fräsen_F pro Zahn'!G52,\"mm/Min.\"))","v":0},{"$f":"'TGM Fräsen_F pro Zahn'!E52","v":0},{"$f":"'TGM Fräsen_F pro Zahn'!H52","v":0},"J"]
[{"$f":"'TGM Fräsen_F pro Zahn'!A53","v":0},{"$f":"IF(C533=0,0,CONCATENATE('TGM Fräsen_F pro Zahn'!D53,\"mm mit \",'TGM Fräsen_F pro Zahn'!G53,\"mm/Min.\"))","v":0},{"$f":"'TGM Fräsen_F pro Zahn'!E53","v":0},{"$f":"'TGM Fräsen_F pro Zahn'!H53","v":0},"J"]
[{"$f":"'TGM Fräsen_F pro Zahn'!A54","v":0},{"$f":"IF(C534=0,0,CONCATENATE('TGM Fräsen_F pro Zahn'!D54,\"mm mit \",'TGM Fräsen_F pro Zahn'!G54,\"mm/Min.\"))","v":0},{"$f":"'TGM Fräsen_F pro Zahn'!E54","v":0},{"$f":"'TGM Fräsen_F pro Zahn'!H54","v":0},"J"]
[{"$f":"'TGM Fräsen_F pro Zahn'!A55","v":0},{"$f":"IF(C535=0,0,CONCATENATE('TGM Fräsen_F pro Zahn'!D55,\"mm mit \",'TGM Fräsen_F pro Zahn'!G55,\"mm/Min.\"))","v":0},{"$f":"'TGM Fräsen_F pro Zahn'!E55","v":0},{"$f":"'TGM Fräsen_F pro Zahn'!H55","v":0},"J"]
[{"$f":"'TGM Fräsen_F pro Zahn'!A56","v":0},{"$f":"IF(C536=0,0,CONCATENATE('TGM Fräsen_F pro Zahn'!D56,\"mm mit \",'TGM Fräsen_F pro Zahn'!G56,\"mm/Min.\"))","v":0},{"$f":"'TGM Fräsen_F pro Zahn'!E56","v":0},{"$f":"'TGM Fräsen_F pro Zahn'!H56","v":0},"J"]
[{"$f":"'TGM Fräsen_F pro Zahn'!A57","v":0},{"$f":"IF(C537=0,0,CONCATENATE('TGM Fräsen_F pro Zahn'!D57,\"mm mit \",'TGM Fräsen_F pro Zahn'!G57,\"mm/Min.\"))","v":0},{"$f":"'TGM Fräsen_F pro Zahn'!E57","v":0},{"$f":"'TGM Fräsen_F pro Zahn'!H57","v":0},"J"]
[{"$f":"'TGM Fräsen_F pro Zahn'!A58","v":0},{"$f":"IF(C538=0,0,CONCATENATE('TGM Fräsen_F pro Zahn'!D58,\"mm mit \",'TGM Fräsen_F pro Zahn'!G58,\"mm/Min.\"))","v":0},{"$f":"'TGM Fräsen_F pro Zahn'!E58","v":0},{"$f":"'TGM Fräsen_F pro Zahn'!H58","v":0},"J"]
[{"$f":"'TGM Fräsen_F pro Zahn'!A59","v":0},{"$f":"IF(C539=0,0,CONCATENATE('TGM Fräsen_F pro Zahn'!D59,\"mm mit \",'TGM Fräsen_F pro Zahn'!G59,\"mm/Min.\"))","v":0},{"$f":"'TGM Fräsen_F pro Zahn'!E59","v":0},{"$f":"'TGM Fräsen_F pro Zahn'!H59","v":0},"J"]
[{"$f":"'TGM Fräsen_F pro Zahn'!A60","v":0},{"$f":"IF(C540=0,0,CONCATENATE('TGM Fräsen_F pro Zahn'!D60,\"mm mit \",'TGM Fräsen_F pro Zahn'!G60,\"mm/Min.\"))","v":0},{"$f":"'TGM Fräsen_F pro Zahn'!E60","v":0},{"$f":"'TGM Fräsen_F pro Zahn'!H60","v":0},"J"]
[{"$f":"'TGM Fräsen_F pro Zahn'!A61","v":0},{"$f":"IF(C541=0,0,CONCATENATE('TGM Fräsen_F pro Zahn'!D61,\"mm mit \",'TGM Fräsen_F pro Zahn'!G61,\"mm/Min.\"))","v":0},{"$f":"'TGM Fräsen_F pro Zahn'!E61","v":0},{"$f":"'TGM Fräsen_F pro Zahn'!H61","v":0},"J"]
[{"$f":"'TGM Fräsen_F pro Zahn'!A62","v":0},{"$f":"IF(C542=0,0,CONCATENATE('TGM Fräsen_F pro Zahn'!D62,\"mm mit \",'TGM Fräsen_F pro Zahn'!G62,\"mm/Min.\"))","v":0},{"$f":"'TGM Fräsen_F pro Zahn'!E62","v":0},{"$f":"'TGM Fräsen_F pro Zahn'!H62","v":0},"J"]
[{"$f":"'TGM Fräsen_F pro Zahn'!A63","v":0},{"$f":"IF(C543=0,0,CONCATENATE('TGM Fräsen_F pro Zahn'!D63,\"mm mit \",'TGM Fräsen_F pro Zahn'!G63,\"mm/Min.\"))","v":0},{"$f":"'TGM Fräsen_F pro Zahn'!E63","v":0},{"$f":"'TGM Fräsen_F pro Zahn'!H63","v":0},"J"]
[{"$f":"'TGM Fräsen_F pro Zahn'!A64","v":0},{"$f":"IF(C544=0,0,CONCATENATE('TGM Fräsen_F pro Zahn'!D64,\"mm mit \",'TGM Fräsen_F pro Zahn'!G64,\"mm/Min.\"))","v":0},{"$f":"'TGM Fräsen_F pro Zahn'!E64","v":0},{"$f":"'TGM Fräsen_F pro Zahn'!H64","v":0},"J"]
[{"$f":"'TGM Fräsen_F pro Zahn'!A65","v":0},{"$f":"IF(C545=0,0,CONCATENATE('TGM Fräsen_F pro Zahn'!D65,\"mm mit \",'TGM Fräsen_F pro Zahn'!G65,\"mm/Min.\"))","v":0},{"$f":"'TGM Fräsen_F pro Zahn'!E65","v":0},{"$f":"'TGM Fräsen_F pro Zahn'!H65","v":0},"J"]
[{"$f":"'TGM Fräsen_F pro Zahn'!A66","v":0},{"$f":"IF(C546=0,0,CONCATENATE('TGM Fräsen_F pro Zahn'!D66,\"mm mit \",'TGM Fräsen_F pro Zahn'!G66,\"mm/Min.\"))","v":0},{"$f":"'TGM Fräsen_F pro Zahn'!E66","v":0},{"$f":"'TGM Fräsen_F pro Zahn'!H66","v":0},"J"]
[{"$f":"'TGM Fräsen_F pro Zahn'!A67","v":0},{"$f":"IF(C547=0,0,CONCATENATE('TGM Fräsen_F pro Zahn'!D67,\"mm mit \",'TGM Fräsen_F pro Zahn'!G67,\"mm/Min.\"))","v":0},{"$f":"'TGM Fräsen_F pro Zahn'!E67","v":0},{"$f":"'TGM Fräsen_F pro Zahn'!H67","v":0},"J"]
[{"$f":"'TGM Fräsen_F pro Zahn'!A68","v":0},{"$f":"IF(C548=0,0,CONCATENATE('TGM Fräsen_F pro Zahn'!D68,\"mm mit \",'TGM Fräsen_F pro Zahn'!G68,\"mm/Min.\"))","v":0},{"$f":"'TGM Fräsen_F pro Zahn'!E68","v":0},{"$f":"'TGM Fräsen_F pro Zahn'!H68","v":0},"J"]
[{"$f":"'TGM Fräsen_F pro Zahn'!A69","v":0},{"$f":"IF(C549=0,0,CONCATENATE('TGM Fräsen_F pro Zahn'!D69,\"mm mit \",'TGM Fräsen_F pro Zahn'!G69,\"mm/Min.\"))","v":0},{"$f":"'TGM Fräsen_F pro Zahn'!E69","v":0},{"$f":"'TGM Fräsen_F pro Zahn'!H69","v":0},"J"]
[{"$f":"'TGM Fräsen_F pro Zahn'!A70","v":0},{"$f":"IF(C550=0,0,CONCATENATE('TGM Fräsen_F pro Zahn'!D70,\"mm mit \",'TGM Fräsen_F pro Zahn'!G70,\"mm/Min.\"))","v":0},{"$f":"'TGM Fräsen_F pro Zahn'!E70","v":0},{"$f":"'TGM Fräsen_F pro Zahn'!H70","v":0},{"$f":"IF(D550=0,\"J\",\"N\")","v":"J"}]
[{"$f":"'TGM Fräsen_F pro Zahn'!A71","v":0},{"$f":"IF(C551=0,0,CONCATENATE('TGM Fräsen_F pro Zahn'!D71,\"mm mit \",'TGM Fräsen_F pro Zahn'!G71,\"mm/Min.\"))","v":0},{"$f":"'TGM Fräsen_F pro Zahn'!E71","v":0},{"$f":"'TGM Fräsen_F pro Zahn'!H71","v":0},"J"]
[{"$f":"'TGM Fräsen_F pro Zahn'!A72","v":0},{"$f":"IF(C552=0,0,CONCATENATE('TGM Fräsen_F pro Zahn'!D72,\"mm mit \",'TGM Fräsen_F pro Zahn'!G72,\"mm/Min.\"))","v":0},{"$f":"'TGM Fräsen_F pro Zahn'!E72","v":0},{"$f":"'TGM Fräsen_F pro Zahn'!H72","v":0},"J"]
[{"$f":"'TGM Fräsen_F pro Zahn'!A73","v":0},{"$f":"IF(C553=0,0,CONCATENATE('TGM Fräsen_F pro Zahn'!D73,\"mm mit \",'TGM Fräsen_F pro Zahn'!G73,\"mm/Min.\"))","v":0},{"$f":"'TGM Fräsen_F pro Zahn'!E73","v":0},{"$f":"'TGM Fräsen_F pro Zahn'!H73","v":0},"J"]
[{"$f":"'TGM Fräsen_F pro Zahn'!A74","v":0},{"$f":"IF(C554=0,0,CONCATENATE('TGM Fräsen_F pro Zahn'!D74,\"mm mit \",'TGM Fräsen_F pro Zahn'!G74,\"mm/Min.\"))","v":0},{"$f":"'TGM Fräsen_F pro Zahn'!E74","v":0},{"$f":"'TGM Fräsen_F pro Zahn'!H74","v":0},"J"]
[{"$f":"'TGM Fräsen_F pro Zahn'!A75","v":0},{"$f":"IF(C555=0,0,CONCATENATE('TGM Fräsen_F pro Zahn'!D75,\"mm mit \",'TGM Fräsen_F pro Zahn'!G75,\"mm/Min.\"))","v":0},{"$f":"'TGM Fräsen_F pro Zahn'!E75","v":0},{"$f":"'TGM Fräsen_F pro Zahn'!H75","v":0},"J"]
[{"$f":"'TGM Fräsen_F pro Zahn'!A76","v":0},{"$f":"IF(C556=0,0,CONCATENATE('TGM Fräsen_F pro Zahn'!D76,\"mm mit \",'TGM Fräsen_F pro Zahn'!G76,\"mm/Min.\"))","v":0},{"$f":"'TGM Fräsen_F pro Zahn'!E76","v":0},{"$f":"'TGM Fräsen_F pro Zahn'!H76","v":0},"J"]
[{"$f":"'TGM Fräsen_F pro Zahn'!A77","v":0},{"$f":"IF(C557=0,0,CONCATENATE('TGM Fräsen_F pro Zahn'!D77,\"mm mit \",'TGM Fräsen_F pro Zahn'!G77,\"mm/Min.\"))","v":0},{"$f":"'TGM Fräsen_F pro Zahn'!E77","v":0},{"$f":"'TGM Fräsen_F pro Zahn'!H77","v":0},"J"]
[{"$f":"'TGM Fräsen_F pro Zahn'!A78","v":0},{"$f":"IF(C558=0,0,CONCATENATE('TGM Fräsen_F pro Zahn'!D78,\"mm mit \",'TGM Fräsen_F pro Zahn'!G78,\"mm/Min.\"))","v":0},{"$f":"'TGM Fräsen_F pro Zahn'!E78","v":0},{"$f":"'TGM Fräsen_F pro Zahn'!H78","v":0},"J"]
[{"$f":"'TGM Fräsen_F pro Zahn'!A79","v":0},{"$f":"IF(C559=0,0,CONCATENATE('TGM Fräsen_F pro Zahn'!D79,\"mm mit \",'TGM Fräsen_F pro Zahn'!G79,\"mm/Min.\"))","v":0},{"$f":"'TGM Fräsen_F pro Zahn'!E79","v":0},{"$f":"'TGM Fräsen_F pro Zahn'!H79","v":0},"J"]
[{"$f":"'TGM Fräsen_F pro Zahn'!A80","v":0},{"$f":"IF(C560=0,0,CONCATENATE('TGM Fräsen_F pro Zahn'!D80,\"mm mit \",'TGM Fräsen_F pro Zahn'!G80,\"mm/Min.\"))","v":0},{"$f":"'TGM Fräsen_F pro Zahn'!E80","v":0},{"$f":"'TGM Fräsen_F pro Zahn'!H80","v":0},"J"]
[{"$f":"'TGM Fräsen_F pro Zahn'!A81","v":0},{"$f":"IF(C561=0,0,CONCATENATE('TGM Fräsen_F pro Zahn'!D81,\"mm mit \",'TGM Fräsen_F pro Zahn'!G81,\"mm/Min.\"))","v":0},{"$f":"'TGM Fräsen_F pro Zahn'!E81","v":0},{"$f":"'TGM Fräsen_F pro Zahn'!H81","v":0},"J"]
[{"$f":"'TGM Fräsen_F pro Zahn'!A82","v":0},{"$f":"IF(C562=0,0,CONCATENATE('TGM Fräsen_F pro Zahn'!D82,\"mm mit \",'TGM Fräsen_F pro Zahn'!G82,\"mm/Min.\"))","v":0},{"$f":"'TGM Fräsen_F pro Zahn'!E82","v":0},{"$f":"'TGM Fräsen_F pro Zahn'!H82","v":0},"J"]
[{"$f":"'TGM Fräsen_F pro Zahn'!A83","v":0},{"$f":"IF(C563=0,0,CONCATENATE('TGM Fräsen_F pro Zahn'!D83,\"mm mit \",'TGM Fräsen_F pro Zahn'!G83,\"mm/Min.\"))","v":0},{"$f":"'TGM Fräsen_F pro Zahn'!E83","v":0},{"$f":"'TGM Fräsen_F pro Zahn'!H83","v":0},"J"]
[{"$f":"'TGM Fräsen_F pro Zahn'!A84","v":0},{"$f":"IF(C564=0,0,CONCATENATE('TGM Fräsen_F pro Zahn'!D84,\"mm mit \",'TGM Fräsen_F pro Zahn'!G84,\"mm/Min.\"))","v":0},{"$f":"'TGM Fräsen_F pro Zahn'!E84","v":0},{"$f":"'TGM Fräsen_F pro Zahn'!H84","v":0},"J"]
[{"$f":"'TGM Fräsen_F pro Zahn'!A85","v":0},{"$f":"IF(C565=0,0,CONCATENATE('TGM Fräsen_F pro Zahn'!D85,\"mm mit \",'TGM Fräsen_F pro Zahn'!G85,\"mm/Min.\"))","v":0},{"$f":"'TGM Fräsen_F pro Zahn'!E85","v":0},{"$f":"'TGM Fräsen_F pro Zahn'!H85","v":0},"J"]
[{"$f":"'TGM Fräsen_F pro Zahn'!A86","v":0},{"$f":"IF(C566=0,0,CONCATENATE('TGM Fräsen_F pro Zahn'!D86,\"mm mit \",'TGM Fräsen_F pro Zahn'!G86,\"mm/Min.\"))","v":0},{"$f":"'TGM Fräsen_F pro Zahn'!E86","v":0},{"$f":"'TGM Fräsen_F pro Zahn'!H86","v":0},"J"]
[{"$f":"'TGM Fräsen_F pro Zahn'!A87","v":0},{"$f":"IF(C567=0,0,CONCATENATE('TGM Fräsen_F pro Zahn'!D87,\"mm mit \",'TGM Fräsen_F pro Zahn'!G87,\"mm/Min.\"))","v":0},{"$f":"'TGM Fräsen_F pro Zahn'!E87","v":0},{"$f":"'TGM Fräsen_F pro Zahn'!H87","v":0},"J"]
[{"$f":"'TGM Fräsen_F pro Zahn'!A88","v":0},{"$f":"IF(C568=0,0,CONCATENATE('TGM Fräsen_F pro Zahn'!D88,\"mm mit \",'TGM Fräsen_F pro Zahn'!G88,\"mm/Min.\"))","v":0},{"$f":"'TGM Fräsen_F pro Zahn'!E88","v":0},{"$f":"'TGM Fräsen_F pro Zahn'!H88","v":0},"J"]
[{"$f":"'TGM Fräsen_F pro Zahn'!A89","v":0},{"$f":"IF(C569=0,0,CONCATENATE('TGM Fräsen_F pro Zahn'!D89,\"mm mit \",'TGM Fräsen_F pro Zahn'!G89,\"mm/Min.\"))","v":0},{"$f":"'TGM Fräsen_F pro Zahn'!E89","v":0},{"$f":"'TGM Fräsen_F pro Zahn'!H89","v":0},"J"]
[{"$f":"'TGM Fräsen_F pro Zahn'!A90","v":0},{"$f":"IF(C570=0,0,CONCATENATE('TGM Fräsen_F pro Zahn'!D90,\"mm mit \",'TGM Fräsen_F pro Zahn'!G90,\"mm/Min.\"))","v":0},{"$f":"'TGM Fräsen_F pro Zahn'!E90","v":0},{"$f":"'TGM Fräsen_F pro Zahn'!H90","v":0},"J"]
[{"$f":"'TGM Fräsen_F pro Zahn'!A91","v":0},{"$f":"IF(C571=0,0,CONCATENATE('TGM Fräsen_F pro Zahn'!D91,\"mm mit \",'TGM Fräsen_F pro Zahn'!G91,\"mm/Min.\"))","v":0},{"$f":"'TGM Fräsen_F pro Zahn'!E91","v":0},{"$f":"'TGM Fräsen_F pro Zahn'!H91","v":0},"J"]
[{"$f":"'TGM Fräsen_F pro Zahn'!A92","v":0},{"$f":"IF(C572=0,0,CONCATENATE('TGM Fräsen_F pro Zahn'!D92,\"mm mit \",'TGM Fräsen_F pro Zahn'!G92,\"mm/Min.\"))","v":0},{"$f":"'TGM Fräsen_F pro Zahn'!E92","v":0},{"$f":"'TGM Fräsen_F pro Zahn'!H92","v":0},"J"]
[{"$f":"'TGM Fräsen_F pro Zahn'!A93","v":0},{"$f":"IF(C573=0,0,CONCATENATE('TGM Fräsen_F pro Zahn'!D93,\"mm mit \",'TGM Fräsen_F pro Zahn'!G93,\"mm/Min.\"))","v":0},{"$f":"'TGM Fräsen_F pro Zahn'!E93","v":0},{"$f":"'TGM Fräsen_F pro Zahn'!H93","v":0},"J"]
[{"$f":"'TGM Fräsen_F pro Zahn'!A94","v":0},{"$f":"IF(C574=0,0,CONCATENATE('TGM Fräsen_F pro Zahn'!D94,\"mm mit \",'TGM Fräsen_F pro Zahn'!G94,\"mm/Min.\"))","v":0},{"$f":"'TGM Fräsen_F pro Zahn'!E94","v":0},{"$f":"'TGM Fräsen_F pro Zahn'!H94","v":0},"J"]
[{"$f":"'TGM Fräsen_F pro Zahn'!A95","v":0},{"$f":"IF(C575=0,0,CONCATENATE('TGM Fräsen_F pro Zahn'!D95,\"mm mit \",'TGM Fräsen_F pro Zahn'!G95,\"mm/Min.\"))","v":0},{"$f":"'TGM Fräsen_F pro Zahn'!E95","v":0},{"$f":"'TGM Fräsen_F pro Zahn'!H95","v":0},"J"]
[{"$f":"'TGM Fräsen_F pro Zahn'!A96","v":0},{"$f":"IF(C576=0,0,CONCATENATE('TGM Fräsen_F pro Zahn'!D96,\"mm mit \",'TGM Fräsen_F pro Zahn'!G96,\"mm/Min.\"))","v":0},{"$f":"'TGM Fräsen_F pro Zahn'!E96","v":0},{"$f":"'TGM Fräsen_F pro Zahn'!H96","v":0},"J"]
[{"$f":"'TGM Fräsen_F pro Zahn'!A97","v":0},{"$f":"IF(C577=0,0,CONCATENATE('TGM Fräsen_F pro Zahn'!D97,\"mm mit \",'TGM Fräsen_F pro Zahn'!G97,\"mm/Min.\"))","v":0},{"$f":"'TGM Fräsen_F pro Zahn'!E97","v":0},{"$f":"'TGM Fräsen_F pro Zahn'!H97","v":0},"J"]
[{"$f":"'TGM Fräsen_F pro Zahn'!A98","v":0},{"$f":"IF(C578=0,0,CONCATENATE('TGM Fräsen_F pro Zahn'!D98,\"mm mit \",'TGM Fräsen_F pro Zahn'!G98,\"mm/Min.\"))","v":0},{"$f":"'TGM Fräsen_F pro Zahn'!E98","v":0},{"$f":"'TGM Fräsen_F pro Zahn'!H98","v":0},"J"]
[{"$f":"'TGM Fräsen_F pro Zahn'!A99","v":0},{"$f":"IF(C579=0,0,CONCATENATE('TGM Fräsen_F pro Zahn'!D99,\"mm mit \",'TGM Fräsen_F pro Zahn'!G99,\"mm/Min.\"))","v":0},{"$f":"'TGM Fräsen_F pro Zahn'!E99","v":0},{"$f":"'TGM Fräsen_F pro Zahn'!H99","v":0},"J"]
[{"$f":"'TGM Fräsen_F pro Zahn'!A100","v":0},{"$f":"IF(C580=0,0,CONCATENATE('TGM Fräsen_F pro Zahn'!D100,\"mm mit \",'TGM Fräsen_F pro Zahn'!G100,\"mm/Min.\"))","v":0},{"$f":"'TGM Fräsen_F pro Zahn'!E100","v":0},{"$f":"'TGM Fräsen_F pro Zahn'!H100","v":0},"J"]
[{"$f":"'TGM Fräsen_F pro Zahn'!A101","v":0},{"$f":"IF(C581=0,0,CONCATENATE('TGM Fräsen_F pro Zahn'!D101,\"mm mit \",'TGM Fräsen_F pro Zahn'!G101,\"mm/Min.\"))","v":0},{"$f":"'TGM Fräsen_F pro Zahn'!E101","v":0},{"$f":"'TGM Fräsen_F pro Zahn'!H101","v":0},"J"]
[{"$f":"'TGM Fräsen_F pro Zahn'!A102","v":0},{"$f":"IF(C582=0,0,CONCATENATE('TGM Fräsen_F pro Zahn'!D102,\"mm mit \",'TGM Fräsen_F pro Zahn'!G102,\"mm/Min.\"))","v":0},{"$f":"'TGM Fräsen_F pro Zahn'!E102","v":0},{"$f":"'TGM Fräsen_F pro Zahn'!H102","v":0},"J"]
[{"$f":"'TGM Fräsen_F pro Zahn'!A103","v":0},{"$f":"IF(C583=0,0,CONCATENATE('TGM Fräsen_F pro Zahn'!D103,\"mm mit \",'TGM Fräsen_F pro Zahn'!G103,\"mm/Min.\"))","v":0},{"$f":"'TGM Fräsen_F pro Zahn'!E103","v":0},{"$f":"'TGM Fräsen_F pro Zahn'!H103","v":0},"J"]
[{"$f":"'TGM Fräsen_F pro Zahn'!A104","v":0},{"$f":"IF(C584=0,0,CONCATENATE('TGM Fräsen_F pro Zahn'!D104,\"mm mit \",'TGM Fräsen_F pro Zahn'!G104,\"mm/Min.\"))","v":0},{"$f":"'TGM Fräsen_F pro Zahn'!E104","v":0},{"$f":"'TGM Fräsen_F pro Zahn'!H104","v":0},"J"]
[{"$f":"'TGM Fräsen_F pro Zahn'!A105","v":0},{"$f":"IF(C585=0,0,CONCATENATE('TGM Fräsen_F pro Zahn'!D105,\"mm mit \",'TGM Fräsen_F pro Zahn'!G105,\"mm/Min.\"))","v":0},{"$f":"'TGM Fräsen_F pro Zahn'!E105","v":0},{"$f":"'TGM Fräsen_F pro Zahn'!H105","v":0},"J"]
[null,null,null,null,{"$f":"IF(B484=0,\"J\",\"N\")","v":"J"}]
[{"$f":"'TGM Fräsen _F pro Min.'!A2","v":"Schnittzeitberechnung Fräsen (F pro Minute)"},null,null,null,{"$f":"IF(B588=0,\"J\",\"N\")","v":"J"}]
["Gesamtzeit in Minuten =",{"$f":"'TGM Fräsen _F pro Min.'!F2","v":0},null,null,{"$f":"IF(B588=0,\"J\",\"N\")","v":"J"}]
["Bemerkung","Fräslänge mit Vorschub pro Minute","Anzahl der Schnitte","Zeit",{"$f":"IF(B588=0,\"J\",\"N\")","v":"J"}]
[{"$f":"'TGM Fräsen _F pro Min.'!A6","v":0},{"$f":"IF(C590=0,0,CONCATENATE('TGM Fräsen _F pro Min.'!B6,\"mm mit \",'TGM Fräsen _F pro Min.'!C6,\"mm/Min.\"))","v":0},{"$f":"'TGM Fräsen _F pro Min.'!D6","v":0},{"$f":"'TGM Fräsen _F pro Min.'!E6","v":0},{"$f":"IF(D590=0,\"J\",\"N\")","v":"J"}]
[{"$f":"'TGM Fräsen _F pro Min.'!A7","v":0},{"$f":"IF(C591=0,0,CONCATENATE('TGM Fräsen _F pro Min.'!B7,\"mm mit \",'TGM Fräsen _F pro Min.'!C7,\"mm/Min.\"))","v":0},{"$f":"'TGM Fräsen _F pro Min.'!D7","v":0},{"$f":"'TGM Fräsen _F pro Min.'!E7","v":0},"J"]
[{"$f":"'TGM Fräsen _F pro Min.'!A8","v":0},{"$f":"IF(C592=0,0,CONCATENATE('TGM Fräsen _F pro Min.'!B8,\"mm mit \",'TGM Fräsen _F pro Min.'!C8,\"mm/Min.\"))","v":0},{"$f":"'TGM Fräsen _F pro Min.'!D8","v":0},{"$f":"'TGM Fräsen _F pro Min.'!E8","v":0},"J"]
[{"$f":"'TGM Fräsen _F pro Min.'!A9","v":0},{"$f":"IF(C593=0,0,CONCATENATE('TGM Fräsen _F pro Min.'!B9,\"mm mit \",'TGM Fräsen _F pro Min.'!C9,\"mm/Min.\"))","v":0},{"$f":"'TGM Fräsen _F pro Min.'!D9","v":0},{"$f":"'TGM Fräsen _F pro Min.'!E9","v":0},"J"]
[{"$f":"'TGM Fräsen _F pro Min.'!A10","v":0},{"$f":"IF(C594=0,0,CONCATENATE('TGM Fräsen _F pro Min.'!B10,\"mm mit \",'TGM Fräsen _F pro Min.'!C10,\"mm/Min.\"))","v":0},{"$f":"'TGM Fräsen _F pro Min.'!D10","v":0},{"$f":"'TGM Fräsen _F pro Min.'!E10","v":0},"J"]
[{"$f":"'TGM Fräsen _F pro Min.'!A11","v":0},{"$f":"IF(C595=0,0,CONCATENATE('TGM Fräsen _F pro Min.'!B11,\"mm mit \",'TGM Fräsen _F pro Min.'!C11,\"mm/Min.\"))","v":0},{"$f":"'TGM Fräsen _F pro Min.'!D11","v":0},{"$f":"'TGM Fräsen _F pro Min.'!E11","v":0},"J"]
[{"$f":"'TGM Fräsen _F pro Min.'!A12","v":0},{"$f":"IF(C596=0,0,CONCATENATE('TGM Fräsen _F pro Min.'!B12,\"mm mit \",'TGM Fräsen _F pro Min.'!C12,\"mm/Min.\"))","v":0},{"$f":"'TGM Fräsen _F pro Min.'!D12","v":0},{"$f":"'TGM Fräsen _F pro Min.'!E12","v":0},"J"]
[{"$f":"'TGM Fräsen _F pro Min.'!A13","v":0},{"$f":"IF(C597=0,0,CONCATENATE('TGM Fräsen _F pro Min.'!B13,\"mm mit \",'TGM Fräsen _F pro Min.'!C13,\"mm/Min.\"))","v":0},{"$f":"'TGM Fräsen _F pro Min.'!D13","v":0},{"$f":"'TGM Fräsen _F pro Min.'!E13","v":0},"J"]
[{"$f":"'TGM Fräsen _F pro Min.'!A14","v":0},{"$f":"IF(C598=0,0,CONCATENATE('TGM Fräsen _F pro Min.'!B14,\"mm mit \",'TGM Fräsen _F pro Min.'!C14,\"mm/Min.\"))","v":0},{"$f":"'TGM Fräsen _F pro Min.'!D14","v":0},{"$f":"'TGM Fräsen _F pro Min.'!E14","v":0},"J"]
[{"$f":"'TGM Fräsen _F pro Min.'!A15","v":0},{"$f":"IF(C599=0,0,CONCATENATE('TGM Fräsen _F pro Min.'!B15,\"mm mit \",'TGM Fräsen _F pro Min.'!C15,\"mm/Min.\"))","v":0},{"$f":"'TGM Fräsen _F pro Min.'!D15","v":0},{"$f":"'TGM Fräsen _F pro Min.'!E15","v":0},"J"]
[{"$f":"'TGM Fräsen _F pro Min.'!A16","v":0},{"$f":"IF(C600=0,0,CONCATENATE('TGM Fräsen _F pro Min.'!B16,\"mm mit \",'TGM Fräsen _F pro Min.'!C16,\"mm/Min.\"))","v":0},{"$f":"'TGM Fräsen _F pro Min.'!D16","v":0},{"$f":"'TGM Fräsen _F pro Min.'!E16","v":0},"J"]
[{"$f":"'TGM Fräsen _F pro Min.'!A17","v":0},{"$f":"IF(C601=0,0,CONCATENATE('TGM Fräsen _F pro Min.'!B17,\"mm mit \",'TGM Fräsen _F pro Min.'!C17,\"mm/Min.\"))","v":0},{"$f":"'TGM Fräsen _F pro Min.'!D17","v":0},{"$f":"'TGM Fräsen _F pro Min.'!E17","v":0},"J"]
[{"$f":"'TGM Fräsen _F pro Min.'!A18","v":0},{"$f":"IF(C602=0,0,CONCATENATE('TGM Fräsen _F pro Min.'!B18,\"mm mit \",'TGM Fräsen _F pro Min.'!C18,\"mm/Min.\"))","v":0},{"$f":"'TGM Fräsen _F pro Min.'!D18","v":0},{"$f":"'TGM Fräsen _F pro Min.'!E18","v":0},"J"]
[{"$f":"'TGM Fräsen _F pro Min.'!A19","v":0},{"$f":"IF(C603=0,0,CONCATENATE('TGM Fräsen _F pro Min.'!B19,\"mm mit \",'TGM Fräsen _F pro Min.'!C19,\"mm/Min.\"))","v":0},{"$f":"'TGM Fräsen _F pro Min.'!D19","v":0},{"$f":"'TGM Fräsen _F pro Min.'!E19","v":0},"J"]
[{"$f":"'TGM Fräsen _F pro Min.'!A20","v":0},{"$f":"IF(C604=0,0,CONCATENATE('TGM Fräsen _F pro Min.'!B20,\"mm mit \",'TGM Fräsen _F pro Min.'!C20,\"mm/Min.\"))","v":0},{"$f":"'TGM Fräsen _F pro Min.'!D20","v":0},{"$f":"'TGM Fräsen _F pro Min.'!E20","v":0},"J"]
[{"$f":"'TGM Fräsen _F pro Min.'!A21","v":0},{"$f":"IF(C605=0,0,CONCATENATE('TGM Fräsen _F pro Min.'!B21,\"mm mit \",'TGM Fräsen _F pro Min.'!C21,\"mm/Min.\"))","v":0},{"$f":"'TGM Fräsen _F pro Min.'!D21","v":0},{"$f":"'TGM Fräsen _F pro Min.'!E21","v":0},"J"]
[{"$f":"'TGM Fräsen _F pro Min.'!A22","v":0},{"$f":"IF(C606=0,0,CONCATENATE('TGM Fräsen _F pro Min.'!B22,\"mm mit \",'TGM Fräsen _F pro Min.'!C22,\"mm/Min.\"))","v":0},{"$f":"'TGM Fräsen _F pro Min.'!D22","v":0},{"$f":"'TGM Fräsen _F pro Min.'!E22","v":0},"J"]
[{"$f":"'TGM Fräsen _F pro Min.'!A23","v":0},{"$f":"IF(C607=0,0,CONCATENATE('TGM Fräsen _F pro Min.'!B23,\"mm mit \",'TGM Fräsen _F pro Min.'!C23,\"mm/Min.\"))","v":0},{"$f":"'TGM Fräsen _F pro Min.'!D23","v":0},{"$f":"'TGM Fräsen _F pro Min.'!E23","v":0},"J"]
[{"$f":"'TGM Fräsen _F pro Min.'!A24","v":0},{"$f":"IF(C608=0,0,CONCATENATE('TGM Fräsen _F pro Min.'!B24,\"mm mit \",'TGM Fräsen _F pro Min.'!C24,\"mm/Min.\"))","v":0},{"$f":"'TGM Fräsen _F pro Min.'!D24","v":0},{"$f":"'TGM Fräsen _F pro Min.'!E24","v":0},"J"]
[{"$f":"'TGM Fräsen _F pro Min.'!A25","v":0},{"$f":"IF(C609=0,0,CONCATENATE('TGM Fräsen _F pro Min.'!B25,\"mm mit \",'TGM Fräsen _F pro Min.'!C25,\"mm/Min.\"))","v":0},{"$f":"'TGM Fräsen _F pro Min.'!D25","v":0},{"$f":"'TGM Fräsen _F pro Min.'!E25","v":0},"J"]
[{"$f":"'TGM Fräsen _F pro Min.'!A26","v":0},{"$f":"IF(C610=0,0,CONCATENATE('TGM Fräsen _F pro Min.'!B26,\"mm mit \",'TGM Fräsen _F pro Min.'!C26,\"mm/Min.\"))","v":0},{"$f":"'TGM Fräsen _F pro Min.'!D26","v":0},{"$f":"'TGM Fräsen _F pro Min.'!E26","v":0},"J"]
[{"$f":"'TGM Fräsen _F pro Min.'!A27","v":0},{"$f":"IF(C611=0,0,CONCATENATE('TGM Fräsen _F pro Min.'!B27,\"mm mit \",'TGM Fräsen _F pro Min.'!C27,\"mm/Min.\"))","v":0},{"$f":"'TGM Fräsen _F pro Min.'!D27","v":0},{"$f":"'TGM Fräsen _F pro Min.'!E27","v":0},"J"]
[{"$f":"'TGM Fräsen _F pro Min.'!A28","v":0},{"$f":"IF(C612=0,0,CONCATENATE('TGM Fräsen _F pro Min.'!B28,\"mm mit \",'TGM Fräsen _F pro Min.'!C28,\"mm/Min.\"))","v":0},{"$f":"'TGM Fräsen _F pro Min.'!D28","v":0},{"$f":"'TGM Fräsen _F pro Min.'!E28","v":0},"J"]
[{"$f":"'TGM Fräsen _F pro Min.'!A29","v":0},{"$f":"IF(C613=0,0,CONCATENATE('TGM Fräsen _F pro Min.'!B29,\"mm mit \",'TGM Fräsen _F pro Min.'!C29,\"mm/Min.\"))","v":0},{"$f":"'TGM Fräsen _F pro Min.'!D29","v":0},{"$f":"'TGM Fräsen _F pro Min.'!E29","v":0},"J"]
[{"$f":"'TGM Fräsen _F pro Min.'!A30","v":0},{"$f":"IF(C614=0,0,CONCATENATE('TGM Fräsen _F pro Min.'!B30,\"mm mit \",'TGM Fräsen _F pro Min.'!C30,\"mm/Min.\"))","v":0},{"$f":"'TGM Fräsen _F pro Min.'!D30","v":0},{"$f":"'TGM Fräsen _F pro Min.'!E30","v":0},"J"]
[{"$f":"'TGM Fräsen _F pro Min.'!A31","v":0},{"$f":"IF(C615=0,0,CONCATENATE('TGM Fräsen _F pro Min.'!B31,\"mm mit \",'TGM Fräsen _F pro Min.'!C31,\"mm/Min.\"))","v":0},{"$f":"'TGM Fräsen _F pro Min.'!D31","v":0},{"$f":"'TGM Fräsen _F pro Min.'!E31","v":0},"J"]
[{"$f":"'TGM Fräsen _F pro Min.'!A32","v":0},{"$f":"IF(C616=0,0,CONCATENATE('TGM Fräsen _F pro Min.'!B32,\"mm mit \",'TGM Fräsen _F pro Min.'!C32,\"mm/Min.\"))","v":0},{"$f":"'TGM Fräsen _F pro Min.'!D32","v":0},{"$f":"'TGM Fräsen _F pro Min.'!E32","v":0},"J"]
[{"$f":"'TGM Fräsen _F pro Min.'!A33","v":0},{"$f":"IF(C617=0,0,CONCATENATE('TGM Fräsen _F pro Min.'!B33,\"mm mit \",'TGM Fräsen _F pro Min.'!C33,\"mm/Min.\"))","v":0},{"$f":"'TGM Fräsen _F pro Min.'!D33","v":0},{"$f":"'TGM Fräsen _F pro Min.'!E33","v":0},"J"]
[{"$f":"'TGM Fräsen _F pro Min.'!A34","v":0},{"$f":"IF(C618=0,0,CONCATENATE('TGM Fräsen _F pro Min.'!B34,\"mm mit \",'TGM Fräsen _F pro Min.'!C34,\"mm/Min.\"))","v":0},{"$f":"'TGM Fräsen _F pro Min.'!D34","v":0},{"$f":"'TGM Fräsen _F pro Min.'!E34","v":0},"J"]
[{"$f":"'TGM Fräsen _F pro Min.'!A35","v":0},{"$f":"IF(C619=0,0,CONCATENATE('TGM Fräsen _F pro Min.'!B35,\"mm mit \",'TGM Fräsen _F pro Min.'!C35,\"mm/Min.\"))","v":0},{"$f":"'TGM Fräsen _F pro Min.'!D35","v":0},{"$f":"'TGM Fräsen _F pro Min.'!E35","v":0},"J"]
[{"$f":"'TGM Fräsen _F pro Min.'!A36","v":0},{"$f":"IF(C620=0,0,CONCATENATE('TGM Fräsen _F pro Min.'!B36,\"mm mit \",'TGM Fräsen _F pro Min.'!C36,\"mm/Min.\"))","v":0},{"$f":"'TGM Fräsen _F pro Min.'!D36","v":0},{"$f":"'TGM Fräsen _F pro Min.'!E36","v":0},"J"]
[{"$f":"'TGM Fräsen _F pro Min.'!A37","v":0},{"$f":"IF(C621=0,0,CONCATENATE('TGM Fräsen _F pro Min.'!B37,\"mm mit \",'TGM Fräsen _F pro Min.'!C37,\"mm/Min.\"))","v":0},{"$f":"'TGM Fräsen _F pro Min.'!D37","v":0},{"$f":"'TGM Fräsen _F pro Min.'!E37","v":0},"J"]
[{"$f":"'TGM Fräsen _F pro Min.'!A38","v":0},{"$f":"IF(C622=0,0,CONCATENATE('TGM Fräsen _F pro Min.'!B38,\"mm mit \",'TGM Fräsen _F pro Min.'!C38,\"mm/Min.\"))","v":0},{"$f":"'TGM Fräsen _F pro Min.'!D38","v":0},{"$f":"'TGM Fräsen _F pro Min.'!E38","v":0},"J"]
[{"$f":"'TGM Fräsen _F pro Min.'!A39","v":0},{"$f":"IF(C623=0,0,CONCATENATE('TGM Fräsen _F pro Min.'!B39,\"mm mit \",'TGM Fräsen _F pro Min.'!C39,\"mm/Min.\"))","v":0},{"$f":"'TGM Fräsen _F pro Min.'!D39","v":0},{"$f":"'TGM Fräsen _F pro Min.'!E39","v":0},"J"]
[{"$f":"'TGM Fräsen _F pro Min.'!A40","v":0},{"$f":"IF(C624=0,0,CONCATENATE('TGM Fräsen _F pro Min.'!B40,\"mm mit \",'TGM Fräsen _F pro Min.'!C40,\"mm/Min.\"))","v":0},{"$f":"'TGM Fräsen _F pro Min.'!D40","v":0},{"$f":"'TGM Fräsen _F pro Min.'!E40","v":0},"J"]
[{"$f":"'TGM Fräsen _F pro Min.'!A41","v":0},{"$f":"IF(C625=0,0,CONCATENATE('TGM Fräsen _F pro Min.'!B41,\"mm mit \",'TGM Fräsen _F pro Min.'!C41,\"mm/Min.\"))","v":0},{"$f":"'TGM Fräsen _F pro Min.'!D41","v":0},{"$f":"'TGM Fräsen _F pro Min.'!E41","v":0},"J"]
[{"$f":"'TGM Fräsen _F pro Min.'!A42","v":0},{"$f":"IF(C626=0,0,CONCATENATE('TGM Fräsen _F pro Min.'!B42,\"mm mit \",'TGM Fräsen _F pro Min.'!C42,\"mm/Min.\"))","v":0},{"$f":"'TGM Fräsen _F pro Min.'!D42","v":0},{"$f":"'TGM Fräsen _F pro Min.'!E42","v":0},"J"]
[{"$f":"'TGM Fräsen _F pro Min.'!A43","v":0},{"$f":"IF(C627=0,0,CONCATENATE('TGM Fräsen _F pro Min.'!B43,\"mm mit \",'TGM Fräsen _F pro Min.'!C43,\"mm/Min.\"))","v":0},{"$f":"'TGM Fräsen _F pro Min.'!D43","v":0},{"$f":"'TGM Fräsen _F pro Min.'!E43","v":0},"J"]
[{"$f":"'TGM Fräsen _F pro Min.'!A44","v":0},{"$f":"IF(C628=0,0,CONCATENATE('TGM Fräsen _F pro Min.'!B44,\"mm mit \",'TGM Fräsen _F pro Min.'!C44,\"mm/Min.\"))","v":0},{"$f":"'TGM Fräsen _F pro Min.'!D44","v":0},{"$f":"'TGM Fräsen _F pro Min.'!E44","v":0},"J"]
[{"$f":"'TGM Fräsen _F pro Min.'!A45","v":0},{"$f":"IF(C629=0,0,CONCATENATE('TGM Fräsen _F pro Min.'!B45,\"mm mit \",'TGM Fräsen _F pro Min.'!C45,\"mm/Min.\"))","v":0},{"$f":"'TGM Fräsen _F pro Min.'!D45","v":0},{"$f":"'TGM Fräsen _F pro Min.'!E45","v":0},"J"]
[{"$f":"'TGM Fräsen _F pro Min.'!A46","v":0},{"$f":"IF(C630=0,0,CONCATENATE('TGM Fräsen _F pro Min.'!B46,\"mm mit \",'TGM Fräsen _F pro Min.'!C46,\"mm/Min.\"))","v":0},{"$f":"'TGM Fräsen _F pro Min.'!D46","v":0},{"$f":"'TGM Fräsen _F pro Min.'!E46","v":0},"J"]
[{"$f":"'TGM Fräsen _F pro Min.'!A47","v":0},{"$f":"IF(C631=0,0,CONCATENATE('TGM Fräsen _F pro Min.'!B47,\"mm mit \",'TGM Fräsen _F pro Min.'!C47,\"mm/Min.\"))","v":0},{"$f":"'TGM Fräsen _F pro Min.'!D47","v":0},{"$f":"'TGM Fräsen _F pro Min.'!E47","v":0},"J"]
[{"$f":"'TGM Fräsen _F pro Min.'!A48","v":0},{"$f":"IF(C632=0,0,CONCATENATE('TGM Fräsen _F pro Min.'!B48,\"mm mit \",'TGM Fräsen _F pro Min.'!C48,\"mm/Min.\"))","v":0},{"$f":"'TGM Fräsen _F pro Min.'!D48","v":0},{"$f":"'TGM Fräsen _F pro Min.'!E48","v":0},"J"]
[{"$f":"'TGM Fräsen _F pro Min.'!A49","v":0},{"$f":"IF(C633=0,0,CONCATENATE('TGM Fräsen _F pro Min.'!B49,\"mm mit \",'TGM Fräsen _F pro Min.'!C49,\"mm/Min.\"))","v":0},{"$f":"'TGM Fräsen _F pro Min.'!D49","v":0},{"$f":"'TGM Fräsen _F pro Min.'!E49","v":0},"J"]
[{"$f":"'TGM Fräsen _F pro Min.'!A50","v":0},{"$f":"IF(C634=0,0,CONCATENATE('TGM Fräsen _F pro Min.'!B50,\"mm mit \",'TGM Fräsen _F pro Min.'!C50,\"mm/Min.\"))","v":0},{"$f":"'TGM Fräsen _F pro Min.'!D50","v":0},{"$f":"'TGM Fräsen _F pro Min.'!E50","v":0},"J"]
[{"$f":"'TGM Fräsen _F pro Min.'!A51","v":0},{"$f":"IF(C635=0,0,CONCATENATE('TGM Fräsen _F pro Min.'!B51,\"mm mit \",'TGM Fräsen _F pro Min.'!C51,\"mm/Min.\"))","v":0},{"$f":"'TGM Fräsen _F pro Min.'!D51","v":0},{"$f":"'TGM Fräsen _F pro Min.'!E51","v":0},"J"]
[{"$f":"'TGM Fräsen _F pro Min.'!A52","v":0},{"$f":"IF(C636=0,0,CONCATENATE('TGM Fräsen _F pro Min.'!B52,\"mm mit \",'TGM Fräsen _F pro Min.'!C52,\"mm/Min.\"))","v":0},{"$f":"'TGM Fräsen _F pro Min.'!D52","v":0},{"$f":"'TGM Fräsen _F pro Min.'!E52","v":0},"J"]
[{"$f":"'TGM Fräsen _F pro Min.'!A53","v":0},{"$f":"IF(C637=0,0,CONCATENATE('TGM Fräsen _F pro Min.'!B53,\"mm mit \",'TGM Fräsen _F pro Min.'!C53,\"mm/Min.\"))","v":0},{"$f":"'TGM Fräsen _F pro Min.'!D53","v":0},{"$f":"'TGM Fräsen _F pro Min.'!E53","v":0},"J"]
[{"$f":"'TGM Fräsen _F pro Min.'!A54","v":0},{"$f":"IF(C638=0,0,CONCATENATE('TGM Fräsen _F pro Min.'!B54,\"mm mit \",'TGM Fräsen _F pro Min.'!C54,\"mm/Min.\"))","v":0},{"$f":"'TGM Fräsen _F pro Min.'!D54","v":0},{"$f":"'TGM Fräsen _F pro Min.'!E54","v":0},"J"]
[{"$f":"'TGM Fräsen _F pro Min.'!A55","v":0},{"$f":"IF(C639=0,0,CONCATENATE('TGM Fräsen _F pro Min.'!B55,\"mm mit \",'TGM Fräsen _F pro Min.'!C55,\"mm/Min.\"))","v":0},{"$f":"'TGM Fräsen _F pro Min.'!D55","v":0},{"$f":"'TGM Fräsen _F pro Min.'!E55","v":0},"J"]
[{"$f":"'TGM Fräsen _F pro Min.'!A56","v":0},{"$f":"IF(C640=0,0,CONCATENATE('TGM Fräsen _F pro Min.'!B56,\"mm mit \",'TGM Fräsen _F pro Min.'!C56,\"mm/Min.\"))","v":0},{"$f":"'TGM Fräsen _F pro Min.'!D56","v":0},{"$f":"'TGM Fräsen _F pro Min.'!E56","v":0},"J"]
[{"$f":"'TGM Fräsen _F pro Min.'!A57","v":0},{"$f":"IF(C641=0,0,CONCATENATE('TGM Fräsen _F pro Min.'!B57,\"mm mit \",'TGM Fräsen _F pro Min.'!C57,\"mm/Min.\"))","v":0},{"$f":"'TGM Fräsen _F pro Min.'!D57","v":0},{"$f":"'TGM Fräsen _F pro Min.'!E57","v":0},"J"]
[{"$f":"'TGM Fräsen _F pro Min.'!A58","v":0},{"$f":"IF(C642=0,0,CONCATENATE('TGM Fräsen _F pro Min.'!B58,\"mm mit \",'TGM Fräsen _F pro Min.'!C58,\"mm/Min.\"))","v":0},{"$f":"'TGM Fräsen _F pro Min.'!D58","v":0},{"$f":"'TGM Fräsen _F pro Min.'!E58","v":0},"J"]
[{"$f":"'TGM Fräsen _F pro Min.'!A59","v":0},{"$f":"IF(C643=0,0,CONCATENATE('TGM Fräsen _F pro Min.'!B59,\"mm mit \",'TGM Fräsen _F pro Min.'!C59,\"mm/Min.\"))","v":0},{"$f":"'TGM Fräsen _F pro Min.'!D59","v":0},{"$f":"'TGM Fräsen _F pro Min.'!E59","v":0},"J"]
[{"$f":"'TGM Fräsen _F pro Min.'!A60","v":0},{"$f":"IF(C644=0,0,CONCATENATE('TGM Fräsen _F pro Min.'!B60,\"mm mit \",'TGM Fräsen _F pro Min.'!C60,\"mm/Min.\"))","v":0},{"$f":"'TGM Fräsen _F pro Min.'!D60","v":0},{"$f":"'TGM Fräsen _F pro Min.'!E60","v":0},"J"]
[{"$f":"'TGM Fräsen _F pro Min.'!A61","v":0},{"$f":"IF(C645=0,0,CONCATENATE('TGM Fräsen _F pro Min.'!B61,\"mm mit \",'TGM Fräsen _F pro Min.'!C61,\"mm/Min.\"))","v":0},{"$f":"'TGM Fräsen _F pro Min.'!D61","v":0},{"$f":"'TGM Fräsen _F pro Min.'!E61","v":0},"J"]
[{"$f":"'TGM Fräsen _F pro Min.'!A62","v":0},{"$f":"IF(C646=0,0,CONCATENATE('TGM Fräsen _F pro Min.'!B62,\"mm mit \",'TGM Fräsen _F pro Min.'!C62,\"mm/Min.\"))","v":0},{"$f":"'TGM Fräsen _F pro Min.'!D62","v":0},{"$f":"'TGM Fräsen _F pro Min.'!E62","v":0},"J"]
[{"$f":"'TGM Fräsen _F pro Min.'!A63","v":0},{"$f":"IF(C647=0,0,CONCATENATE('TGM Fräsen _F pro Min.'!B63,\"mm mit \",'TGM Fräsen _F pro Min.'!C63,\"mm/Min.\"))","v":0},{"$f":"'TGM Fräsen _F pro Min.'!D63","v":0},{"$f":"'TGM Fräsen _F pro Min.'!E63","v":0},"J"]
[{"$f":"'TGM Fräsen _F pro Min.'!A64","v":0},{"$f":"IF(C648=0,0,CONCATENATE('TGM Fräsen _F pro Min.'!B64,\"mm mit \",'TGM Fräsen _F pro Min.'!C64,\"mm/Min.\"))","v":0},{"$f":"'TGM Fräsen _F pro Min.'!D64","v":0},{"$f":"'TGM Fräsen _F pro Min.'!E64","v":0},"J"]
[{"$f":"'TGM Fräsen _F pro Min.'!A65","v":0},{"$f":"IF(C649=0,0,CONCATENATE('TGM Fräsen _F pro Min.'!B65,\"mm mit \",'TGM Fräsen _F pro Min.'!C65,\"mm/Min.\"))","v":0},{"$f":"'TGM Fräsen _F pro Min.'!D65","v":0},{"$f":"'TGM Fräsen _F pro Min.'!E65","v":0},"J"]
[{"$f":"'TGM Fräsen _F pro Min.'!A66","v":0},{"$f":"IF(C650=0,0,CONCATENATE('TGM Fräsen _F pro Min.'!B66,\"mm mit \",'TGM Fräsen _F pro Min.'!C66,\"mm/Min.\"))","v":0},{"$f":"'TGM Fräsen _F pro Min.'!D66","v":0},{"$f":"'TGM Fräsen _F pro Min.'!E66","v":0},"J"]
[{"$f":"'TGM Fräsen _F pro Min.'!A67","v":0},{"$f":"IF(C651=0,0,CONCATENATE('TGM Fräsen _F pro Min.'!B67,\"mm mit \",'TGM Fräsen _F pro Min.'!C67,\"mm/Min.\"))","v":0},{"$f":"'TGM Fräsen _F pro Min.'!D67","v":0},{"$f":"'TGM Fräsen _F pro Min.'!E67","v":0},"J"]
[{"$f":"'TGM Fräsen _F pro Min.'!A68","v":0},{"$f":"IF(C652=0,0,CONCATENATE('TGM Fräsen _F pro Min.'!B68,\"mm mit \",'TGM Fräsen _F pro Min.'!C68,\"mm/Min.\"))","v":0},{"$f":"'TGM Fräsen _F pro Min.'!D68","v":0},{"$f":"'TGM Fräsen _F pro Min.'!E68","v":0},"J"]
[{"$f":"'TGM Fräsen _F pro Min.'!A69","v":0},{"$f":"IF(C653=0,0,CONCATENATE('TGM Fräsen _F pro Min.'!B69,\"mm mit \",'TGM Fräsen _F pro Min.'!C69,\"mm/Min.\"))","v":0},{"$f":"'TGM Fräsen _F pro Min.'!D69","v":0},{"$f":"'TGM Fräsen _F pro Min.'!E69","v":0},"J"]
[{"$f":"'TGM Fräsen _F pro Min.'!A70","v":0},{"$f":"IF(C654=0,0,CONCATENATE('TGM Fräsen _F pro Min.'!B70,\"mm mit \",'TGM Fräsen _F pro Min.'!C70,\"mm/Min.\"))","v":0},{"$f":"'TGM Fräsen _F pro Min.'!D70","v":0},{"$f":"'TGM Fräsen _F pro Min.'!E70","v":0},{"$f":"IF(D654=0,\"J\",\"N\")","v":"J"}]
[{"$f":"'TGM Fräsen _F pro Min.'!A71","v":0},{"$f":"IF(C655=0,0,CONCATENATE('TGM Fräsen _F pro Min.'!B71,\"mm mit \",'TGM Fräsen _F pro Min.'!C71,\"mm/Min.\"))","v":0},{"$f":"'TGM Fräsen _F pro Min.'!D71","v":0},{"$f":"'TGM Fräsen _F pro Min.'!E71","v":0},"J"]
[{"$f":"'TGM Fräsen _F pro Min.'!A72","v":0},{"$f":"IF(C656=0,0,CONCATENATE('TGM Fräsen _F pro Min.'!B72,\"mm mit \",'TGM Fräsen _F pro Min.'!C72,\"mm/Min.\"))","v":0},{"$f":"'TGM Fräsen _F pro Min.'!D72","v":0},{"$f":"'TGM Fräsen _F pro Min.'!E72","v":0},"J"]
[{"$f":"'TGM Fräsen _F pro Min.'!A73","v":0},{"$f":"IF(C657=0,0,CONCATENATE('TGM Fräsen _F pro Min.'!B73,\"mm mit \",'TGM Fräsen _F pro Min.'!C73,\"mm/Min.\"))","v":0},{"$f":"'TGM Fräsen _F pro Min.'!D73","v":0},{"$f":"'TGM Fräsen _F pro Min.'!E73","v":0},"J"]
[{"$f":"'TGM Fräsen _F pro Min.'!A74","v":0},{"$f":"IF(C658=0,0,CONCATENATE('TGM Fräsen _F pro Min.'!B74,\"mm mit \",'TGM Fräsen _F pro Min.'!C74,\"mm/Min.\"))","v":0},{"$f":"'TGM Fräsen _F pro Min.'!D74","v":0},{"$f":"'TGM Fräsen _F pro Min.'!E74","v":0},"J"]
[{"$f":"'TGM Fräsen _F pro Min.'!A75","v":0},{"$f":"IF(C659=0,0,CONCATENATE('TGM Fräsen _F pro Min.'!B75,\"mm mit \",'TGM Fräsen _F pro Min.'!C75,\"mm/Min.\"))","v":0},{"$f":"'TGM Fräsen _F pro Min.'!D75","v":0},{"$f":"'TGM Fräsen _F pro Min.'!E75","v":0},"J"]
[{"$f":"'TGM Fräsen _F pro Min.'!A76","v":0},{"$f":"IF(C660=0,0,CONCATENATE('TGM Fräsen _F pro Min.'!B76,\"mm mit \",'TGM Fräsen _F pro Min.'!C76,\"mm/Min.\"))","v":0},{"$f":"'TGM Fräsen _F pro Min.'!D76","v":0},{"$f":"'TGM Fräsen _F pro Min.'!E76","v":0},"J"]
[{"$f":"'TGM Fräsen _F pro Min.'!A77","v":0},{"$f":"IF(C661=0,0,CONCATENATE('TGM Fräsen _F pro Min.'!B77,\"mm mit \",'TGM Fräsen _F pro Min.'!C77,\"mm/Min.\"))","v":0},{"$f":"'TGM Fräsen _F pro Min.'!D77","v":0},{"$f":"'TGM Fräsen _F pro Min.'!E77","v":0},"J"]
[{"$f":"'TGM Fräsen _F pro Min.'!A78","v":0},{"$f":"IF(C662=0,0,CONCATENATE('TGM Fräsen _F pro Min.'!B78,\"mm mit \",'TGM Fräsen _F pro Min.'!C78,\"mm/Min.\"))","v":0},{"$f":"'TGM Fräsen _F pro Min.'!D78","v":0},{"$f":"'TGM Fräsen _F pro Min.'!E78","v":0},"J"]
[{"$f":"'TGM Fräsen _F pro Min.'!A79","v":0},{"$f":"IF(C663=0,0,CONCATENATE('TGM Fräsen _F pro Min.'!B79,\"mm mit \",'TGM Fräsen _F pro Min.'!C79,\"mm/Min.\"))","v":0},{"$f":"'TGM Fräsen _F pro Min.'!D79","v":0},{"$f":"'TGM Fräsen _F pro Min.'!E79","v":0},"J"]
[{"$f":"'TGM Fräsen _F pro Min.'!A80","v":0},{"$f":"IF(C664=0,0,CONCATENATE('TGM Fräsen _F pro Min.'!B80,\"mm mit \",'TGM Fräsen _F pro Min.'!C80,\"mm/Min.\"))","v":0},{"$f":"'TGM Fräsen _F pro Min.'!D80","v":0},{"$f":"'TGM Fräsen _F pro Min.'!E80","v":0},"J"]
[{"$f":"'TGM Fräsen _F pro Min.'!A81","v":0},{"$f":"IF(C665=0,0,CONCATENATE('TGM Fräsen _F pro Min.'!B81,\"mm mit \",'TGM Fräsen _F pro Min.'!C81,\"mm/Min.\"))","v":0},{"$f":"'TGM Fräsen _F pro Min.'!D81","v":0},{"$f":"'TGM Fräsen _F pro Min.'!E81","v":0},"J"]
[{"$f":"'TGM Fräsen _F pro Min.'!A82","v":0},{"$f":"IF(C666=0,0,CONCATENATE('TGM Fräsen _F pro Min.'!B82,\"mm mit \",'TGM Fräsen _F pro Min.'!C82,\"mm/Min.\"))","v":0},{"$f":"'TGM Fräsen _F pro Min.'!D82","v":0},{"$f":"'TGM Fräsen _F pro Min.'!E82","v":0},"J"]
[{"$f":"'TGM Fräsen _F pro Min.'!A83","v":0},{"$f":"IF(C667=0,0,CONCATENATE('TGM Fräsen _F pro Min.'!B83,\"mm mit \",'TGM Fräsen _F pro Min.'!C83,\"mm/Min.\"))","v":0},{"$f":"'TGM Fräsen _F pro Min.'!D83","v":0},{"$f":"'TGM Fräsen _F pro Min.'!E83","v":0},"J"]
[{"$f":"'TGM Fräsen _F pro Min.'!A84","v":0},{"$f":"IF(C668=0,0,CONCATENATE('TGM Fräsen _F pro Min.'!B84,\"mm mit \",'TGM Fräsen _F pro Min.'!C84,\"mm/Min.\"))","v":0},{"$f":"'TGM Fräsen _F pro Min.'!D84","v":0},{"$f":"'TGM Fräsen _F pro Min.'!E84","v":0},"J"]
[{"$f":"'TGM Fräsen _F pro Min.'!A85","v":0},{"$f":"IF(C669=0,0,CONCATENATE('TGM Fräsen _F pro Min.'!B85,\"mm mit \",'TGM Fräsen _F pro Min.'!C85,\"mm/Min.\"))","v":0},{"$f":"'TGM Fräsen _F pro Min.'!D85","v":0},{"$f":"'TGM Fräsen _F pro Min.'!E85","v":0},"J"]
[{"$f":"'TGM Fräsen _F pro Min.'!A86","v":0},{"$f":"IF(C670=0,0,CONCATENATE('TGM Fräsen _F pro Min.'!B86,\"mm mit \",'TGM Fräsen _F pro Min.'!C86,\"mm/Min.\"))","v":0},{"$f":"'TGM Fräsen _F pro Min.'!D86","v":0},{"$f":"'TGM Fräsen _F pro Min.'!E86","v":0},"J"]
[{"$f":"'TGM Fräsen _F pro Min.'!A87","v":0},{"$f":"IF(C671=0,0,CONCATENATE('TGM Fräsen _F pro Min.'!B87,\"mm mit \",'TGM Fräsen _F pro Min.'!C87,\"mm/Min.\"))","v":0},{"$f":"'TGM Fräsen _F pro Min.'!D87","v":0},{"$f":"'TGM Fräsen _F pro Min.'!E87","v":0},"J"]
[{"$f":"'TGM Fräsen _F pro Min.'!A88","v":0},{"$f":"IF(C672=0,0,CONCATENATE('TGM Fräsen _F pro Min.'!B88,\"mm mit \",'TGM Fräsen _F pro Min.'!C88,\"mm/Min.\"))","v":0},{"$f":"'TGM Fräsen _F pro Min.'!D88","v":0},{"$f":"'TGM Fräsen _F pro Min.'!E88","v":0},"J"]
[{"$f":"'TGM Fräsen _F pro Min.'!A89","v":0},{"$f":"IF(C673=0,0,CONCATENATE('TGM Fräsen _F pro Min.'!B89,\"mm mit \",'TGM Fräsen _F pro Min.'!C89,\"mm/Min.\"))","v":0},{"$f":"'TGM Fräsen _F pro Min.'!D89","v":0},{"$f":"'TGM Fräsen _F pro Min.'!E89","v":0},"J"]
[{"$f":"'TGM Fräsen _F pro Min.'!A90","v":0},{"$f":"IF(C674=0,0,CONCATENATE('TGM Fräsen _F pro Min.'!B90,\"mm mit \",'TGM Fräsen _F pro Min.'!C90,\"mm/Min.\"))","v":0},{"$f":"'TGM Fräsen _F pro Min.'!D90","v":0},{"$f":"'TGM Fräsen _F pro Min.'!E90","v":0},"J"]
[{"$f":"'TGM Fräsen _F pro Min.'!A91","v":0},{"$f":"IF(C675=0,0,CONCATENATE('TGM Fräsen _F pro Min.'!B91,\"mm mit \",'TGM Fräsen _F pro Min.'!C91,\"mm/Min.\"))","v":0},{"$f":"'TGM Fräsen _F pro Min.'!D91","v":0},{"$f":"'TGM Fräsen _F pro Min.'!E91","v":0},"J"]
[{"$f":"'TGM Fräsen _F pro Min.'!A92","v":0},{"$f":"IF(C676=0,0,CONCATENATE('TGM Fräsen _F pro Min.'!B92,\"mm mit \",'TGM Fräsen _F pro Min.'!C92,\"mm/Min.\"))","v":0},{"$f":"'TGM Fräsen _F pro Min.'!D92","v":0},{"$f":"'TGM Fräsen _F pro Min.'!E92","v":0},"J"]
[{"$f":"'TGM Fräsen _F pro Min.'!A93","v":0},{"$f":"IF(C677=0,0,CONCATENATE('TGM Fräsen _F pro Min.'!B93,\"mm mit \",'TGM Fräsen _F pro Min.'!C93,\"mm/Min.\"))","v":0},{"$f":"'TGM Fräsen _F pro Min.'!D93","v":0},{"$f":"'TGM Fräsen _F pro Min.'!E93","v":0},"J"]
[{"$f":"'TGM Fräsen _F pro Min.'!A94","v":0},{"$f":"IF(C678=0,0,CONCATENATE('TGM Fräsen _F pro Min.'!B94,\"mm mit \",'TGM Fräsen _F pro Min.'!C94,\"mm/Min.\"))","v":0},{"$f":"'TGM Fräsen _F pro Min.'!D94","v":0},{"$f":"'TGM Fräsen _F pro Min.'!E94","v":0},"J"]
[{"$f":"'TGM Fräsen _F pro Min.'!A95","v":0},{"$f":"IF(C679=0,0,CONCATENATE('TGM Fräsen _F pro Min.'!B95,\"mm mit \",'TGM Fräsen _F pro Min.'!C95,\"mm/Min.\"))","v":0},{"$f":"'TGM Fräsen _F pro Min.'!D95","v":0},{"$f":"'TGM Fräsen _F pro Min.'!E95","v":0},"J"]
[{"$f":"'TGM Fräsen _F pro Min.'!A96","v":0},{"$f":"IF(C680=0,0,CONCATENATE('TGM Fräsen _F pro Min.'!B96,\"mm mit \",'TGM Fräsen _F pro Min.'!C96,\"mm/Min.\"))","v":0},{"$f":"'TGM Fräsen _F pro Min.'!D96","v":0},{"$f":"'TGM Fräsen _F pro Min.'!E96","v":0},"J"]
[{"$f":"'TGM Fräsen _F pro Min.'!A97","v":0},{"$f":"IF(C681=0,0,CONCATENATE('TGM Fräsen _F pro Min.'!B97,\"mm mit \",'TGM Fräsen _F pro Min.'!C97,\"mm/Min.\"))","v":0},{"$f":"'TGM Fräsen _F pro Min.'!D97","v":0},{"$f":"'TGM Fräsen _F pro Min.'!E97","v":0},"J"]
[{"$f":"'TGM Fräsen _F pro Min.'!A98","v":0},{"$f":"IF(C682=0,0,CONCATENATE('TGM Fräsen _F pro Min.'!B98,\"mm mit \",'TGM Fräsen _F pro Min.'!C98,\"mm/Min.\"))","v":0},{"$f":"'TGM Fräsen _F pro Min.'!D98","v":0},{"$f":"'TGM Fräsen _F pro Min.'!E98","v":0},"J"]
[{"$f":"'TGM Fräsen _F pro Min.'!A99","v":0},{"$f":"IF(C683=0,0,CONCATENATE('TGM Fräsen _F pro Min.'!B99,\"mm mit \",'TGM Fräsen _F pro Min.'!C99,\"mm/Min.\"))","v":0},{"$f":"'TGM Fräsen _F pro Min.'!D99","v":0},{"$f":"'TGM Fräsen _F pro Min.'!E99","v":0},"J"]
[{"$f":"'TGM Fräsen _F pro Min.'!A100","v":0},{"$f":"IF(C684=0,0,CONCATENATE('TGM Fräsen _F pro Min.'!B100,\"mm mit \",'TGM Fräsen _F pro Min.'!C100,\"mm/Min.\"))","v":0},{"$f":"'TGM Fräsen _F pro Min.'!D100","v":0},{"$f":"'TGM Fräsen _F pro Min.'!E100","v":0},"J"]
[{"$f":"'TGM Fräsen _F pro Min.'!A101","v":0},{"$f":"IF(C685=0,0,CONCATENATE('TGM Fräsen _F pro Min.'!B101,\"mm mit \",'TGM Fräsen _F pro Min.'!C101,\"mm/Min.\"))","v":0},{"$f":"'TGM Fräsen _F pro Min.'!D101","v":0},{"$f":"'TGM Fräsen _F pro Min.'!E101","v":0},"J"]
[{"$f":"'TGM Fräsen _F pro Min.'!A102","v":0},{"$f":"IF(C686=0,0,CONCATENATE('TGM Fräsen _F pro Min.'!B102,\"mm mit \",'TGM Fräsen _F pro Min.'!C102,\"mm/Min.\"))","v":0},{"$f":"'TGM Fräsen _F pro Min.'!D102","v":0},{"$f":"'TGM Fräsen _F pro Min.'!E102","v":0},"J"]
[{"$f":"'TGM Fräsen _F pro Min.'!A103","v":0},{"$f":"IF(C687=0,0,CONCATENATE('TGM Fräsen _F pro Min.'!B103,\"mm mit \",'TGM Fräsen _F pro Min.'!C103,\"mm/Min.\"))","v":0},{"$f":"'TGM Fräsen _F pro Min.'!D103","v":0},{"$f":"'TGM Fräsen _F pro Min.'!E103","v":0},"J"]
[{"$f":"'TGM Fräsen _F pro Min.'!A104","v":0},{"$f":"IF(C688=0,0,CONCATENATE('TGM Fräsen _F pro Min.'!B104,\"mm mit \",'TGM Fräsen _F pro Min.'!C104,\"mm/Min.\"))","v":0},{"$f":"'TGM Fräsen _F pro Min.'!D104","v":0},{"$f":"'TGM Fräsen _F pro Min.'!E104","v":0},"J"]
[{"$f":"'TGM Fräsen _F pro Min.'!A105","v":0},{"$f":"IF(C689=0,0,CONCATENATE('TGM Fräsen _F pro Min.'!B105,\"mm mit \",'TGM Fräsen _F pro Min.'!C105,\"mm/Min.\"))","v":0},{"$f":"'TGM Fräsen _F pro Min.'!D105","v":0},{"$f":"'TGM Fräsen _F pro Min.'!E105","v":0},"J"]
[null,null,null,null,{"$f":"IF(B588=0,\"J\",\"N\")","v":"J"}]
[{"$f":"ZSV!B4","v":"(1) Zeitspanungsvolumen Drehen"},null,null,null,{"$f":"IF(B692=0,\"J\",\"N\")","v":"J"}]
["Gesamtzeit in Minuten =",{"$f":"D694","v":0},null,null,{"$f":"IF(B692=0,\"J\",\"N\")","v":"J"}]
["Bemerkung","Vc / Zustellung (ap) / Vorschub pro Umdr.","Zerspanungsvolumen","Zeit",{"$f":"IF(B692=0,\"J\",\"N\")","v":"J"}]
[{"$f":"ZSV!B12","v":0},{"$f":"IF(D694=0,0,CONCATENATE(ZSV!D6,\" / \",ZSV!D7,\" / \",ZSV!D8,\" / + \",ZSV!D10,\"%\"))","v":0},{"$f":"IF(D694=0,0,CONCATENATE(ZSV!D5,\" (dm^3)\"))","v":0},{"$f":"ZSV!D11","v":0},{"$f":"IF(D694=0,\"J\",\"N\")","v":"J"}]
[null,null,null,null,{"$f":"IF(B692=0,\"J\",\"N\")","v":"J"}]
[{"$f":"ZSV!B13","v":"(2) Zeitspanungsvolumen Drehen"},null,null,null,{"$f":"IF(B697=0,\"J\",\"N\")","v":"J"}]
["Gesamtzeit in Minuten =",{"$f":"D699","v":0},null,null,{"$f":"IF(B697=0,\"J\",\"N\")","v":"J"}]
["Bemerkung","Vc / Zustellung (ap) / Vorschub pro Umdr.","Zerspanungsvolumen","Zeit",{"$f":"IF(B697=0,\"J\",\"N\")","v":"J"}]
[{"$f":"ZSV!B21","v":0},{"$f":"IF(D699=0,0,CONCATENATE(ZSV!D15,\" / \",ZSV!D16,\" / \",ZSV!D17,\" / + \",ZSV!D19,\"%\"))","v":0},{"$f":"IF(D699=0,0,CONCATENATE(ZSV!D14,\" (dm^3)\"))","v":0},{"$f":"ZSV!D20","v":0},{"$f":"IF(D699=0,\"J\",\"N\")","v":"J"}]
[null,null,null,null,{"$f":"IF(B697=0,\"J\",\"N\")","v":"J"}]
[{"$f":"ZSV!B22","v":"(3) Zeitspanungsvolumen Drehen"},null,null,null,{"$f":"IF(B702=0,\"J\",\"N\")","v":"J"}]
["Gesamtzeit in Minuten =",{"$f":"D704","v":0},null,null,{"$f":"IF(B702=0,\"J\",\"N\")","v":"J"}]
["Bemerkung","Vc / Zustellung (ap) / Vorschub pro Umdr.","Zerspanungsvolumen","Zeit",{"$f":"IF(B702=0,\"J\",\"N\")","v":"J"}]
[{"$f":"ZSV!B30","v":0},{"$f":"IF(D704=0,0,CONCATENATE(ZSV!D24,\" / \",ZSV!D25,\" / \",ZSV!D26,\" / + \",ZSV!D28,\"%\"))","v":0},{"$f":"IF(D704=0,0,CONCATENATE(ZSV!D23,\" (dm^3)\"))","v":0},{"$f":"ZSV!D29","v":0},{"$f":"IF(D704=0,\"J\",\"N\")","v":"J"}]
[null,null,null,null,{"$f":"IF(B702=0,\"J\",\"N\")","v":"J"}]
[{"$f":"ZSV!B31","v":"(1) Zeitspanungsvolumen Fräsen"},null,null,null,{"$f":"IF(B707=0,\"J\",\"N\")","v":"J"}]
["Gesamtzeit in Minuten =",{"$f":"D709","v":0},null,null,{"$f":"IF(B707=0,\"J\",\"N\")","v":"J"}]
["Bemerkung","Breire (ae) / Tiefe (ap) / Vorschub mm/Min","Zerspanungsvolumen","Zeit",{"$f":"IF(B707=0,\"J\",\"N\")","v":"J"}]
[{"$f":"ZSV!B39","v":0},{"$f":"IF(D709=0,0,CONCATENATE(ZSV!D33,\" / \",ZSV!D34,\" / \",ZSV!D35,\" / + \",ZSV!D37,\"%\"))","v":0},{"$f":"IF(D709=0,0,CONCATENATE(ZSV!D32,\" (dm^3)\"))","v":0},{"$f":"ZSV!D38","v":0},{"$f":"IF(D709=0,\"J\",\"N\")","v":"J"}]
[null,null,null,null,{"$f":"IF(B707=0,\"J\",\"N\")","v":"J"}]
[{"$f":"ZSV!B40","v":"(2) Zeitspanungsvolumen Fräsen"},null,null,null,{"$f":"IF(B712=0,\"J\",\"N\")","v":"J"}]
["Gesamtzeit in Minuten =",{"$f":"D714","v":0},null,null,{"$f":"IF(B712=0,\"J\",\"N\")","v":"J"}]
["Bemerkung","Breire (ae) / Tiefe (ap) / Vorschub mm/Min","Zerspanungsvolumen","Zeit",{"$f":"IF(B712=0,\"J\",\"N\")","v":"J"}]
[{"$f":"ZSV!B48","v":0},{"$f":"IF(D714=0,0,CONCATENATE(ZSV!D42,\" / \",ZSV!D43,\" / \",ZSV!D44,\" / + \",ZSV!D46,\"%\"))","v":0},{"$f":"IF(D714=0,0,CONCATENATE(ZSV!D41,\" (dm^3)\"))","v":0},{"$f":"ZSV!D47","v":0},{"$f":"IF(D714=0,\"J\",\"N\")","v":"J"}]
[null,null,null,null,{"$f":"IF(B712=0,\"J\",\"N\")","v":"J"}]
[{"$f":"ZSV!B49","v":"(3) Zeitspanungsvolumen Fräsen"},null,null,null,{"$f":"IF(B717=0,\"J\",\"N\")","v":"J"}]
["Gesamtzeit in Minuten =",{"$f":"D719","v":0},null,null,{"$f":"IF(B717=0,\"J\",\"N\")","v":"J"}]
["Bemerkung","Breire (ae) / Tiefe (ap) / Vorschub mm/Min","Zerspanungsvolumen","Zeit",{"$f":"IF(B717=0,\"J\",\"N\")","v":"J"}]
[{"$f":"ZSV!B57","v":0},{"$f":"IF(D719=0,0,CONCATENATE(ZSV!D51,\" / \",ZSV!D52,\" / \",ZSV!D53,\" / + \",ZSV!D55,\"%\"))","v":0},{"$f":"IF(D719=0,0,CONCATENATE(ZSV!D50,\" (dm^3)\"))","v":0},{"$f":"ZSV!D56","v":0},{"$f":"IF(D719=0,\"J\",\"N\")","v":"J"}]
[null,null,null,null,{"$f":"IF(B717=0,\"J\",\"N\")","v":"J"}]

{"sheet":"diverse Arbeiten","index":3,"n_rows":104,"n_cols":5,"rows_kept":104,"cut":false,"hidden":false,"merged":[[0,1,0,3]]}
[null,"Zeitberechnung diverse Arbeiten"]
[null,null,null,"Gesamtzeit =",{"$f":"SUM(E4:E104)","v":0}]
["Bemerkung","Was?","Menge","Zeitvorgabe","Zeit in Minuten"]
[null,null,null,null,{"$f":"C4*D4","v":0}]
[null,null,null,null,0]
[null,null,null,null,0]
[null,null,null,null,0]
[null,null,null,null,0]
[null,null,null,null,0]
[null,null,null,null,0]
[null,null,null,null,0]
[null,null,null,null,0]
[null,null,null,null,0]
[null,null,null,null,0]
[null,null,null,null,0]
[null,null,null,null,0]
[null,null,null,null,0]
[null,null,null,null,0]
[null,null,null,null,0]
[null,null,null,null,0]
[null,null,null,null,0]
[null,null,null,null,0]
[null,null,null,null,0]
[null,null,null,null,0]
[null,null,null,null,0]
[null,null,null,null,0]
[null,null,null,null,{"$f":"C27*D27","v":0}]
[null,null,null,null,0]
[null,null,null,null,0]
[null,null,null,null,0]
[null,null,null,null,0]
[null,null,null,null,0]
[null,null,null,null,0]
[null,null,null,null,0]
[null,null,null,null,0]
[null,null,null,null,0]
[null,null,null,null,0]
[null,null,null,null,0]
[null,null,null,null,0]
[null,null,null,null,0]
[null,null,null,null,0]
[null,null,null,null,0]
[null,null,null,null,0]
[null,null,null,null,0]
[null,null,null,null,0]
[null,null,null,null,0]
[null,null,null,null,0]
[null,null,null,null,0]
[null,null,null,null,0]
[null,null,null,null,0]
[null,null,null,null,0]
[null,null,null,null,0]
[null,null,null,null,0]
[null,null,null,null,0]
[null,null,null,null,0]
[null,null,null,null,0]
[null,null,null,null,0]
[null,null,null,null,0]
[null,null,null,null,0]
[null,null,null,null,0]
[null,null,null,null,0]
[null,null,null,null,0]
[null,null,null,null,0]
[null,null,null,null,0]
[null,null,null,null,0]
[null,null,null,null,0]
[null,null,null,null,0]
[null,null,null,null,0]
[null,null,null,null,0]
[null,null,null,null,0]
[null,null,null,null,0]
[null,null,null,null,0]
[null,null,null,null,0]
[null,null,null,null,0]
[null,null,null,null,0]
[null,null,null,null,0]
[null,null,null,null,0]
[null,null,null,null,0]
[null,null,null,null,0]
[null,null,null,null,0]
[null,null,null,null,0]
[null,null,null,null,0]
[null,null,null,null,0]
[null,null,null,null,0]
[null,null,null,null,0]
[null,null,null,null,0]
[null,null,null,null,0]
[null,null,null,null,0]
[null,null,null,null,0]
[null,null,null,null,0]
[null,null,null,null,{"$f":"C91*D91","v":0}]
[null,null,null,null,0]
[null,null,null,null,0]
[null,null,null,null,0]
[null,null,null,null,0]
[null,null,null,null,0]
[null,null,null,null,0]
[null,null,null,null,0]
[null,null,null,null,0]
[null,null,null,null,0]
[null,null,null,null,0]
[null,null,null,null,0]
[null,null,null,null,0]
[null,null,null,null,0]

{"sheet":"TGM Standardgewinde","index":4,"n_rows":52,"n_cols":6,"rows_kept":52,"cut":false,"hidden":false,"merged":[]}
["Zeitberechnung  zentrieren, bohren, senken und Gewinde schneiden bei Standardgewinden",null,null,null,null,"Gesamtzeit"]
["Bemerkung","Was?","Menge","Zeitvorgabe","Zeit",{"$f":"SUM(E:E)","v":0}]
[null,null,null,null,{"$f":"C3*D3","v":0}]
[null,"M4",null,1.7,{"$f":"C4*D4","v":0}]
[null,"M5",null,2,{"$f":"C5*D5","v":0}]
[null,"M6",null,2.5,0]
[null,"M8",null,3,0]
[null,"M10",null,3.5,0]
[null,"M12",null,3.7,0]
[null,"M14",null,4,0]
[null,"M16",null,4.2,0]
[null,"M18",null,4.5,0]
[null,"M20",null,4.7,0]
[null,"M22",null,5,0]
[null,"M24",null,5.5,0]
[null,"G1/8\"",null,2,0]
[null,"G1/4\"",null,3,0]
[null,"G1/2\"",null,3.5,0]
[null,"G3/4\"",null,4,{"$f":"C19*D19","v":0}]
[null,"G1",null,5,{"$f":"C20*D20","v":0}]
[null,0,null,0,0]
[null,0,null,0,0]
[null,0,null,0,0]
[null,0,null,0,0]
[null,0,null,0,0]
[null,0,null,0,{"$f":"C26*D26","v":0}]
[null,0,null,0,0]
[null,0,null,0,0]
[null,0,null,0,0]
[null,0,null,0,0]
[null,0,null,0,0]
[null,0,null,0,0]
[null,0,null,0,0]
[null,0,null,0,0]
[null,0,null,0,0]
[null,0,null,0,0]
[null,0,null,0,0]
[null,0,null,0,0]
[null,0,null,0,0]
[null,0,null,0,0]
[null,0,null,0,0]
[null,0,null,0,0]
[null,0,null,0,0]
[null,0,null,0,0]
[null,0,null,0,0]
[null,0,null,0,0]
[null,0,null,0,0]
[null,0,null,0,0]
[null,0,null,0,0]
[null,0,null,0,0]
[null,0,null,0,{"$f":"C51*D51","v":0}]
[null,0,null,0,0]

{"sheet":"TGM Bohren","index":5,"n_rows":26,"n_cols":10,"rows_kept":26,"cut":false,"hidden":false,"merged":[]}
[]
["Grundzeitberechnung für das Bohren ohne Ausspanen",null,null,null,null,null,null,null,null,"Gesamtzeit"]
["Bemerkung","Ø der Bohrung","Anzahl der Bohrungen","Vorschub in mm/U","Drehzahl","Tiefe der Bohrung","Vorschub in mm/Min","Vc in m/Min","Zeit",{"$f":"SUM(I:I)","v":0}]
[null,null,null,null,null,null,{"$f":"D4*E4","v":0},{"$f":"B4*PI()*E4/1000","v":0},{"$f":"IF(G4=0,0,F4/G4*C4)","v":0}]
[null,null,null,null,null,null,{"$f":"D5*E5","v":0},{"$f":"B5*PI()*E5/1000","v":0},{"$f":"IF(G5=0,0,F5/G5*C5)","v":0}]
[null,null,null,null,null,null,0,0,0]
[null,null,null,null,null,null,0,0,0]
[null,null,null,null,null,null,0,0,0]
[null,null,null,null,null,null,0,0,0]
[null,null,null,null,null,null,0,0,0]
[null,null,null,null,null,null,0,0,0]
[null,null,null,null,null,null,0,0,0]
[null,null,null,null,null,null,0,0,0]
[null,null,null,null,null,null,0,0,0]
[null,null,null,null,null,null,0,0,0]
[null,null,null,null,null,null,0,0,0]
[null,null,null,null,null,null,0,0,0]
[null,null,null,null,null,null,0,0,0]
[null,null,null,null,null,null,0,0,0]
[null,null,null,null,null,null,0,0,0]
[null,null,null,null,null,null,0,0,0]
[null,null,null,null,null,null,0,0,0]
[null,null,null,null,null,null,0,0,0]
[null,null,null,null,null,null,0,0,0]
[null,null,null,null,null,null,0,0,0]
[null,null,null,null,null,null,0,0,0]

{"sheet":" Tiefbohren mehrere Arten","index":6,"n_rows":44,"n_cols":18,"rows_kept":44,"cut":false,"hidden":false,"merged":[]}
[null,null,"Berechnungstabelle für die Bearbeitungsdauer beim Tiefbohren mit Ausspanung"]
[null,null,null,"Gesamtzeit =",{"$f":"ROUND(SUM(K:K),2)","v":0},"Minuten",null,"Info"]
[null,"Standardwerte",null,600,22,3000,222,2,3,2]
["Nr.","Bemerkung","Anzahl der Bohrungen","Drehzahl","Arbeits-vorschub in mm/min","Eilgang in mm/min","Bohrtiefe in mm","Schaltzeit in Sekunden","Reduzier-wert in mm","Sicherheis-abstand nach Ausspanung","Gesamtzeit","Ausspa- nungen","Arbeits-vorschub in mm/Um-drehung","Verfahrweg im Vorschub","Zeit Vorschub","Verfahrweg im Eilgang","Zeit Eilgang","Summe des Sicherheisab-standes nach Ausspanung"]
[1,null,null,null,null,null,null,null,null,null,{"$f":"O5+Q5","v":0},{"$f":"IF(I5=0,0,G5/I5)","v":0},{"$f":"IF(D5=0,0,E5/D5)","v":0},{"$f":"G5+R5","v":0},{"$f":"IF(E5=0,0,(((N5)/E5)+(H5*L5/60))*C5)","v":0},{"$f":"((((I5+G5)*(L5/2))*2)-((L5-1)*J5))-G5","v":0},{"$f":"IF(F5=0,0,((P5/F5)+(H5*L5/60))*C5)","v":0},{"$f":"(J5*L5)-J5","v":0}]
[2,null,null,null,null,null,null,null,null,null,{"$f":"O6+Q6","v":0},{"$f":"IF(I6=0,0,G6/I6)","v":0},{"$f":"IF(D6=0,0,E6/D6)","v":0},{"$f":"G6+R6","v":0},{"$f":"IF(E6=0,0,(((N6)/E6)+(H6*L6/60))*C6)","v":0},{"$f":"((((I6+G6)*(L6/2))*2)-((L6-1)*J6))-G6","v":0},{"$f":"IF(F6=0,0,((P6/F6)+(H6*L6/60))*C6)","v":0},{"$f":"(J6*L6)-J6","v":0}]
[3,null,null,null,null,null,null,null,null,null,0,0,0,0,0,0,0,0]
[4,null,null,null,null,null,null,null,null,null,0,0,0,0,0,0,0,0]
[5,null,null,null,null,null,null,null,null,null,0,0,0,0,0,0,0,0]
[6,null,null,null,null,null,null,null,null,null,0,0,0,0,0,0,0,0]
[7,null,null,null,null,null,null,null,null,null,0,0,0,0,0,0,0,0]
[8,null,null,null,null,null,null,null,null,null,0,0,0,0,0,0,0,0]
[9,null,null,null,null,null,null,null,null,null,0,0,0,0,0,0,0,0]
[10,null,null,null,null,null,null,null,null,null,0,0,0,0,0,0,0,0]
[11,null,null,null,null,null,null,null,null,null,0,0,0,0,0,0,0,0]
[12,null,null,null,null,null,null,null,null,null,0,0,0,0,0,0,0,0]
[13,null,null,null,null,null,null,null,null,null,0,0,0,0,0,0,0,0]
[14,null,null,null,null,null,null,null,null,null,0,0,0,0,0,0,0,0]
[15,null,null,null,null,null,null,null,null,null,0,0,0,0,0,0,0,0]
[16,null,null,null,null,null,null,null,null,null,0,0,0,0,0,0,0,0]
[17,null,null,null,null,null,null,null,null,null,0,0,0,0,0,0,0,0]
[18,null,null,null,null,null,null,null,null,null,0,0,0,0,0,0,0,0]
[19,null,null,null,null,null,null,null,null,null,0,0,0,0,0,0,0,0]
[20,null,null,null,null,null,null,null,null,null,0,0,0,0,0,0,0,0]
[21,null,null,null,null,null,null,null,null,null,0,0,0,0,0,0,0,0]
[22,null,null,null,null,null,null,null,null,null,0,0,0,0,0,0,0,0]
[23,null,null,null,null,null,null,null,null,null,0,0,0,0,0,0,0,0]
[24,null,null,null,null,null,null,null,null,null,0,0,0,0,0,0,0,0]
[25,null,null,null,null,null,null,null,null,null,0,0,0,0,0,0,0,0]
[26,null,null,null,null,null,null,null,null,null,0,0,0,0,0,0,0,0]
[27,null,null,null,null,null,null,null,null,null,0,0,0,0,0,0,0,0]
[28,null,null,null,null,null,null,null,null,null,0,0,0,0,0,0,0,0]
[29,null,null,null,null,null,null,null,null,null,0,0,0,0,0,0,0,0]
[30,null,null,null,null,null,null,null,null,null,0,0,0,0,0,0,0,0]
[31,null,null,null,null,null,null,null,null,null,0,0,0,0,0,0,0,0]
[32,null,null,null,null,null,null,null,null,null,0,0,0,0,0,0,0,0]
[33,null,null,null,null,null,null,null,null,null,0,0,0,0,0,0,0,0]
[34,null,null,null,null,null,null,null,null,null,0,0,0,0,0,0,0,0]
[35,null,null,null,null,null,null,null,null,null,0,0,0,0,0,0,0,0]
[36,null,null,null,null,null,null,null,null,null,0,0,0,0,0,0,0,0]
[37,null,null,null,null,null,null,null,null,null,0,0,0,0,0,0,0,0]
[38,null,null,null,null,null,null,null,null,null,0,0,0,0,0,0,0,0]
[39,null,null,null,null,null,null,null,null,null,0,0,0,0,0,0,0,0]
[40,null,null,null,null,null,null,null,null,null,0,0,0,0,0,0,0,0]

{"sheet":"TGM Rundschleifen","index":7,"n_rows":45,"n_cols":16,"rows_kept":45,"cut":false,"hidden":false,"merged":[[1,3,1,4]]}
[null,"Berechnungstabelle für die Bearbeitungsdauer beim Rundschleifen"]
[null,"Gesamtzeit:",null,{"$f":"ROUND(SUM(P6:P45),2)","v":0},null,"Minuten"]
[null,"D1/auß.","Vc/auß.","ns/auß.",null,"D1/inn.","Vc/inn.","ns/inn."]
[null,300,35,{"$f":"(C4*1000*60)/(B4*PI())","v":2228.1692032865349},null,50,35,{"$f":"(G4*1000*60)/(F4*PI())","v":13369.015219719207}]
["Nr.","l","n","f","D","d","a","ia","bs","außen oder innen (0/1)","tsz","Bemerkung","i","Vf","L","th"]
[1,null,null,null,null,null,null,null,null,null,null,null,{"$f":"IF(G6=0,0,IF(J6=0,((E6-F6)/(2*G6)+H6),((F6-E6)/(2*G6)+H6)))","v":0},{"$f":"E6*PI()*C6","v":0},{"$f":"B6-2/3*I6","v":0},{"$f":"IF(C6=0,0,IF(D6=0,0,((O6*M6)/(D6*C6))+(M6*K6/60)))","v":0}]
[2,null,null,null,null,null,null,null,null,null,null,null,{"$f":"IF(G7=0,0,IF(J7=0,((E7-F7)/(2*G7)+H7),((F7-E7)/(2*G7)+H7)))","v":0},{"$f":"E7*PI()*C7","v":0},{"$f":"B7-2/3*I7","v":0},{"$f":"IF(C7=0,0,((O7*M7)/(D7*C7))+(M7*K7/60))","v":0}]
[3,null,null,null,null,null,null,null,null,null,null,null,0,0,0,0]
[4,null,null,null,null,null,null,null,null,null,null,null,0,0,0,0]
[5,null,null,null,null,null,null,null,null,null,null,null,0,0,0,0]
[6,null,null,null,null,null,null,null,null,null,null,null,0,0,0,0]
[7,null,null,null,null,null,null,null,null,null,null,null,0,0,0,0]
[8,null,null,null,null,null,null,null,null,null,null,null,0,0,0,0]
[9,null,null,null,null,null,null,null,null,null,null,null,0,0,0,0]
[10,null,null,null,null,null,null,null,null,null,null,null,0,0,0,0]
[11,null,null,null,null,null,null,null,null,null,null,null,0,0,0,0]
[12,null,null,null,null,null,null,null,null,null,null,null,0,0,0,0]
[13,null,null,null,null,null,null,null,null,null,null,null,0,0,0,0]
[14,null,null,null,null,null,null,null,null,null,null,null,0,0,0,0]
[15,null,null,null,null,null,null,null,null,null,null,null,0,0,0,0]
[16,null,null,null,null,null,null,null,null,null,null,null,0,0,0,0]
[17,null,null,null,null,null,null,null,null,null,null,null,0,0,0,0]
[18,null,null,null,null,null,null,null,null,null,null,null,0,0,0,0]
[19,null,null,null,null,null,null,null,null,null,null,null,0,0,0,0]
[20,null,null,null,null,null,null,null,null,null,null,null,0,0,0,0]
[21,null,null,null,null,null,null,null,null,null,null,null,{"$f":"IF(G26=0,0,IF(J26=0,((E26-F26)/(2*G26)+H26),((F26-E26)/(2*G26)+H26)))","v":0},{"$f":"E26*PI()*C26","v":0},{"$f":"B26-2/3*I26","v":0},{"$f":"IF(C26=0,0,((O26*M26)/(D26*C26))+(M26*K26/60))","v":0}]
[22,null,null,null,null,null,null,null,null,null,null,null,0,0,0,0]
[23,null,null,null,null,null,null,null,null,null,null,null,0,0,0,0]
[24,null,null,null,null,null,null,null,null,null,null,null,0,0,0,0]
[25,null,null,null,null,null,null,null,null,null,null,null,0,0,0,0]
[26,null,null,null,null,null,null,null,null,null,null,null,0,0,0,0]
[27,null,null,null,null,null,null,null,null,null,null,null,0,0,0,0]
[28,null,null,null,null,null,null,null,null,null,null,null,0,0,0,0]
[29,null,null,null,null,null,null,null,null,null,null,null,0,0,0,0]
[30,null,null,null,null,null,null,null,null,null,null,null,0,0,0,0]
[31,null,null,null,null,null,null,null,null,null,null,null,0,0,0,0]
[32,null,null,null,null,null,null,null,null,null,null,null,0,0,0,0]
[33,null,null,null,null,null,null,null,null,null,null,null,0,0,0,0]
[34,null,null,null,null,null,null,null,null,null,null,null,0,0,0,0]
[35,null,null,null,null,null,null,null,null,null,null,null,0,0,0,0]
[36,null,null,null,null,null,null,null,null,null,null,null,0,0,0,0]
[37,null,null,null,null,null,null,null,null,null,null,null,0,0,0,0]
[38,null,null,null,null,null,null,null,null,null,null,null,0,0,0,0]
[39,null,null,null,null,null,null,null,null,null,null,null,0,0,0,0]
[40,null,null,null,null,null,null,null,null,null,null,null,0,0,0,0]

{"sheet":"TGM Plandrehen","index":8,"n_rows":65,"n_cols":13,"rows_kept":65,"cut":false,"hidden":false,"merged":[]}
["Schnittzeitberechnung Plandrehen",null,null,null,null,null,null,null,null,"Gesamtzeit:",{"$f":"IF(M14<>0,\"Fehler Plandrehen\",SUM(J15:J65))","v":0}]
["V= Schnittgeschwindigkeit in Meter/Minute"]
["Dm1= Anfangsdurchmesser in mm"]
["Dm2= Endurchmesser in mm"]
["F=Vorschub"]
["i= Anzahl der Schnitte"]
["n max= maximale Drehzahl der Maschine(Grenzdrehzahl)"]
["n1 = durchschnittliche Drehzahl bei Berechnung für Wegstrecke (Dm1) bis (Dm2) wenn Dm n max < Dm2"]
["n2 = durchschnittliche Drehzahl bei Berechnung für Wegstrecke (Dm1) bis (Dm n max) wenn Dm n max >Dm2"]
["Achtung:"]
["Das erreichen der Grenzdrehzahl Maschine wird in der Berechnungsformel mit berücksichtigt."]
["Ab (Dm n max) bleibt die Drehzahl gleich und die Schnittgeschwindigkeit verringert sich."]
["Standardwerte",200,null,null,null,0.3,1000]
["Bemerkung","V","Dm1","Dm2 ","i ","F","n max","Dm n max","n1","Zeit i","n2",null,{"$f":"SUM(M15:M65)","v":0}]
[null,null,null,null,null,null,null,{"$f":"IF(E15=0,0,IF(B15=0,0,IF(G15=0,0,(B15*1000)/(PI()*G15))))","v":0},{"$f":"IF(E15=0,0,IF(B15=0,0,(B15*1000)/((((C15-D15)/2)+D15)*PI())))","v":0},{"$f":"IF(E15=0,0,IF(C15=0,0,IF(F15=0,0,IF(H15>C15,(((C15-D15)/2)/(G15*F15)*E15),IF(H15<=D15,(((C15-D15)/2)/(I15*F15)*E15),((((C15-H15)/2)/((K15*F15))+(((H15-D15)/2)/(G15*F15)))*E15))))))","v":0},{"$f":"IF(E15=0,0,IF(B15=0,0,(B15*1000)/((((C15-H15)/2)+H15)*PI())))","v":0},{"$f":"IF(C15<D15,\"!!!Fehler! Dm1<Dm2!!!\",\"\")","v":""},{"$f":"IF(L15<>\"\",1,0)","v":0}]
[null,null,null,null,null,null,null,{"$f":"IF(E16=0,0,IF(B16=0,0,IF(G16=0,0,(B16*1000)/(PI()*G16))))","v":0},{"$f":"IF(E16=0,0,IF(B16=0,0,(B16*1000)/((((C16-D16)/2)+D16)*PI())))","v":0},{"$f":"IF(E16=0,0,IF(C16=0,0,IF(F16=0,0,IF(H16>C16,(((C16-D16)/2)/(G16*F16)*E16),IF(H16<=D16,(((C16-D16)/2)/(I16*F16)*E16),((((C16-H16)/2)/((K16*F16))+(((H16-D16)/2)/(G16*F16)))*E16))))))","v":0},{"$f":"IF(E16=0,0,IF(B16=0,0,(B16*1000)/((((C16-H16)/2)+H16)*PI())))","v":0},{"$f":"IF(C16<D16,\"!!!Fehler! Dm1<Dm2!!!\",\"\")","v":""},{"$f":"IF(L16<>\"\",1,0)","v":0}]
[null,null,null,null,null,null,null,0,0,{"$f":"IF(E17=0,0,IF(C17=0,0,IF(F17=0,0,IF(H17>C17,(((C17-D17)/2)/(G17*F17)*E17),IF(H17<=D17,(((C17-D17)/2)/(I17*F17)*E17),((((C17-H17)/2)/((K17*F17))+(((H17-D17)/2)/(G17*F17)))*E17))))))","v":0},0,"",0]
[null,null,null,null,null,null,null,0,0,0,0,"",0]
[null,null,null,null,null,null,null,0,0,0,0,"",0]
[null,null,null,null,null,null,null,0,0,0,0,"",0]
[null,null,null,null,null,null,null,0,0,0,0,"",0]
[null,null,null,null,null,null,null,0,0,0,0,"",0]
[null,null,null,null,null,null,null,0,0,0,0,"",0]
[null,null,null,null,null,null,null,0,0,0,0,"",0]
[null,null,null,null,null,null,null,0,0,0,0,"",0]
[null,null,null,null,null,null,null,0,0,0,0,"",0]
[null,null,null,null,null,null,null,0,0,0,0,"",0]
[null,null,null,null,null,null,null,0,0,0,0,"",0]
[null,null,null,null,null,null,null,0,0,0,0,"",0]
[null,null,null,null,null,null,null,0,0,0,0,"",0]
[null,null,null,null,null,null,null,0,0,0,0,"",0]
[null,null,null,null,null,null,null,0,0,0,0,"",0]
[null,null,null,null,null,null,null,0,0,0,0,"",0]
[null,null,null,null,null,null,null,0,0,0,0,"",0]
[null,null,null,null,null,null,null,0,0,0,0,"",0]
[null,null,null,null,null,null,null,0,0,0,0,"",0]
[null,null,null,null,null,null,null,0,0,0,0,"",0]
[null,null,null,null,null,null,null,0,0,0,0,"",0]
[null,null,null,null,null,null,null,0,0,0,0,"",0]
[null,null,null,null,null,null,null,0,0,0,0,"",0]
[null,null,null,null,null,null,null,0,0,0,0,"",0]
[null,null,null,null,null,null,null,0,0,0,0,"",0]
[null,null,null,null,null,null,null,0,0,0,0,"",0]
[null,null,null,null,null,null,null,0,0,0,0,"",0]
[null,null,null,null,null,null,null,0,0,0,0,"",0]
[null,null,null,null,null,null,null,0,0,0,0,"",0]
[null,null,null,null,null,null,null,0,0,0,0,"",0]
[null,null,null,null,null,null,null,0,0,0,0,"",0]
[null,null,null,null,null,null,null,0,0,0,0,"",0]
[null,null,null,null,null,null,null,0,0,0,0,"",0]
[null,null,null,null,null,null,null,0,0,0,0,"",0]
[null,null,null,null,null,null,null,0,0,0,0,"",0]
[null,null,null,null,null,null,null,0,0,0,0,"",0]
[null,null,null,null,null,null,null,0,0,0,0,"",0]
[null,null,null,null,null,null,null,0,0,0,0,"",0]
[null,null,null,null,null,null,null,0,0,0,0,"",0]
[null,null,null,null,null,null,null,0,0,0,0,"",0]
[null,null,null,null,null,null,null,0,0,0,0,"",0]
[null,null,null,null,null,null,null,0,0,0,0,"",0]
[null,null,null,null,null,null,null,0,0,0,0,"",0]
[null,null,null,null,null,null,null,0,0,0,0,"",0]
[null,null,null,null,null,null,null,0,0,0,0,"",0]
[null,null,null,null,null,null,null,0,0,0,0,"",0]
[null,null,null,null,null,null,null,0,0,0,0,"",0]
[null,null,null,null,null,null,null,0,0,0,0,"",0]

{"sheet":"TGM Langdrehen ","index":9,"n_rows":116,"n_cols":21,"rows_kept":116,"cut":false,"hidden":false,"merged":[]}
["Schnittzeitberechnung Langdrehen",null,null,null,null,null,null,null,null,null,null,"Gesamtzeit:",{"$f":"IF(O15<>0,\"Fehler Langdrehen\",SUM(L16:L116))","v":0}]
["V= Schnittgeschwindigkeit in Meter/Minute"]
["Dm1= Anfangsdurchmesser in mm"]
["Dm2= Endurchmesser in mm"]
["L= Drehlänge"]
["F=Vorschub"]
["ap= radiale Zustellung / i= Anzahl der Schnitte"]
["n max= maximale Drehzahl der Maschine(Grenzdrehzahl)"]
["n1 = durchschnittliche Drehzahl bei Berechnung für Wegstrecke (Dm1) bis (Dm2) wenn Dm max < Dm2"]
["n2 = durchschnittliche Drehzahl bei Berechnung für Wegstrecke (Dm1) bis (Dm n max) wenn Dm max >Dm2"]
["Achtung:"]
["Das erreichen der Grenzdrehzahl Maschine wird in der Berechnungsformel mit berücksichtigt."]
["Ab (Dm n max) bleibt die Drehzahl gleich und die Schnittgeschwindigkeit verringert sich."]
["Standardwerte",100,null,null,null,null,null,1000]
["Bemerkung","V","Dm1","Dm2 ","L","ap","F","n max","i ","Dm n max","n1","Zeit i","n2",null,{"$f":"SUM(O16:O116)","v":0},"Weg1","Weg2","Weg ges.","i1","i2","i ges."]
[null,null,null,null,null,null,null,null,{"$f":"ROUNDUP(IF(F16=0,0,((C16-D16)/2)/F16),0)","v":0},{"$f":"IF(F16=0,0,IF(H16=0,0,(B16*1000)/(PI()*H16)))","v":0},{"$f":"IF(F16=0,0,IF(B16=0,0,(B16*1000)/((((C16-D16)/2)+D16)*PI())))","v":0},{"$f":"IF(F16=0,0,IF(E16=0,0,IF(G16=0,0,IF(J16>C16,((E16/(H16*G16))*I16),IF(J16<=D16,((E16/(K16*G16))*I16),(((E16/(M16*G16))*S16))+(((E16/(H16*G16))*T16)))))))","v":0},{"$f":"IF(F16=0,0,IF(B16=0,0,(B16*1000)/((((C16-J16)/2)+J16)*PI())))","v":0},{"$f":"IF(C16<D16,\"!!!Fehler! Dm1<Dm2!!!\",\"\")","v":""},{"$f":"IF(N16<>\"\",1,0)","v":0},{"$f":"(C16-J16)/2","v":0},{"$f":"(J16-D16)/2","v":0},{"$f":"P16+Q16","v":0},{"$f":"I16/R16*P16","v":{"$error":"#DIV/0!"}},{"$f":"I16/R16*Q16","v":{"$error":"#DIV/0!"}},{"$f":"S16+T16","v":{"$error":"#DIV/0!"}}]
[null,null,null,null,null,null,null,null,{"$f":"ROUNDUP(IF(F17=0,0,((C17-D17)/2)/F17),0)","v":0},{"$f":"IF(F17=0,0,IF(H17=0,0,(B17*1000)/(PI()*H17)))","v":0},{"$f":"IF(F17=0,0,IF(B17=0,0,(B17*1000)/((((C17-D17)/2)+D17)*PI())))","v":0},{"$f":"IF(I17=0,0,IF(E17=0,0,IF(G17=0,0,IF(J17>C17,((E17/(H17*G17))*I17),IF(J17<=D17,((E17/(K17*G17))*I17),(((E17/(M17*G17))*S17))+(((E17/(H17*G17))*T17)))))))","v":0},{"$f":"IF(F17=0,0,IF(B17=0,0,(B17*1000)/((((C17-J17)/2)+J17)*PI())))","v":0},{"$f":"IF(C17<D17,\"!!!Fehler! Dm1<Dm2!!!\",\"\")","v":""},{"$f":"IF(N17<>\"\",1,0)","v":0},{"$f":"(C17-J17)/2","v":0},{"$f":"(J17-D17)/2","v":0},{"$f":"P17+Q17","v":0},{"$f":"I17/R17*P17","v":{"$error":"#DIV/0!"}},{"$f":"I17/R17*Q17","v":{"$error":"#DIV/0!"}},{"$f":"S17+T17","v":{"$error":"#DIV/0!"}}]
[null,null,null,null,null,null,null,null,0,0,0,0,0,"",0,0,0,0,{"$error":"#DIV/0!"},{"$error":"#DIV/0!"},{"$error":"#DIV/0!"}]
[null,null,null,null,null,null,null,null,0,0,0,0,0,"",0,0,0,0,{"$error":"#DIV/0!"},{"$error":"#DIV/0!"},{"$error":"#DIV/0!"}]
[null,null,null,null,null,null,null,null,0,0,0,0,0,"",0,0,0,0,{"$error":"#DIV/0!"},{"$error":"#DIV/0!"},{"$error":"#DIV/0!"}]
[null,null,null,null,null,null,null,null,0,0,0,0,0,"",0,0,0,0,{"$error":"#DIV/0!"},{"$error":"#DIV/0!"},{"$error":"#DIV/0!"}]
[null,null,null,null,null,null,null,null,0,0,0,0,0,"",0,0,0,0,{"$error":"#DIV/0!"},{"$error":"#DIV/0!"},{"$error":"#DIV/0!"}]
[null,null,null,null,null,null,null,null,0,0,0,0,0,"",0,0,0,0,{"$error":"#DIV/0!"},{"$error":"#DIV/0!"},{"$error":"#DIV/0!"}]
[null,null,null,null,null,null,null,null,0,0,0,0,0,"",0,0,0,0,{"$error":"#DIV/0!"},{"$error":"#DIV/0!"},{"$error":"#DIV/0!"}]
[null,null,null,null,null,null,null,null,0,0,0,0,0,"",0,0,0,0,{"$error":"#DIV/0!"},{"$error":"#DIV/0!"},{"$error":"#DIV/0!"}]
[null,null,null,null,null,null,null,null,0,0,0,0,0,"",0,0,0,0,{"$error":"#DIV/0!"},{"$error":"#DIV/0!"},{"$error":"#DIV/0!"}]
[null,null,null,null,null,null,null,null,0,0,0,0,0,"",0,0,0,0,{"$error":"#DIV/0!"},{"$error":"#DIV/0!"},{"$error":"#DIV/0!"}]
[null,null,null,null,null,null,null,null,0,0,0,0,0,"",0,0,0,0,{"$error":"#DIV/0!"},{"$error":"#DIV/0!"},{"$error":"#DIV/0!"}]
[null,null,null,null,null,null,null,null,0,0,0,0,0,"",0,0,0,0,{"$error":"#DIV/0!"},{"$error":"#DIV/0!"},{"$error":"#DIV/0!"}]
[null,null,null,null,null,null,null,null,0,0,0,0,0,"",0,0,0,0,{"$error":"#DIV/0!"},{"$error":"#DIV/0!"},{"$error":"#DIV/0!"}]
[null,null,null,null,null,null,null,null,0,0,0,0,0,"",0,0,0,0,{"$error":"#DIV/0!"},{"$error":"#DIV/0!"},{"$error":"#DIV/0!"}]
[null,null,null,null,null,null,null,null,0,0,0,0,0,"",0,0,0,0,{"$error":"#DIV/0!"},{"$error":"#DIV/0!"},{"$error":"#DIV/0!"}]
[null,null,null,null,null,null,null,null,0,0,0,0,0,"",0,0,0,0,{"$error":"#DIV/0!"},{"$error":"#DIV/0!"},{"$error":"#DIV/0!"}]
[null,null,null,null,null,null,null,null,0,0,0,0,0,"",0,0,0,0,{"$error":"#DIV/0!"},{"$error":"#DIV/0!"},{"$error":"#DIV/0!"}]
[null,null,null,null,null,null,null,null,0,0,0,0,0,"",0,0,0,0,{"$error":"#DIV/0!"},{"$error":"#DIV/0!"},{"$error":"#DIV/0!"}]
[null,null,null,null,null,null,null,null,0,0,0,0,0,"",0,0,0,0,{"$error":"#DIV/0!"},{"$error":"#DIV/0!"},{"$error":"#DIV/0!"}]
[null,null,null,null,null,null,null,null,0,0,0,0,0,"",0,0,0,0,{"$error":"#DIV/0!"},{"$error":"#DIV/0!"},{"$error":"#DIV/0!"}]
[null,null,null,null,null,null,null,null,0,0,0,0,0,"",0,0,0,0,{"$error":"#DIV/0!"},{"$error":"#DIV/0!"},{"$error":"#DIV/0!"}]
[null,null,null,null,null,null,null,null,0,0,0,0,0,"",0,0,0,0,{"$error":"#DIV/0!"},{"$error":"#DIV/0!"},{"$error":"#DIV/0!"}]
[null,null,null,null,null,null,null,null,0,0,0,0,0,"",0,0,0,0,{"$error":"#DIV/0!"},{"$error":"#DIV/0!"},{"$error":"#DIV/0!"}]
[null,null,null,null,null,null,null,null,0,0,0,0,0,"",0,0,0,0,{"$error":"#DIV/0!"},{"$error":"#DIV/0!"},{"$error":"#DIV/0!"}]
[null,null,null,null,null,null,null,null,0,0,0,0,0,"",0,0,0,0,{"$error":"#DIV/0!"},{"$error":"#DIV/0!"},{"$error":"#DIV/0!"}]
[null,null,null,null,null,null,null,null,0,0,0,0,0,"",0,0,0,0,{"$error":"#DIV/0!"},{"$error":"#DIV/0!"},{"$error":"#DIV/0!"}]
[null,null,null,null,null,null,null,null,0,0,0,0,0,"",0,0,0,0,{"$error":"#DIV/0!"},{"$error":"#DIV/0!"},{"$error":"#DIV/0!"}]
[null,null,null,null,null,null,null,null,0,0,0,0,0,"",0,0,0,0,{"$error":"#DIV/0!"},{"$error":"#DIV/0!"},{"$error":"#DIV/0!"}]
[null,null,null,null,null,null,null,null,0,0,0,0,0,"",0,0,0,0,{"$error":"#DIV/0!"},{"$error":"#DIV/0!"},{"$error":"#DIV/0!"}]
[null,null,null,null,null,null,null,null,0,0,0,0,0,"",0,0,0,0,{"$error":"#DIV/0!"},{"$error":"#DIV/0!"},{"$error":"#DIV/0!"}]
[null,null,null,null,null,null,null,null,0,0,0,0,0,"",0,0,0,0,{"$error":"#DIV/0!"},{"$error":"#DIV/0!"},{"$error":"#DIV/0!"}]
[null,null,null,null,null,null,null,null,0,0,0,0,0,"",0,0,0,0,{"$error":"#DIV/0!"},{"$error":"#DIV/0!"},{"$error":"#DIV/0!"}]
[null,null,null,null,null,null,null,null,0,0,0,0,0,"",0,0,0,0,{"$error":"#DIV/0!"},{"$error":"#DIV/0!"},{"$error":"#DIV/0!"}]
[null,null,null,null,null,null,null,null,0,0,0,0,0,"",0,0,0,0,{"$error":"#DIV/0!"},{"$error":"#DIV/0!"},{"$error":"#DIV/0!"}]
[null,null,null,null,null,null,null,null,0,0,0,0,0,"",0,0,0,0,{"$error":"#DIV/0!"},{"$error":"#DIV/0!"},{"$error":"#DIV/0!"}]
[null,null,null,null,null,null,null,null,0,0,0,0,0,"",0,0,0,0,{"$error":"#DIV/0!"},{"$error":"#DIV/0!"},{"$error":"#DIV/0!"}]
[null,null,null,null,null,null,null,null,0,0,0,0,0,"",0,0,0,0,{"$error":"#DIV/0!"},{"$error":"#DIV/0!"},{"$error":"#DIV/0!"}]
[null,null,null,null,null,null,null,null,0,0,0,0,0,"",0,0,0,0,{"$error":"#DIV/0!"},{"$error":"#DIV/0!"},{"$error":"#DIV/0!"}]
[null,null,null,null,null,null,null,null,0,0,0,0,0,"",0,0,0,0,{"$error":"#DIV/0!"},{"$error":"#DIV/0!"},{"$error":"#DIV/0!"}]
[null,null,null,null,null,null,null,null,0,0,0,0,0,"",0,0,0,0,{"$error":"#DIV/0!"},{"$error":"#DIV/0!"},{"$error":"#DIV/0!"}]
[null,null,null,null,null,null,null,null,0,0,0,0,0,"",0,0,0,0,{"$error":"#DIV/0!"},{"$error":"#DIV/0!"},{"$error":"#DIV/0!"}]
[null,null,null,null,null,null,null,null,0,0,0,0,0,"",0,0,0,0,{"$error":"#DIV/0!"},{"$error":"#DIV/0!"},{"$error":"#DIV/0!"}]
[null,null,null,null,null,null,null,null,0,0,0,0,0,"",0,0,0,0,{"$error":"#DIV/0!"},{"$error":"#DIV/0!"},{"$error":"#DIV/0!"}]
[null,null,null,null,null,null,null,null,0,0,0,0,0,"",0,0,0,0,{"$error":"#DIV/0!"},{"$error":"#DIV/0!"},{"$error":"#DIV/0!"}]
[null,null,null,null,null,null,null,null,0,0,0,0,0,"",0,0,0,0,{"$error":"#DIV/0!"},{"$error":"#DIV/0!"},{"$error":"#DIV/0!"}]
[null,null,null,null,null,null,null,null,0,0,0,0,0,"",0,0,0,0,{"$error":"#DIV/0!"},{"$error":"#DIV/0!"},{"$error":"#DIV/0!"}]
[null,null,null,null,null,null,null,null,0,0,0,0,0,"",0,0,0,0,{"$error":"#DIV/0!"},{"$error":"#DIV/0!"},{"$error":"#DIV/0!"}]
[null,null,null,null,null,null,null,null,0,0,0,0,0,"",0,0,0,0,{"$error":"#DIV/0!"},{"$error":"#DIV/0!"},{"$error":"#DIV/0!"}]
[null,null,null,null,null,null,null,null,0,0,0,0,0,"",0,0,0,0,{"$error":"#DIV/0!"},{"$error":"#DIV/0!"},{"$error":"#DIV/0!"}]
[null,null,null,null,null,null,null,null,0,0,0,0,0,"",0,0,0,0,{"$error":"#DIV/0!"},{"$error":"#DIV/0!"},{"$error":"#DIV/0!"}]
[null,null,null,null,null,null,null,null,0,0,0,0,0,"",0,0,0,0,{"$error":"#DIV/0!"},{"$error":"#DIV/0!"},{"$error":"#DIV/0!"}]
[null,null,null,null,null,null,null,null,0,0,0,0,0,"",0,0,0,0,{"$error":"#DIV/0!"},{"$error":"#DIV/0!"},{"$error":"#DIV/0!"}]
[null,null,null,null,null,null,null,null,0,0,0,0,0,"",0,0,0,0,{"$error":"#DIV/0!"},{"$error":"#DIV/0!"},{"$error":"#DIV/0!"}]
[null,null,null,null,null,null,null,null,0,0,0,0,0,"",0,0,0,0,{"$error":"#DIV/0!"},{"$error":"#DIV/0!"},{"$error":"#DIV/0!"}]
[null,null,null,null,null,null,null,null,0,0,0,0,0,"",0,0,0,0,{"$error":"#DIV/0!"},{"$error":"#DIV/0!"},{"$error":"#DIV/0!"}]
[null,null,null,null,null,null,null,null,0,0,0,0,0,"",0,0,0,0,{"$error":"#DIV/0!"},{"$error":"#DIV/0!"},{"$error":"#DIV/0!"}]
[null,null,null,null,null,null,null,null,0,0,0,0,0,"",0,0,0,0,{"$error":"#DIV/0!"},{"$error":"#DIV/0!"},{"$error":"#DIV/0!"}]
[null,null,null,null,null,null,null,null,0,0,0,0,0,"",0,0,0,0,{"$error":"#DIV/0!"},{"$error":"#DIV/0!"},{"$error":"#DIV/0!"}]
[null,null,null,null,null,null,null,null,0,0,0,0,0,"",0,0,0,0,{"$error":"#DIV/0!"},{"$error":"#DIV/0!"},{"$error":"#DIV/0!"}]
[null,null,null,null,null,null,null,null,0,0,0,0,0,"",0,0,0,0,{"$error":"#DIV/0!"},{"$error":"#DIV/0!"},{"$error":"#DIV/0!"}]
[null,null,null,null,null,null,null,null,0,0,0,0,0,"",0,0,0,0,{"$error":"#DIV/0!"},{"$error":"#DIV/0!"},{"$error":"#DIV/0!"}]
[null,null,null,null,null,null,null,null,0,0,0,0,0,"",0,0,0,0,{"$error":"#DIV/0!"},{"$error":"#DIV/0!"},{"$error":"#DIV/0!"}]
[null,null,null,null,null,null,null,null,0,0,0,0,0,"",0,0,0,0,{"$error":"#DIV/0!"},{"$error":"#DIV/0!"},{"$error":"#DIV/0!"}]
[null,null,null,null,null,null,null,null,{"$f":"ROUNDUP(IF(F81=0,0,((C81-D81)/2)/F81),0)","v":0},{"$f":"IF(F81=0,0,IF(H81=0,0,(B81*1000)/(PI()*H81)))","v":0},{"$f":"IF(F81=0,0,IF(B81=0,0,(B81*1000)/((((C81-D81)/2)+D81)*PI())))","v":0},{"$f":"IF(I81=0,0,IF(E81=0,0,IF(G81=0,0,IF(J81>C81,((E81/(H81*G81))*I81),IF(J81<=D81,((E81/(K81*G81))*I81),(((E81/(M81*G81))*S81))+(((E81/(H81*G81))*T81)))))))","v":0},{"$f":"IF(F81=0,0,IF(B81=0,0,(B81*1000)/((((C81-J81)/2)+J81)*PI())))","v":0},{"$f":"IF(C81<D81,\"!!!Fehler! Dm1<Dm2!!!\",\"\")","v":""},{"$f":"IF(N81<>\"\",1,0)","v":0},{"$f":"(C81-J81)/2","v":0},{"$f":"(J81-D81)/2","v":0},{"$f":"P81+Q81","v":0},{"$f":"I81/R81*P81","v":{"$error":"#DIV/0!"}},{"$f":"I81/R81*Q81","v":{"$error":"#DIV/0!"}},{"$f":"S81+T81","v":{"$error":"#DIV/0!"}}]
[null,null,null,null,null,null,null,null,0,0,0,0,0,"",0,0,0,0,{"$error":"#DIV/0!"},{"$error":"#DIV/0!"},{"$error":"#DIV/0!"}]
[null,null,null,null,null,null,null,null,0,0,0,0,0,"",0,0,0,0,{"$error":"#DIV/0!"},{"$error":"#DIV/0!"},{"$error":"#DIV/0!"}]
[null,null,null,null,null,null,null,null,0,0,0,0,0,"",0,0,0,0,{"$error":"#DIV/0!"},{"$error":"#DIV/0!"},{"$error":"#DIV/0!"}]
[null,null,null,null,null,null,null,null,0,0,0,0,0,"",0,0,0,0,{"$error":"#DIV/0!"},{"$error":"#DIV/0!"},{"$error":"#DIV/0!"}]
[null,null,null,null,null,null,null,null,0,0,0,0,0,"",0,0,0,0,{"$error":"#DIV/0!"},{"$error":"#DIV/0!"},{"$error":"#DIV/0!"}]
[null,null,null,null,null,null,null,null,0,0,0,0,0,"",0,0,0,0,{"$error":"#DIV/0!"},{"$error":"#DIV/0!"},{"$error":"#DIV/0!"}]
[null,null,null,null,null,null,null,null,0,0,0,0,0,"",0,0,0,0,{"$error":"#DIV/0!"},{"$error":"#DIV/0!"},{"$error":"#DIV/0!"}]
[null,null,null,null,null,null,null,null,0,0,0,0,0,"",0,0,0,0,{"$error":"#DIV/0!"},{"$error":"#DIV/0!"},{"$error":"#DIV/0!"}]
[null,null,null,null,null,null,null,null,0,0,0,0,0,"",0,0,0,0,{"$error":"#DIV/0!"},{"$error":"#DIV/0!"},{"$error":"#DIV/0!"}]
[null,null,null,null,null,null,null,null,0,0,0,0,0,"",0,0,0,0,{"$error":"#DIV/0!"},{"$error":"#DIV/0!"},{"$error":"#DIV/0!"}]
[null,null,null,null,null,null,null,null,0,0,0,0,0,"",0,0,0,0,{"$error":"#DIV/0!"},{"$error":"#DIV/0!"},{"$error":"#DIV/0!"}]
[null,null,null,null,null,null,null,null,0,0,0,0,0,"",0,0,0,0,{"$error":"#DIV/0!"},{"$error":"#DIV/0!"},{"$error":"#DIV/0!"}]
[null,null,null,null,null,null,null,null,0,0,0,0,0,"",0,0,0,0,{"$error":"#DIV/0!"},{"$error":"#DIV/0!"},{"$error":"#DIV/0!"}]
[null,null,null,null,null,null,null,null,0,0,0,0,0,"",0,0,0,0,{"$error":"#DIV/0!"},{"$error":"#DIV/0!"},{"$error":"#DIV/0!"}]
[null,null,null,null,null,null,null,null,0,0,0,0,0,"",0,0,0,0,{"$error":"#DIV/0!"},{"$error":"#DIV/0!"},{"$error":"#DIV/0!"}]
[null,null,null,null,null,null,null,null,0,0,0,0,0,"",0,0,0,0,{"$error":"#DIV/0!"},{"$error":"#DIV/0!"},{"$error":"#DIV/0!"}]
[null,null,null,null,null,null,null,null,0,0,0,0,0,"",0,0,0,0,{"$error":"#DIV/0!"},{"$error":"#DIV/0!"},{"$error":"#DIV/0!"}]
[null,null,null,null,null,null,null,null,0,0,0,0,0,"",0,0,0,0,{"$error":"#DIV/0!"},{"$error":"#DIV/0!"},{"$error":"#DIV/0!"}]
[null,null,null,null,null,null,null,null,0,0,0,0,0,"",0,0,0,0,{"$error":"#DIV/0!"},{"$error":"#DIV/0!"},{"$error":"#DIV/0!"}]
[null,null,null,null,null,null,null,null,0,0,0,0,0,"",0,0,0,0,{"$error":"#DIV/0!"},{"$error":"#DIV/0!"},{"$error":"#DIV/0!"}]
[null,null,null,null,null,null,null,null,0,0,0,0,0,"",0,0,0,0,{"$error":"#DIV/0!"},{"$error":"#DIV/0!"},{"$error":"#DIV/0!"}]
[null,null,null,null,null,null,null,null,0,0,0,0,0,"",0,0,0,0,{"$error":"#DIV/0!"},{"$error":"#DIV/0!"},{"$error":"#DIV/0!"}]
[null,null,null,null,null,null,null,null,0,0,0,0,0,"",0,0,0,0,{"$error":"#DIV/0!"},{"$error":"#DIV/0!"},{"$error":"#DIV/0!"}]
[null,null,null,null,null,null,null,null,0,0,0,0,0,"",0,0,0,0,{"$error":"#DIV/0!"},{"$error":"#DIV/0!"},{"$error":"#DIV/0!"}]
[null,null,null,null,null,null,null,null,0,0,0,0,0,"",0,0,0,0,{"$error":"#DIV/0!"},{"$error":"#DIV/0!"},{"$error":"#DIV/0!"}]
[null,null,null,null,null,null,null,null,0,0,0,0,0,"",0,0,0,0,{"$error":"#DIV/0!"},{"$error":"#DIV/0!"},{"$error":"#DIV/0!"}]
[null,null,null,null,null,null,null,null,0,0,0,0,0,"",0,0,0,0,{"$error":"#DIV/0!"},{"$error":"#DIV/0!"},{"$error":"#DIV/0!"}]
[null,null,null,null,null,null,null,null,0,0,0,0,0,"",0,0,0,0,{"$error":"#DIV/0!"},{"$error":"#DIV/0!"},{"$error":"#DIV/0!"}]
[null,null,null,null,null,null,null,null,0,0,0,0,0,"",0,0,0,0,{"$error":"#DIV/0!"},{"$error":"#DIV/0!"},{"$error":"#DIV/0!"}]
[null,null,null,null,null,null,null,null,0,0,0,0,0,"",0,0,0,0,{"$error":"#DIV/0!"},{"$error":"#DIV/0!"},{"$error":"#DIV/0!"}]
[null,null,null,null,null,null,null,null,0,0,0,0,0,"",0,0,0,0,{"$error":"#DIV/0!"},{"$error":"#DIV/0!"},{"$error":"#DIV/0!"}]
[null,null,null,null,null,null,null,null,0,0,0,0,0,"",0,0,0,0,{"$error":"#DIV/0!"},{"$error":"#DIV/0!"},{"$error":"#DIV/0!"}]
[null,null,null,null,null,null,null,null,0,0,0,0,0,"",0,0,0,0,{"$error":"#DIV/0!"},{"$error":"#DIV/0!"},{"$error":"#DIV/0!"}]
[null,null,null,null,null,null,null,null,0,0,0,0,0,"",0,0,0,0,{"$error":"#DIV/0!"},{"$error":"#DIV/0!"},{"$error":"#DIV/0!"}]
[null,null,null,null,null,null,null,null,0,0,0,0,0,"",0,0,0,0,{"$error":"#DIV/0!"},{"$error":"#DIV/0!"},{"$error":"#DIV/0!"}]

{"sheet":"Aufmaß Zeitspanvolumen Drehen","index":10,"n_rows":58,"n_cols":13,"rows_kept":58,"cut":false,"hidden":false,"merged":[]}
["Aufmaß Zeitspanvolumenberechnung beim Drehen"]
["Gesamtvolumen  in dm³ =",null,{"$f":"SUM($L$8:$L$58)","v":0}]
["Bearbeitungsdauer +Zuschlagsatz in Minuten",null,{"$f":"SUM($M$8:$M$58)","v":0}]
["Eingabe Fertigmaße und Spanaufmaß! (Øa = Außen-Ø, L = Länge, Aufmaß = Spanaufmaß \"radiusbezogen\")"]
[]
["Standardwerte",100,5,0.3,10]
["Bemerkung","Vc","ap","f","Zs in %","Øa","L","Aufmaß","Øi","Rohmaße außen","Rohmaße innen","Volumen in dm³","Zeit in Min."]
[null,null,null,null,null,null,null,null,null,{"$f":"IF(F8=0,0,(F8+(2*H8)))","v":0},{"$f":"IF(I8=0,0,I8-(2*H8))","v":0},{"$f":"((J8*J8*0.7853898163*G8)/1000000)-((F8*F8*0.7853898163*G8)/1000000)+((I8*I8*0.7853898163*G8)/1000000)-((K8*K8*0.7853898163*G8)/1000000)","v":0},{"$f":"ROUND(IF(B8=0,0,IF(C8=0,0,IF(L8=0,0,L8/((B8*C8*D8*1000)/1000000))))*(E8+100)/100,2)","v":0}]
[null,null,null,null,null,null,null,null,null,{"$f":"IF(F9=0,0,(F9+(2*H9)))","v":0},{"$f":"IF(I9=0,0,I9-(2*H9))","v":0},{"$f":"((J9*J9*0.7853898163*G9)/1000000)-((F9*F9*0.7853898163*G9)/1000000)+((I9*I9*0.7853898163*G9)/1000000)-((K9*K9*0.7853898163*G9)/1000000)","v":0},{"$f":"ROUND(IF(B9=0,0,IF(C9=0,0,IF(L9=0,0,L9/((B9*C9*D9*1000)/1000000))))*(E9+100)/100,2)","v":0}]
[null,null,null,null,null,null,null,null,null,0,0,0,0]
[null,null,null,null,null,null,null,null,null,0,0,0,0]
[null,null,null,null,null,null,null,null,null,0,0,0,0]
[null,null,null,null,null,null,null,null,null,0,0,0,0]
[null,null,null,null,null,null,null,null,null,0,0,0,0]
[null,null,null,null,null,null,null,null,null,0,0,0,0]
[null,null,null,null,null,null,null,null,null,0,0,0,0]
[null,null,null,null,null,null,null,null,null,0,0,0,0]
[null,null,null,null,null,null,null,null,null,0,0,0,0]
[null,null,null,null,null,null,null,null,null,0,0,0,0]
[null,null,null,null,null,null,null,null,null,0,0,0,0]
[null,null,null,null,null,null,null,null,null,0,0,0,0]
[null,null,null,null,null,null,null,null,null,0,0,0,0]
[null,null,null,null,null,null,null,null,null,0,0,0,0]
[null,null,null,null,null,null,null,null,null,0,0,0,0]
[null,null,null,null,null,null,null,null,null,0,0,0,0]
[null,null,null,null,null,null,null,null,null,0,0,0,0]
[null,null,null,null,null,null,null,null,null,0,0,0,0]
[null,null,null,null,null,null,null,null,null,0,0,0,0]
[null,null,null,null,null,null,null,null,null,0,0,0,0]
[null,null,null,null,null,null,null,null,null,0,0,0,0]
[null,null,null,null,null,null,null,null,null,0,0,0,0]
[null,null,null,null,null,null,null,null,null,0,0,0,0]
[null,null,null,null,null,null,null,null,null,0,0,0,0]
[null,null,null,null,null,null,null,null,null,0,0,0,0]
[null,null,null,null,null,null,null,null,null,0,0,0,0]
[null,null,null,null,null,null,null,null,null,0,0,0,0]
[null,null,null,null,null,null,null,null,null,0,0,0,0]
[null,null,null,null,null,null,null,null,null,0,0,0,0]
[null,null,null,null,null,null,null,null,null,0,0,0,0]
[null,null,null,null,null,null,null,null,null,{"$f":"IF(F40=0,0,(F40+(2*H40)))","v":0},{"$f":"IF(I40=0,0,I40-(2*H40))","v":0},{"$f":"((J40*J40*0.7853898163*G40)/1000000)-((F40*F40*0.7853898163*G40)/1000000)+((I40*I40*0.7853898163*G40)/1000000)-((K40*K40*0.7853898163*G40)/1000000)","v":0},{"$f":"ROUND(IF(B40=0,0,IF(C40=0,0,IF(L40=0,0,L40/((B40*C40*D40*1000)/1000000))))*(E40+100)/100,2)","v":0}]
[null,null,null,null,null,null,null,null,null,0,0,0,0]
[null,null,null,null,null,null,null,null,null,0,0,0,0]
[null,null,null,null,null,null,null,null,null,0,0,0,0]
[null,null,null,null,null,null,null,null,null,0,0,0,0]
[null,null,null,null,null,null,null,null,null,0,0,0,0]
[null,null,null,null,null,null,null,null,null,0,0,0,0]
[null,null,null,null,null,null,null,null,null,0,0,0,0]
[null,null,null,null,null,null,null,null,null,0,0,0,0]
[null,null,null,null,null,null,null,null,null,0,0,0,0]
[null,null,null,null,null,null,null,null,null,0,0,0,0]
[null,null,null,null,null,null,null,null,null,0,0,0,0]
[null,null,null,null,null,null,null,null,null,0,0,0,0]
[null,null,null,null,null,null,null,null,null,0,0,0,0]
[null,null,null,null,null,null,null,null,null,0,0,0,0]
[null,null,null,null,null,null,null,null,null,0,0,0,0]
[null,null,null,null,null,null,null,null,null,0,0,0,0]
[null,null,null,null,null,null,null,null,null,0,0,0,0]
[null,null,null,null,null,null,null,null,null,0,0,0,0]

{"sheet":"TGM Fräsen_F pro Zahn","index":11,"n_rows":105,"n_cols":9,"rows_kept":105,"cut":false,"hidden":false,"merged":[]}
[]
["Schnittzeitberechnung Fräsen (F pro Zahn)",null,null,null,null,null,null,"Gesamtzeit:",{"$f":"SUM(H6:H105)","v":0}]
[{"$f":"NOW()","v":"2016-12-21T14:11:15.240"}]
["Standardwerte",500,3,100,null,0.1]
["Bemerkung","Drehzahl","Zähnezahl","Länge","Schnitte","F pro Zahn","F pro Min.","Zeit "]
[null,null,null,null,null,null,{"$f":"ROUND(F6*C6*B6,0)","v":0},{"$f":"IF(D6=0,0,IF(E6=0,0,IF(F6=0,0,(D6/(F6*C6*B6))*E6)))","v":0}]
[null,null,null,null,null,null,{"$f":"F7*C7*B7","v":0},{"$f":"IF(D7=0,0,IF(E7=0,0,IF(F7=0,0,(D7/(F7*C7*B7))*E7)))","v":0}]
[null,null,null,null,null,null,0,0]
[null,null,null,null,null,null,0,0]
[null,null,null,null,null,null,0,0]
[null,null,null,null,null,null,0,0]
[null,null,null,null,null,null,0,0]
[null,null,null,null,null,null,0,0]
[null,null,null,null,null,null,0,0]
[null,null,null,null,null,null,0,0]
[null,null,null,null,null,null,0,0]
[null,null,null,null,null,null,0,0]
[null,null,null,null,null,null,0,0]
[null,null,null,null,null,null,0,0]
[null,null,null,null,null,null,0,0]
[null,null,null,null,null,null,0,0]
[null,null,null,null,null,null,0,0]
[null,null,null,null,null,null,0,0]
[null,null,null,null,null,null,0,0]
[null,null,null,null,null,null,0,0]
[null,null,null,null,null,null,0,0]
[null,null,null,null,null,null,0,0]
[null,null,null,null,null,null,0,0]
[null,null,null,null,null,null,0,0]
[null,null,null,null,null,null,0,0]
[null,null,null,null,null,null,0,0]
[null,null,null,null,null,null,0,0]
[null,null,null,null,null,null,0,0]
[null,null,null,null,null,null,0,0]
[null,null,null,null,null,null,0,0]
[null,null,null,null,null,null,0,0]
[null,null,null,null,null,null,0,0]
[null,null,null,null,null,null,0,0]
[null,null,null,null,null,null,0,0]
[null,null,null,null,null,null,0,0]
[null,null,null,null,null,null,0,0]
[null,null,null,null,null,null,0,0]
[null,null,null,null,null,null,0,0]
[null,null,null,null,null,null,0,0]
[null,null,null,null,null,null,0,0]
[null,null,null,null,null,null,0,0]
[null,null,null,null,null,null,0,0]
[null,null,null,null,null,null,0,0]
[null,null,null,null,null,null,0,0]
[null,null,null,null,null,null,0,0]
[null,null,null,null,null,null,0,0]
[null,null,null,null,null,null,0,0]
[null,null,null,null,null,null,0,0]
[null,null,null,null,null,null,0,0]
[null,null,null,null,null,null,0,0]
[null,null,null,null,null,null,0,0]
[null,null,null,null,null,null,0,0]
[null,null,null,null,null,null,0,0]
[null,null,null,null,null,null,0,0]
[null,null,null,null,null,null,0,0]
[null,null,null,null,null,null,0,0]
[null,null,null,null,null,null,0,0]
[null,null,null,null,null,null,0,0]
[null,null,null,null,null,null,0,0]
[null,null,null,null,null,null,0,0]
[null,null,null,null,null,null,0,0]
[null,null,null,null,null,null,0,0]
[null,null,null,null,null,null,0,0]
[null,null,null,null,null,null,0,0]
[null,null,null,null,null,null,0,0]
[null,null,null,null,null,null,{"$f":"F71*C71*B71","v":0},{"$f":"IF(D71=0,0,IF(E71=0,0,IF(F71=0,0,(D71/(F71*C71*B71))*E71)))","v":0}]
[null,null,null,null,null,null,0,0]
[null,null,null,null,null,null,0,0]
[null,null,null,null,null,null,0,0]
[null,null,null,null,null,null,0,0]
[null,null,null,null,null,null,0,0]
[null,null,null,null,null,null,0,0]
[null,null,null,null,null,null,0,0]
[null,null,null,null,null,null,0,0]
[null,null,null,null,null,null,0,0]
[null,null,null,null,null,null,0,0]
[null,null,null,null,null,null,0,0]
[null,null,null,null,null,null,0,0]
[null,null,null,null,null,null,0,0]
[null,null,null,null,null,null,0,0]
[null,null,null,null,null,null,0,0]
[null,null,null,null,null,null,0,0]
[null,null,null,null,null,null,0,0]
[null,null,null,null,null,null,0,0]
[null,null,null,null,null,null,0,0]
[null,null,null,null,null,null,0,0]
[null,null,null,null,null,null,0,0]
[null,null,null,null,null,null,0,0]
[null,null,null,null,null,null,0,0]
[null,null,null,null,null,null,0,0]
[null,null,null,null,null,null,0,0]
[null,null,null,null,null,null,0,0]
[null,null,null,null,null,null,0,0]
[null,null,null,null,null,null,0,0]
[null,null,null,null,null,null,0,0]
[null,null,null,null,null,null,0,0]
[null,null,null,null,null,null,0,0]
[null,null,null,null,null,null,0,0]
[null,null,null,null,null,null,0,0]
[null,null,null,null,null,null,0,0]

{"sheet":"TGM Fräsen _F pro Min.","index":12,"n_rows":105,"n_cols":6,"rows_kept":105,"cut":false,"hidden":false,"merged":[]}
[]
["Schnittzeitberechnung Fräsen (F pro Minute)",null,null,null,"Gesamtzeit:",{"$f":"SUM(E6:E105)","v":0}]
["Millimeter eingeben"]
["Standardwerte",100,333]
["Bemerkung","Länge","F pro Minute","Schnitte","Zeit "]
[null,null,null,null,{"$f":"IF(C6=0,0,IF(D6=0,0,B6/C6*D6))","v":0}]
[null,null,null,null,{"$f":"IF(C7=0,0,IF(D7=0,0,B7/C7*D7))","v":0}]
[null,null,null,null,0]
[null,null,null,null,0]
[null,null,null,null,0]
[null,null,null,null,0]
[null,null,null,null,0]
[null,null,null,null,0]
[null,null,null,null,0]
[null,null,null,null,0]
[null,null,null,null,0]
[null,null,null,null,0]
[null,null,null,null,0]
[null,null,null,null,0]
[null,null,null,null,0]
[null,null,null,null,0]
[null,null,null,null,0]
[null,null,null,null,0]
[null,null,null,null,0]
[null,null,null,null,0]
[null,null,null,null,0]
[null,null,null,null,0]
[null,null,null,null,0]
[null,null,null,null,0]
[null,null,null,null,0]
[null,null,null,null,0]
[null,null,null,null,0]
[null,null,null,null,0]
[null,null,null,null,0]
[null,null,null,null,0]
[null,null,null,null,0]
[null,null,null,null,0]
[null,null,null,null,0]
[null,null,null,null,0]
[null,null,null,null,0]
[null,null,null,null,0]
[null,null,null,null,0]
[null,null,null,null,0]
[null,null,null,null,0]
[null,null,null,null,0]
[null,null,null,null,0]
[null,null,null,null,0]
[null,null,null,null,0]
[null,null,null,null,0]
[null,null,null,null,0]
[null,null,null,null,0]
[null,null,null,null,0]
[null,null,null,null,0]
[null,null,null,null,0]
[null,null,null,null,0]
[null,null,null,null,0]
[null,null,null,null,0]
[null,null,null,null,0]
[null,null,null,null,0]
[null,null,null,null,0]
[null,null,null,null,0]
[null,null,null,null,0]
[null,null,null,null,0]
[null,null,null,null,0]
[null,null,null,null,0]
[null,null,null,null,0]
[null,null,null,null,0]
[null,null,null,null,0]
[null,null,null,null,0]
[null,null,null,null,0]
[null,null,null,null,{"$f":"IF(C71=0,0,IF(D71=0,0,B71/C71*D71))","v":0}]
[null,null,null,null,0]
[null,null,null,null,0]
[null,null,null,null,0]
[null,null,null,null,0]
[null,null,null,null,0]
[null,null,null,null,0]
[null,null,null,null,0]
[null,null,null,null,0]
[null,null,null,null,0]
[null,null,null,null,0]
[null,null,null,null,0]
[null,null,null,null,0]
[null,null,null,null,0]
[null,null,null,null,0]
[null,null,null,null,0]
[null,null,null,null,0]
[null,null,null,null,0]
[null,null,null,null,0]
[null,null,null,null,0]
[null,null,null,null,0]
[null,null,null,null,0]
[null,null,null,null,0]
[null,null,null,null,0]
[null,null,null,null,0]
[null,null,null,null,0]
[null,null,null,null,0]
[null,null,null,null,0]
[null,null,null,null,0]
[null,null,null,null,0]
[null,null,null,null,0]
[null,null,null,null,0]
[null,null,null,null,0]
[null,null,null,null,0]
[null,null,null,null,0]

{"sheet":"Drehzahlberechnung","index":13,"n_rows":10,"n_cols":5,"rows_kept":10,"cut":false,"hidden":false,"merged":[[0,0,0,1],[1,0,1,1]]}
["Berechnung Ø, Drehzahl und Schnittgeschwindigkeit:",null,null,"bei Ø0 Genzdrehzahl","Bitte Drehzahl eingeben !"]
["Eingabe",null,"Ergebnis"]
["Schnittgeschwindigkeit V in m/min","Ø in mm","Drehzahl n in U/min"]
[100,1030,{"$f":"IF(B4=0,D1,(A4*1000)/(B4*PI()))","v":30.90387244502822}]
[]
["Drehzahl n in U/min","Ø in mm","Schnittgeschwindigkeit V in m/min"]
[5,2000,{"$f":"(B7*PI()*A7)/1000","v":31.415926535897928}]
[]
["Schnittgeschwindigkeit V in m/min","Drehzahl n in U/min","Ø in mm"]
[100,318.31,{"$f":"IF(B10=0,E1,(A10*1000)/(B10*PI()))","v":99.999964243596082}]

{"sheet":"Vorschubberechnung","index":14,"n_rows":9,"n_cols":2,"rows_kept":9,"cut":false,"hidden":false,"merged":[]}
["Vorschubberechnung in mm/Minute"]
["Fräserdurchmesser in mm:",100]
["Zähnezahl:",8]
["Schnittgeschwindigkeit in m/min:",150]
["Vorschub pro Zahn in mm:",0.1]
["max. Drehzahl Maschine (n max.) in U/min:",1000]
["berechnete Drehzahl (n) in U/min:",{"$f":"IF(B2=0,0,ROUND((B4*1000)/(B2*3.141592654),0))","v":477}]
["Vorschub in mm/min:",{"$f":"IF(B6=0,ROUND(B7*B3*B5,0),IF(B7>B6,\"n > n max.\",ROUND(B7*B3*B5,0)))","v":382}]
["Vorschub in mm/min bei n max. Maschine:",{"$f":"IF(B6>B7,\"n < n max.\",ROUND(B6*B5*B3,0))","v":"n < n max."}]

{"sheet":"ZSV","index":15,"n_rows":56,"n_cols":7,"rows_kept":56,"cut":false,"hidden":false,"merged":[[0,0,1,0],[49,1,49,2],[22,1,22,2],[4,1,4,2],[13,1,13,2],[31,1,31,2],[40,1,40,2]]}
["Info",null,null,null,"Gesamtes Zerspanungsvolumen des Teiles in dm³ =",{"$f":"ROUND(SUM(Rundstahl!C1)+('Rundstahl (-)'!C1)+(Kegelstumpf!C1)+('Kegelstumpf (-)'!C1)+(Vierkant!C1)+('Vierkant (-)'!C1)+(Sechskant!C1)+('Sechskant (-)'!C1)+(Rohr!C1)+('Rohr (-)'!C1)+(Kugel!B1)+('Kugel (-)'!B1)+(Vielkant!C1)+('Vielkant (-)'!C1)+('Pyramidenstumpf(+)'!E1)+('Pyramidenstumpf(-)'!E1)+('Kugelsektor(+) '!B1)+('Kugelsektor(-)'!B1)+('Kugelabschnitt +'!C1)+('Kugelabschnitt -'!C1)+('Zylinderabschnitt(+)'!C1)+('Zylinderabschnitt(-)'!C1)+('Prisma(+)'!D1)+('Prisma(-)'!D1)+(Aufmaße!E1),6)","v":0}]
[null,null,null,null,null,"Arbeitsblätter zur Berechnung",{"$f":"CONCATENATE(\"Gesamtzeit = \",ROUND((D11+D20+D29+D38+D47+D56),2))","v":"Gesamtzeit = 0"}]
[]
[null,"(1) Zeitspanungsvolumen Drehen"]
[null,"Hier Volumen (F1) für Drehbearbeitung eintragen",null,0]
[null,"Schnittgeschwindigkeit in m/min",null,100]
[null,"Schnitttiefe (ap) in mm"]
[null,"Vorschub (f) in mm pro Umdrehung"]
[null,"Bearbeitungsdauer in Minuten",null,{"$f":"IF(D6=0,0,IF(D7=0,0,IF(D8=0,0,D5/((D6*D7*D8*1000)/1000000))))","v":0}]
[null,"Zuschlagsatz in %"]
[null,"Bearbeitungsdauer in Minuten + Zuschlagsatz in %",null,{"$f":"D9*(D10+100)/100","v":0}]
[]
[null,"(2) Zeitspanungsvolumen Drehen"]
[null,"Hier Volumen (F1) für Drehbearbeitung eintragen"]
[null,"Schnittgeschwindigkeit in m/min"]
[null,"Schnitttiefe (ap) in mm"]
[null,"Vorschub (f) in mm pro Umdrehung"]
[null,"Bearbeitungsdauer in Minuten",null,{"$f":"IF(D15=0,0,IF(D16=0,0,IF(D17=0,0,D14/((D15*D16*D17*1000)/1000000))))","v":0}]
[null,"Zuschlagsatz in %"]
[null,"Bearbeitungsdauer in Minuten + Zuschlagsatz in %",null,{"$f":"D18*(D19+100)/100","v":0}]
[]
[null,"(3) Zeitspanungsvolumen Drehen"]
[null,"Hier Volumen (F1) für Drehbearbeitung eintragen"]
[null,"Schnittgeschwindigkeit in m/min"]
[null,"Schnitttiefe (ap) in mm"]
[null,"Vorschub (f) in mm pro Umdrehung"]
[null,"Bearbeitungsdauer in Minuten",null,{"$f":"IF(D24=0,0,IF(D25=0,0,IF(D26=0,0,D23/((D24*D25*D26*1000)/1000000))))","v":0}]
[null,"Zuschlagsatz in %"]
[null,"Bearbeitungsdauer in Minuten + Zuschlagsatz in %",null,{"$f":"D27*(D28+100)/100","v":0}]
[]
[null,"(1) Zeitspanungsvolumen Fräsen"]
[null,"Hier Volumen (F1) für Fräsbearbeitung eintragen",null,0]
[null,"Schnittbreite (ae) in mm"]
[null,"Schnitttiefe (ap) in mm",null,5]
[null,"Vorschubgeschwindigkeit (Vf) in mm pro Minute"]
[null,"Bearbeitungsdauer in Minuten",null,{"$f":"IF(D33=0,0,IF(D34=0,0,IF(D35=0,0,D32/((D33*D34*D35)/1000000))))","v":0}]
[null,"Zuschlagsatz in %"]
[null,"Bearbeitungsdauer in Minuten + Zuschlagsatz in %",null,{"$f":"D36*(D37+100)/100","v":0}]
[]
[null,"(2) Zeitspanungsvolumen Fräsen"]
[null,"Hier Volumen (F1) für Fräsbearbeitung eintragen"]
[null,"Schnittbreite (ae) in mm"]
[null,"Schnitttiefe (ap) in mm"]
[null,"Vorschubgeschwindigkeit (Vf) in mm pro Minute"]
[null,"Bearbeitungsdauer in Minuten",null,{"$f":"IF(D42=0,0,IF(D43=0,0,IF(D44=0,0,D41/((D42*D43*D44)/1000000))))","v":0}]
[null,"Zuschlagsatz in %"]
[null,"Bearbeitungsdauer in Minuten + Zuschlagsatz in %",null,{"$f":"D45*(D46+100)/100","v":0}]
[]
[null,"(3) Zeitspanungsvolumen Fräsen"]
[null,"Hier Volumen (F1) für Fräsbearbeitung eintragen"]
[null,"Schnittbreite (ae) in mm"]
[null,"Schnitttiefe (ap) in mm"]
[null,"Vorschubgeschwindigkeit (Vf) in mm pro Minute"]
[null,"Bearbeitungsdauer in Minuten",null,{"$f":"IF(D51=0,0,IF(D52=0,0,IF(D53=0,0,D50/((D51*D52*D53)/1000000))))","v":0}]
[null,"Zuschlagsatz in %"]
[null,"Bearbeitungsdauer in Minuten + Zuschlagsatz in %",null,{"$f":"D54*(D55+100)/100","v":0}]

{"sheet":"Aufmaße","index":16,"n_rows":36,"n_cols":7,"rows_kept":36,"cut":false,"hidden":false,"merged":[]}
[null,null,"Gesamtvolumen =",null,{"$f":"SUM(G5:G36)","v":0}]
["Aufmaßvolumenberechnung beim Drehen:"]
["Eingabe Fertigmaße und Spanaufmaß! (Øa = Außen-Ø, L = Länge, Aufmaß = Spanaufmaß \"radiusbezogen\""]
["Øa","L","Aufmaß","Øi","Rohmaße außen","Rohmaße innen","Volumen in dm³"]
[null,null,null,null,{"$f":"IF(A5=0,0,(A5+(2*C5)))","v":0},{"$f":"IF(D5=0,0,D5-(2*C5))","v":0},{"$f":"((E5*E5*0.7853898163*B5)/1000000)-((A5*A5*0.7853898163*B5)/1000000)+((D5*D5*0.7853898163*B5)/1000000)-((F5*F5*0.7853898163*B5)/1000000)","v":0}]
[null,null,null,null,{"$f":"IF(A6=0,0,(A6+(2*C6)))","v":0},{"$f":"IF(D6=0,0,D6-(2*C6))","v":0},{"$f":"((E6*E6*0.7853898163*B6)/1000000)-((A6*A6*0.7853898163*B6)/1000000)+((D6*D6*0.7853898163*B6)/1000000)-((F6*F6*0.7853898163*B6)/1000000)","v":0}]
[null,null,null,null,0,0,0]
[null,null,null,null,0,0,0]
[null,null,null,null,0,0,0]
[null,null,null,null,0,0,0]
[null,null,null,null,0,0,0]
[null,null,null,null,0,0,0]
[null,null,null,null,0,0,0]
[null,null,null,null,0,0,0]
[null,null,null,null,0,0,0]
[null,null,null,null,0,0,0]
[null,null,null,null,0,0,0]
[null,null,null,null,0,0,0]
[null,null,null,null,0,0,0]
[null,null,null,null,0,0,0]
[null,null,null,null,0,0,0]
[null,null,null,null,0,0,0]
[null,null,null,null,0,0,0]
[null,null,null,null,0,0,0]
[null,null,null,null,0,0,0]
[null,null,null,null,0,0,0]
[null,null,null,null,0,0,0]
[null,null,null,null,0,0,0]
[null,null,null,null,0,0,0]
[null,null,null,null,0,0,0]
[null,null,null,null,0,0,0]
[null,null,null,null,0,0,0]
[null,null,null,null,0,0,0]
[null,null,null,null,0,0,0]
[null,null,null,null,0,0,0]
[null,null,null,null,0,0,0]

{"sheet":"Rundstahl","index":17,"n_rows":36,"n_cols":4,"rows_kept":36,"cut":false,"hidden":false,"merged":[]}
["Gesamtvolumen=",null,{"$f":"SUM(D5:D36)","v":0}]
["Volumentabelle:Durchmesser (Dm), Länge (L), Breite in mm eingeben!"]
["Heutiges Datum:",{"$f":"TODAY()","v":"2016-12-21"}]
["d","L",null,"Zylinder(dm³)"]
[null,null,null,{"$f":"(A5*A5*0.7853898163*B5)/1000000","v":0}]
[null,null,null,0]
[null,null,null,0]
[null,null,null,0]
[null,null,null,0]
[null,null,null,0]
[null,null,null,0]
[null,null,null,0]
[null,null,null,0]
[null,null,null,0]
[null,null,null,0]
[null,null,null,0]
[null,null,null,0]
[null,null,null,0]
[null,null,null,0]
[null,null,null,0]
[null,null,null,0]
[null,null,null,0]
[null,null,null,0]
[null,null,null,0]
[null,null,null,0]
[null,null,null,0]
[null,null,null,0]
[null,null,null,0]
[null,null,null,0]
[null,null,null,0]
[null,null,null,0]
[null,null,null,0]
[null,null,null,0]
[null,null,null,0]
[null,null,null,0]
[null,null,null,0]

{"sheet":"Rundstahl (-)","index":18,"n_rows":36,"n_cols":4,"rows_kept":36,"cut":false,"hidden":false,"merged":[]}
["Gesamtvolumen=",null,{"$f":"SUM(D5:D36)","v":0}]
["Volumentabelle:Durchmesser (Dm), Länge (L), Breite in mm eingeben!"]
["Heutiges Datum:",{"$f":"TODAY()","v":"2016-12-21"}]
["d","L",null,"Zylinder(dm³)"]
[null,null,null,{"$f":"((A5*A5*0.7853898163*B5)/1000000)-(2*((A5*A5*0.7853898163*B5)/1000000))","v":0}]
[null,null,null,0]
[null,null,null,0]
[null,null,null,0]
[null,null,null,0]
[null,null,null,0]
[null,null,null,0]
[null,null,null,0]
[null,null,null,0]
[null,null,null,0]
[null,null,null,0]
[null,null,null,0]
[null,null,null,0]
[null,null,null,0]
[null,null,null,0]
[null,null,null,0]
[null,null,null,0]
[null,null,null,0]
[null,null,null,0]
[null,null,null,0]
[null,null,null,0]
[null,null,null,0]
[null,null,null,0]
[null,null,null,0]
[null,null,null,0]
[null,null,null,0]
[null,null,null,0]
[null,null,null,0]
[null,null,null,0]
[null,null,null,0]
[null,null,null,0]
[null,null,null,0]

{"sheet":"Kegelstumpf","index":19,"n_rows":36,"n_cols":5,"rows_kept":36,"cut":false,"hidden":false,"merged":[]}
["Gesamtvolumen=",null,{"$f":"SUM(E5:E36)","v":0}]
["Volumentabelle:Durchmesser (D), Länge (h),"]
["kleiner Durchmesser bei Kegelstumpf (d) in mm eingeben!"]
["D","d","h",null,"Kegelstumpf(dm³)"]
[null,null,null,null,{"$f":"(1.047197551*C5*(((A5/2)*(A5/2))+((A5/2)*(B5/2))+((B5/2)*(B5/2))))/1000000","v":0}]
[null,null,null,null,0]
[null,null,null,null,0]
[null,null,null,null,0]
[null,null,null,null,0]
[null,null,null,null,0]
[null,null,null,null,0]
[null,null,null,null,0]
[null,null,null,null,0]
[null,null,null,null,0]
[null,null,null,null,0]
[null,null,null,null,0]
[null,null,null,null,0]
[null,null,null,null,0]
[null,null,null,null,0]
[null,null,null,null,0]
[null,null,null,null,0]
[null,null,null,null,0]
[null,null,null,null,0]
[null,null,null,null,0]
[null,null,null,null,0]
[null,null,null,null,0]
[null,null,null,null,0]
[null,null,null,null,0]
[null,null,null,null,0]
[null,null,null,null,0]
[null,null,null,null,0]
[null,null,null,null,0]
[null,null,null,null,0]
[null,null,null,null,0]
[null,null,null,null,0]
[null,null,null,null,0]

{"sheet":"Kegelstumpf (-)","index":20,"n_rows":36,"n_cols":5,"rows_kept":36,"cut":false,"hidden":false,"merged":[]}
["Gesamtvolumen=",null,{"$f":"SUM(E5:E36)","v":0}]
["Volumentabelle:Durchmesser (D), Länge (h),"]
["kleiner Durchmesser bei Kegelstumpf (d) in mm eingeben!"]
["D","d","h",null,"Kegelstumpf(dm³)"]
[null,null,null,null,{"$f":"((1.047197551*C5*(((A5/2)*(A5/2))+((A5/2)*(B5/2))+((B5/2)*(B5/2))))/1000000)-(2*(((1.047197551*C5*(((A5/2)*(A5/2))+((A5/2)*(B5/2))+((B5/2)*(B5/2))))/1000000)))","v":0}]
[null,null,null,null,0]
[null,null,null,null,0]
[null,null,null,null,0]
[null,null,null,null,0]
[null,null,null,null,0]
[null,null,null,null,0]
[null,null,null,null,0]
[null,null,null,null,0]
[null,null,null,null,0]
[null,null,null,null,0]
[null,null,null,null,0]
[null,null,null,null,0]
[null,null,null,null,0]
[null,null,null,null,0]
[null,null,null,null,0]
[null,null,null,null,0]
[null,null,null,null,0]
[null,null,null,null,0]
[null,null,null,null,0]
[null,null,null,null,0]
[null,null,null,null,0]
[null,null,null,null,0]
[null,null,null,null,0]
[null,null,null,null,0]
[null,null,null,null,0]
[null,null,null,null,0]
[null,null,null,null,0]
[null,null,null,null,0]
[null,null,null,null,0]
[null,null,null,null,0]
[null,null,null,null,0]

{"sheet":"Vierkant","index":21,"n_rows":36,"n_cols":5,"rows_kept":36,"cut":false,"hidden":false,"merged":[]}
["Gesamtvolumen=",null,{"$f":"SUM(E5:E36)","v":0}]
["Volumentabelle: Länge (L), Breite (B), Höhe (H),  in mm eingeben!"]
["Heutiges Datum:",{"$f":"TODAY()","v":"2016-12-21"}]
["L","B","H",null,"Vierkant (dm³)"]
[null,null,null,null,{"$f":"(A5*B5*C5)/1000000","v":0}]
[null,null,null,null,0]
[null,null,null,null,0]
[null,null,null,null,0]
[null,null,null,null,0]
[null,null,null,null,0]
[null,null,null,null,0]
[null,null,null,null,0]
[null,null,null,null,0]
[null,null,null,null,0]
[null,null,null,null,0]
[null,null,null,null,0]
[null,null,null,null,0]
[null,null,null,null,0]
[null,null,null,null,0]
[null,null,null,null,0]
[null,null,null,null,0]
[null,null,null,null,0]
[null,null,null,null,0]
[null,null,null,null,0]
[null,null,null,null,0]
[null,null,null,null,0]
[null,null,null,null,0]
[null,null,null,null,0]
[null,null,null,null,0]
[null,null,null,null,0]
[null,null,null,null,0]
[null,null,null,null,0]
[null,null,null,null,0]
[null,null,null,null,0]
[null,null,null,null,0]
[null,null,null,null,0]

{"sheet":"Vierkant (-)","index":22,"n_rows":36,"n_cols":5,"rows_kept":36,"cut":false,"hidden":false,"merged":[]}
["Gesamtvolumen=",null,{"$f":"SUM(E5:E36)","v":0}]
["Volumentabelle: Länge (L), Breite (B), Höhe (H),  in mm eingeben!"]
["Heutiges Datum:",{"$f":"TODAY()","v":"2016-12-21"}]
["L","B","H",null,"Vierkant (dm³)"]
[null,null,null,null,{"$f":"((A5*B5*C5)/1000000)-(2*((A5*B5*C5)/1000000))","v":0}]
[null,null,null,null,0]
[null,null,null,null,0]
[null,null,null,null,0]
[null,null,null,null,0]
[null,null,null,null,0]
[null,null,null,null,0]
[null,null,null,null,0]
[null,null,null,null,0]
[null,null,null,null,0]
[null,null,null,null,0]
[null,null,null,null,0]
[null,null,null,null,0]
[null,null,null,null,0]
[null,null,null,null,0]
[null,null,null,null,0]
[null,null,null,null,0]
[null,null,null,null,0]
[null,null,null,null,0]
[null,null,null,null,0]
[null,null,null,null,0]
[null,null,null,null,0]
[null,null,null,null,0]
[null,null,null,null,0]
[null,null,null,null,0]
[null,null,null,null,0]
[null,null,null,null,0]
[null,null,null,null,0]
[null,null,null,null,0]
[null,null,null,null,0]
[null,null,null,null,0]
[null,null,null,null,0]

{"sheet":"Sechskant","index":23,"n_rows":36,"n_cols":4,"rows_kept":36,"cut":false,"hidden":false,"merged":[]}
["Gesamtvolumen=",null,{"$f":"SUM(D5:D36)","v":0}]
["Volumentabelle Länge (L) und Schlüsselweite (SW) in mm eingeben!"]
["Heutiges Datum:",{"$f":"TODAY()","v":"2016-12-21"}]
["L","SW",null,"Sechskant(dm³)"]
[null,null,null,{"$f":"2*(B5/2*B5/2)*1.732050808*A5/1000000","v":0}]
[null,null,null,0]
[null,null,null,0]
[null,null,null,0]
[null,null,null,0]
[null,null,null,0]
[null,null,null,0]
[null,null,null,0]
[null,null,null,0]
[null,null,null,0]
[null,null,null,0]
[null,null,null,0]
[null,null,null,0]
[null,null,null,0]
[null,null,null,0]
[null,null,null,0]
[null,null,null,0]
[null,null,null,0]
[null,null,null,0]
[null,null,null,0]
[null,null,null,0]
[null,null,null,0]
[null,null,null,0]
[null,null,null,0]
[null,null,null,0]
[null,null,null,0]
[null,null,null,0]
[null,null,null,0]
[null,null,null,0]
[null,null,null,0]
[null,null,null,0]
[null,null,null,0]

{"sheet":"Sechskant (-)","index":24,"n_rows":36,"n_cols":4,"rows_kept":36,"cut":false,"hidden":false,"merged":[]}
["Gesamtvolumen=",null,{"$f":"SUM(D5:D36)","v":0}]
["Volumentabelle Länge (L) und Schlüsselweite (SW) in mm eingeben!"]
["Heutiges Datum:",{"$f":"TODAY()","v":"2016-12-21"}]
["L","SW",null,"Sechskant(dm³)"]
[null,null,null,{"$f":"(2*(B5/2*B5/2)*1.732050808*A5/1000000)-(2*(2*(B5/2*B5/2)*1.732050808*A5/1000000))","v":0}]
[null,null,null,0]
[null,null,null,0]
[null,null,null,0]
[null,null,null,0]
[null,null,null,0]
[null,null,null,0]
[null,null,null,0]
[null,null,null,0]
[null,null,null,0]
[null,null,null,0]
[null,null,null,0]
[null,null,null,0]
[null,null,null,0]
[null,null,null,0]
[null,null,null,0]
[null,null,null,0]
[null,null,null,0]
[null,null,null,0]
[null,null,null,0]
[null,null,null,0]
[null,null,null,0]
[null,null,null,0]
[null,null,null,0]
[null,null,null,0]
[null,null,null,0]
[null,null,null,0]
[null,null,null,0]
[null,null,null,0]
[null,null,null,0]
[null,null,null,0]
[null,null,null,0]

{"sheet":"Kugel","index":25,"n_rows":36,"n_cols":3,"rows_kept":36,"cut":false,"hidden":false,"merged":[]}
["Gesamtvolumen=",{"$f":"SUM(C5:C36)","v":0}]
["Volumentabelle:Durchmesser (d) in mm +Teilungsfaktor (TF) eingeben!"]
["Heutiges Datum:",{"$f":"TODAY()","v":"2016-12-21"}]
["d","TF","Kugel (dm³)"]
[null,1,{"$f":"((A5*A5*A5*0.523598775)/1000000)/B5","v":0}]
[null,1,0]
[null,1,0]
[null,1,0]
[null,1,0]
[null,1,0]
[null,1,0]
[null,1,0]
[null,1,0]
[null,1,0]
[null,1,0]
[null,1,0]
[null,1,0]
[null,1,0]
[null,1,0]
[null,1,0]
[null,1,0]
[null,1,0]
[null,1,0]
[null,1,0]
[null,1,0]
[null,1,0]
[null,1,0]
[null,1,0]
[null,1,0]
[null,1,0]
[null,1,0]
[null,1,0]
[null,1,0]
[null,1,0]
[null,1,0]
[null,1,0]

{"sheet":"Kugel (-)","index":26,"n_rows":36,"n_cols":3,"rows_kept":36,"cut":false,"hidden":false,"merged":[]}
["Gesamtvolumen=",{"$f":"SUM(C5:C36)","v":0}]
["Volumentabelle:Durchmesser (d) in mm +Teilungsfaktor (TF) eingeben!"]
["Heutiges Datum:",{"$f":"TODAY()","v":"2016-12-21"}]
["d","TF","Kugel (dm³)"]
[null,1,{"$f":"(((A5*A5*A5*0.523598775)/1000000)-(2*((A5*A5*A5*0.523598775)/1000000)))/B5","v":0}]
[null,1,0]
[null,1,0]
[null,1,0]
[null,1,0]
[null,1,0]
[null,1,0]
[null,1,0]
[null,1,0]
[null,1,0]
[null,1,0]
[null,1,0]
[null,1,0]
[null,1,0]
[null,1,0]
[null,1,0]
[null,1,0]
[null,1,0]
[null,1,0]
[null,1,0]
[null,1,0]
[null,1,0]
[null,1,0]
[null,1,0]
[null,1,0]
[null,1,0]
[null,1,0]
[null,1,0]
[null,1,0]
[null,1,0]
[null,1,0]
[null,1,0]

{"sheet":"Rohr","index":27,"n_rows":36,"n_cols":5,"rows_kept":36,"cut":false,"hidden":false,"merged":[]}
["Gesamtvolumen=",null,{"$f":"SUM(E5:E36)","v":0}]
["Volumentabelle:Durchmesser (Dm), Länge (L), Rohrwandung (RW)  in mm eingeben!"]
["Heutiges Datum:",{"$f":"TODAY()","v":"2016-12-21"}]
["Dm","L","RW",null,"Rohr (dm³)"]
[null,null,null,null,{"$f":"((A5*A5*0.7853898163*B5)/1000000)-(((A5-C5-C5)*(A5-C5-C5)*0.7853898163*B5)/1000000)","v":0}]
[null,null,null,null,{"$f":"((A6*A6*0.7853898163*B6)/1000000)-(((A6-C6-C6)*(A6-C6-C6)*0.7853898163*B6)/1000000)","v":0}]
[null,null,null,null,0]
[null,null,null,null,0]
[null,null,null,null,0]
[null,null,null,null,0]
[null,null,null,null,0]
[null,null,null,null,0]
[null,null,null,null,0]
[null,null,null,null,0]
[null,null,null,null,0]
[null,null,null,null,0]
[null,null,null,null,0]
[null,null,null,null,0]
[null,null,null,null,0]
[null,null,null,null,0]
[null,null,null,null,0]
[null,null,null,null,0]
[null,null,null,null,0]
[null,null,null,null,0]
[null,null,null,null,0]
[null,null,null,null,0]
[null,null,null,null,0]
[null,null,null,null,0]
[null,null,null,null,0]
[null,null,null,null,0]
[null,null,null,null,0]
[null,null,null,null,0]
[null,null,null,null,0]
[null,null,null,null,0]
[null,null,null,null,0]
[null,null,null,null,0]

{"sheet":"Rohr (-)","index":28,"n_rows":36,"n_cols":5,"rows_kept":36,"cut":false,"hidden":false,"merged":[]}
["Gesamtvolumen=",null,{"$f":"SUM(E5:E36)","v":0}]
["Volumentabelle:Durchmesser (Dm), Länge (L), Rohrwandung (RW)  in mm eingeben!"]
["Heutiges Datum:",{"$f":"TODAY()","v":"2016-12-21"}]
["Dm","L","RW",null,"Rohr (dm³)"]
[null,null,null,null,{"$f":"(((A5*A5*0.7853898163*B5)/1000000)-(((A5-C5-C5)*(A5-C5-C5)*0.7853898163*B5)/1000000))-(2*(((A5*A5*0.7853898163*B5)/1000000)-(((A5-C5-C5)*(A5-C5-C5)*0.7853898163*B5)/1000000)))","v":0}]
[null,null,null,null,0]
[null,null,null,null,0]
[null,null,null,null,0]
[null,null,null,null,0]
[null,null,null,null,0]
[null,null,null,null,0]
[null,null,null,null,0]
[null,null,null,null,0]
[null,null,null,null,0]
[null,null,null,null,0]
[null,null,null,null,0]
[null,null,null,null,0]
[null,null,null,null,0]
[null,null,null,null,0]
[null,null,null,null,0]
[null,null,null,null,0]
[null,null,null,null,0]
[null,null,null,null,0]
[null,null,null,null,0]
[null,null,null,null,0]
[null,null,null,null,0]
[null,null,null,null,0]
[null,null,null,null,0]
[null,null,null,null,0]
[null,null,null,null,0]
[null,null,null,null,0]
[null,null,null,null,0]
[null,null,null,null,0]
[null,null,null,null,0]
[null,null,null,null,0]
[null,null,null,null,0]

{"sheet":"Vielkant","index":29,"n_rows":14,"n_cols":8,"rows_kept":14,"cut":false,"hidden":false,"merged":[]}
["Gesamtvolumen =",null,{"$f":"SUM(H6:H14)","v":0}]
["Volumentabelle Vielkant (+)",null,null,"EM= Eckenmaß in mm, nur gültig bei geraden Ecken"]
["SW=Schlüsselweite in mm",null,null,"Ez=Eckenanzahl",null,"L=Länge","S=Seitenfläche in mm"]
["A= Flächeninhalt in mm hoch 2",null,null,"V= Volumen in dm³"]
["SW","Ez","L",null,"EM","S","A","V"]
[null,6,null,null,{"$f":"(SQRT(((0.5*A6)*(0.5*A6))+((0.5*F6)*(0.5*F6))))*2","v":0},{"$f":"TAN(((360/B6/2)*PI()/180))*A6","v":0},{"$f":"0.5*F6*0.5*A6*B6","v":0},{"$f":"(G6*C6)/1000000","v":0}]
[null,6,null,null,{"$f":"(SQRT(((0.5*A7)*(0.5*A7))+((0.5*F7)*(0.5*F7))))*2","v":0},0,0,0]
[null,6,null,null,0,0,0,0]
[null,6,null,null,0,0,0,0]
[null,6,null,null,0,0,0,0]
[null,6,null,null,0,0,0,0]
[null,6,null,null,0,0,0,0]
[null,6,null,null,0,0,0,0]
[null,6,null,null,0,0,0,0]

{"sheet":"Vielkant (-)","index":30,"n_rows":14,"n_cols":8,"rows_kept":14,"cut":false,"hidden":false,"merged":[]}
["Gesamtvolumen=",null,{"$f":"SUM(H6:H14)","v":0}]
["Volumentabelle Vielkant (-)",null,null,"EM= Eckenmaß in mm, nur gültig bei geraden Ecken"]
["SW=Schlüsselweite in mm",null,null,"Ez=Eckenanzahl",null,"L=Länge","S=Seitenfläche in mm"]
["A= Flächeninhalt in mm hoch 2",null,null,"V= Volumen in dm³"]
["SW","Ez","L",null,"EM","S","A","V"]
[null,6,null,null,{"$f":"(SQRT(((0.5*A6)*(0.5*A6))+((0.5*F6)*(0.5*F6))))*2","v":0},{"$f":"TAN(((360/B6/2)*PI()/180))*A6","v":0},{"$f":"0.5*F6*0.5*A6*B6","v":0},{"$f":"((G6*C6)/1000000)-(2*((G6*C6)/1000000))","v":0}]
[null,6,null,null,0,0,0,{"$f":"(G7*C7)/1000000","v":0}]
[null,6,null,null,0,0,0,0]
[null,6,null,null,0,0,0,0]
[null,6,null,null,0,0,0,0]
[null,6,null,null,0,0,0,0]
[null,6,null,null,0,0,0,0]
[null,6,null,null,0,0,0,0]
[null,6,null,null,0,0,0,0]

{"sheet":"Pyramidenstumpf(+)","index":31,"n_rows":36,"n_cols":7,"rows_kept":36,"cut":false,"hidden":false,"merged":[]}
["Gesamtvolumen =",null,null,null,{"$f":"SUM(G5:G36)","v":0}]
["Volumentabelle:große Quadratseitenlänge (l1), Höhe (h) und"]
["kleine Quadratseitenlänge bei Pyramidenstumpf (l2) in mm eingeben!"]
["l1(l)","b1(b)","l2","b2","h",null,"Volumen in dm³"]
[null,null,null,null,null,null,{"$f":"((((A5*B5)+(C5*D5)+SQRT((A5*B5)*(C5*D5)))*(E5/3))/1000000)","v":0}]
[null,null,null,null,null,null,0]
[null,null,null,null,null,null,0]
[null,null,null,null,null,null,0]
[null,null,null,null,null,null,0]
[null,null,null,null,null,null,0]
[null,null,null,null,null,null,0]
[null,null,null,null,null,null,0]
[null,null,null,null,null,null,0]
[null,null,null,null,null,null,0]
[null,null,null,null,null,null,0]
[null,null,null,null,null,null,0]
[null,null,null,null,null,null,0]
[null,null,null,null,null,null,0]
[null,null,null,null,null,null,0]
[null,null,null,null,null,null,0]
[null,null,null,null,null,null,0]
[null,null,null,null,null,null,0]
[null,null,null,null,null,null,0]
[null,null,null,null,null,null,0]
[null,null,null,null,null,null,0]
[null,null,null,null,null,null,0]
[null,null,null,null,null,null,0]
[null,null,null,null,null,null,0]
[null,null,null,null,null,null,0]
[null,null,null,null,null,null,0]
[null,null,null,null,null,null,0]
[null,null,null,null,null,null,0]
[null,null,null,null,null,null,0]
[null,null,null,null,null,null,0]
[null,null,null,null,null,null,0]
[null,null,null,null,null,null,0]

{"sheet":"Pyramidenstumpf(-)","index":32,"n_rows":36,"n_cols":7,"rows_kept":36,"cut":false,"hidden":false,"merged":[]}
["Gesamtvolumen =",null,null,null,{"$f":"SUM(G5:G36)","v":0}]
["Volumentabelle (-):große Quadratseitenlänge (l1), Höhe (h) und"]
["kleine Quadratseitenlänge bei Pyramidenstumpf (l2) in mm eingeben!"]
["l1(l)","b1(b)","l2","b2","h",null,"Volumen in dm³"]
[null,null,null,null,null,null,{"$f":"((((A5*B5)+(C5*D5)+SQRT((A5*B5)*(C5*D5)))*(E5/3))/1000000)-2*(((((A5*B5)+(C5*D5)+SQRT((A5*B5)*(C5*D5)))*(E5/3))/1000000))","v":0}]
[null,null,null,null,null,null,0]
[null,null,null,null,null,null,0]
[null,null,null,null,null,null,0]
[null,null,null,null,null,null,0]
[null,null,null,null,null,null,0]
[null,null,null,null,null,null,0]
[null,null,null,null,null,null,0]
[null,null,null,null,null,null,0]
[null,null,null,null,null,null,0]
[null,null,null,null,null,null,0]
[null,null,null,null,null,null,0]
[null,null,null,null,null,null,0]
[null,null,null,null,null,null,0]
[null,null,null,null,null,null,0]
[null,null,null,null,null,null,0]
[null,null,null,null,null,null,0]
[null,null,null,null,null,null,0]
[null,null,null,null,null,null,0]
[null,null,null,null,null,null,0]
[null,null,null,null,null,null,0]
[null,null,null,null,null,null,0]
[null,null,null,null,null,null,0]
[null,null,null,null,null,null,0]
[null,null,null,null,null,null,0]
[null,null,null,null,null,null,0]
[null,null,null,null,null,null,0]
[null,null,null,null,null,null,0]
[null,null,null,null,null,null,0]
[null,null,null,null,null,null,0]
[null,null,null,null,null,null,0]
[null,null,null,null,null,null,0]

{"sheet":"Kugelsektor(+) ","index":33,"n_rows":36,"n_cols":4,"rows_kept":36,"cut":false,"hidden":false,"merged":[]}
["Gesamtvolumen=",{"$f":"SUM(D5:D36)","v":0}]
["Volumentabelle:Durchmesser (d), Höhe (h),"]
["bei Kugelsektor  in mm eingeben!"]
["d","h",null,"Volumen in dm³"]
[null,null,null,{"$f":"(PI()/6)*(A5*A5)*B5/1000000","v":0}]
[null,null,null,0]
[null,null,null,0]
[null,null,null,0]
[null,null,null,0]
[null,null,null,0]
[null,null,null,0]
[null,null,null,0]
[null,null,null,0]
[null,null,null,0]
[null,null,null,0]
[null,null,null,0]
[null,null,null,0]
[null,null,null,0]
[null,null,null,0]
[null,null,null,0]
[null,null,null,0]
[null,null,null,0]
[null,null,null,0]
[null,null,null,0]
[null,null,null,0]
[null,null,null,0]
[null,null,null,0]
[null,null,null,0]
[null,null,null,0]
[null,null,null,0]
[null,null,null,0]
[null,null,null,0]
[null,null,null,0]
[null,null,null,0]
[null,null,null,0]
[null,null,null,0]

{"sheet":"Kugelsektor(-)","index":34,"n_rows":36,"n_cols":4,"rows_kept":36,"cut":false,"hidden":false,"merged":[]}
["Gesamtvolumen=",{"$f":"SUM(D5:D36)","v":0}]
["Volumentabelle (-):Durchmesser (d), Höhe (h),"]
["bei Kugelsektor  in mm eingeben!"]
["d","h",null,"Volumen in dm³"]
[null,null,null,{"$f":"((PI()/6)*(A5*A5)*B5/1000000)-(2*((PI()/6)*(A5*A5)*B5/1000000))","v":0}]
[null,null,null,0]
[null,null,null,0]
[null,null,null,0]
[null,null,null,0]
[null,null,null,0]
[null,null,null,0]
[null,null,null,0]
[null,null,null,0]
[null,null,null,0]
[null,null,null,0]
[null,null,null,0]
[null,null,null,0]
[null,null,null,0]
[null,null,null,0]
[null,null,null,0]
[null,null,null,0]
[null,null,null,0]
[null,null,null,0]
[null,null,null,0]
[null,null,null,0]
[null,null,null,0]
[null,null,null,0]
[null,null,null,0]
[null,null,null,0]
[null,null,null,0]
[null,null,null,0]
[null,null,null,0]
[null,null,null,0]
[null,null,null,0]
[null,null,null,0]
[null,null,null,0]

{"sheet":"Kugelabschnitt +","index":35,"n_rows":36,"n_cols":4,"rows_kept":36,"cut":false,"hidden":false,"merged":[]}
["Gesamtvolumen=",null,{"$f":"SUM(D5:D36)","v":0}]
["Volumentabelle:Durchmesser (d1), Höhe (h),  in mm eingeben!"]
["Heutiges Datum:",{"$f":"TODAY()","v":"2016-12-21"}]
["d1","h",null,"Volumen in dm³"]
[null,null,null,{"$f":"((PI()*B5)/6)*(3*((A5/2)*(A5/2))+(B5*B5))/1000000","v":0}]
[null,null,null,0]
[null,null,null,0]
[null,null,null,0]
[null,null,null,0]
[null,null,null,0]
[null,null,null,0]
[null,null,null,0]
[null,null,null,0]
[null,null,null,0]
[null,null,null,0]
[null,null,null,0]
[null,null,null,0]
[null,null,null,0]
[null,null,null,0]
[null,null,null,0]
[null,null,null,0]
[null,null,null,0]
[null,null,null,0]
[null,null,null,0]
[null,null,null,0]
[null,null,null,0]
[null,null,null,0]
[null,null,null,0]
[null,null,null,0]
[null,null,null,0]
[null,null,null,0]
[null,null,null,0]
[null,null,null,0]
[null,null,null,0]
[null,null,null,0]
[null,null,null,0]

{"sheet":"Kugelabschnitt -","index":36,"n_rows":36,"n_cols":4,"rows_kept":36,"cut":false,"hidden":false,"merged":[]}
["Gesamtvolumen=",null,{"$f":"SUM(D5:D36)","v":0}]
["Volumentabelle:Durchmesser (d1), Höhe (h),  in mm eingeben!"]
["Heutiges Datum:",{"$f":"TODAY()","v":"2016-12-21"}]
["d1","h",null,"Volumen in dm³"]
[null,null,null,{"$f":"(((PI()*B5)/6)*(3*((A5/2)*(A5/2))+(B5*B5))/1000000)-(2*(((PI()*B5)/6)*(3*((A5/2)*(A5/2))+(B5*B5))/1000000))","v":0}]
[null,null,null,0]
[null,null,null,0]
[null,null,null,0]
[null,null,null,0]
[null,null,null,0]
[null,null,null,0]
[null,null,null,0]
[null,null,null,0]
[null,null,null,0]
[null,null,null,0]
[null,null,null,0]
[null,null,null,0]
[null,null,null,0]
[null,null,null,0]
[null,null,null,0]
[null,null,null,0]
[null,null,null,0]
[null,null,null,0]
[null,null,null,0]
[null,null,null,0]
[null,null,null,0]
[null,null,null,0]
[null,null,null,0]
[null,null,null,0]
[null,null,null,0]
[null,null,null,0]
[null,null,null,0]
[null,null,null,0]
[null,null,null,0]
[null,null,null,0]
[null,null,null,0]

{"sheet":"Zylinderabschnitt(+)","index":37,"n_rows":15,"n_cols":10,"rows_kept":15,"cut":false,"hidden":false,"merged":[[0,4,0,5]]}
["Gesamtvolumen=",null,{"$f":"SUM(J6:J15)","v":0},null,null,null,null,"Gewichttabelle Zylinderabschnitt (+)"]
["r = Radius",null,"a = Winkel","F = Flächeninhalt gesamt",null,null,null,"V = Volumen Zylinderabschnitt in dm³"]
["h = Abschnitthöhe",null,"s = Seitenfläche","F1 = Flächeninhalt Dreieck"]
["L= Abschnittlänge",null,"b = Bogenmaß","F2 = Flächeninhalt Zylinderabschnitt (für Gewichtberechnung)"]
["r","h","L","a","s","b","F","F1","F2","Volumen in dm³"]
[1,null,null,{"$f":"(ASIN(E6/(2*A6))*180/PI())*2","v":0},{"$f":"SQRT((A6-(B6/2))*8*B6)","v":0},{"$f":"PI()*A6*D6/180","v":0},{"$f":"(A6*F6)/2","v":0},{"$f":"(A6-B6)*(E6/2)","v":0},{"$f":"G6-H6","v":0},{"$f":"ROUND(I6*C6/1000000,6)","v":0}]
[1,null,null,0,0,0,0,0,0,{"$f":"ROUND(I7*C7/1000000,6)","v":0}]
[1,null,null,0,0,0,0,0,0,0]
[1,null,null,0,0,0,0,0,0,0]
[1,null,null,0,0,0,0,0,0,0]
[1,null,null,0,0,0,0,0,0,0]
[1,null,null,0,0,0,0,0,0,0]
[1,null,null,0,0,0,0,0,0,0]
[1,null,null,0,0,0,0,0,0,0]
[1,null,null,0,0,0,0,0,0,0]

{"sheet":"Zylinderabschnitt(-)","index":38,"n_rows":15,"n_cols":10,"rows_kept":15,"cut":false,"hidden":false,"merged":[[0,4,0,5]]}
["Gesamtvolumen=",null,{"$f":"SUM(J6:J15)","v":0},null,null,null,null,"Gewichttabelle Zylinderabschnitt (-)"]
["r = Radius",null,"a = Winkel","F = Flächeninhalt gesamt",null,null,null,"V = Volumen Zylinderabschnitt in dm³"]
["h = Abschnitthöhe",null,"s = Seitenfläche","F1 = Flächeninhalt Dreieck"]
["L= Abschnittlänge",null,"b = Bogenmaß","F2 = Flächeninhalt Zylinderabschnitt (für Gewichtberechnung)"]
["r","h","L","a","s","b","F","F1","F2","Volumen in dm³"]
[1,null,null,{"$f":"(ASIN(E6/(2*A6))*180/PI())*2","v":0},{"$f":"SQRT((A6-(B6/2))*8*B6)","v":0},{"$f":"PI()*A6*D6/180","v":0},{"$f":"(A6*F6)/2","v":0},{"$f":"(A6-B6)*(E6/2)","v":0},{"$f":"G6-H6","v":0},{"$f":"ROUND((I6*C6/1000000)-(2*(I6*C6/1000000)),6)","v":0}]
[1,null,null,0,0,0,0,0,0,{"$f":"ROUND((I7*C7/1000000)-(2*(I7*C7/1000000)),6)","v":0}]
[1,null,null,0,0,0,0,0,0,0]
[1,null,null,0,0,0,0,0,0,0]
[1,null,null,0,0,0,0,0,0,0]
[1,null,null,0,0,0,0,0,0,0]
[1,null,null,0,0,0,0,0,0,0]
[1,null,null,0,0,0,0,0,0,0]
[1,null,null,0,0,0,0,0,0,0]
[1,null,null,0,0,0,0,0,0,0]

{"sheet":"Prisma(+)","index":39,"n_rows":36,"n_cols":6,"rows_kept":36,"cut":false,"hidden":false,"merged":[[0,0,0,2],[3,4,3,5]]}
["Gesamtvolumen:",null,null,{"$f":"SUM(F5:F36)","v":0}]
["Seitenlängen (L1), (L2), (L3) und Höhe (h) in mm eingeben!"]
[]
["L1","L2","L3","h","Volumen in dm³"]
[null,null,null,null,null,{"$f":"(0.25*(SQRT(((A5+B5+C5)*((A5+B5+C5)-2*A5)*((A5+B5+C5)-2*B5)*((A5+B5+C5)-2*C5))))*D5)/1000000","v":0}]
[null,null,null,null,null,{"$f":"(0.25*(SQRT(((A6+B6+C6)*((A6+B6+C6)-2*A6)*((A6+B6+C6)-2*B6)*((A6+B6+C6)-2*C6))))*D6)/1000000","v":0}]
[null,null,null,null,null,0]
[null,null,null,null,null,0]
[null,null,null,null,null,0]
[null,null,null,null,null,0]
[null,null,null,null,null,0]
[null,null,null,null,null,0]
[null,null,null,null,null,0]
[null,null,null,null,null,0]
[null,null,null,null,null,0]
[null,null,null,null,null,0]
[null,null,null,null,null,0]
[null,null,null,null,null,0]
[null,null,null,null,null,0]
[null,null,null,null,null,0]
[null,null,null,null,null,0]
[null,null,null,null,null,0]
[null,null,null,null,null,0]
[null,null,null,null,null,0]
[null,null,null,null,null,0]
[null,null,null,null,null,0]
[null,null,null,null,null,0]
[null,null,null,null,null,0]
[null,null,null,null,null,0]
[null,null,null,null,null,0]
[null,null,null,null,null,0]
[null,null,null,null,null,0]
[null,null,null,null,null,0]
[null,null,null,null,null,0]
[null,null,null,null,null,0]
[null,null,null,null,null,0]

{"sheet":"Prisma(-)","index":40,"n_rows":36,"n_cols":6,"rows_kept":36,"cut":false,"hidden":false,"merged":[[0,0,0,2],[3,4,3,5]]}
["Gesamtvolumen:",null,null,{"$f":"SUM(F5:F36)","v":0}]
["Seitenlängen (L1), (L2), (L3) und Höhe (h) in mm eingeben!"]
[]
["L1","L2","L3","h","Volumen in dm³"]
[null,null,null,null,null,{"$f":"((0.25*(SQRT(((A5+B5+C5)*((A5+B5+C5)-2*A5)*((A5+B5+C5)-2*B5)*((A5+B5+C5)-2*C5))))*D5)/1000000)-(2*((0.25*(SQRT(((A5+B5+C5)*((A5+B5+C5)-2*A5)*((A5+B5+C5)-2*B5)*((A5+B5+C5)-2*C5))))*D5)/1000000))","v":0}]
[null,null,null,null,null,{"$f":"((0.25*(SQRT(((A6+B6+C6)*((A6+B6+C6)-2*A6)*((A6+B6+C6)-2*B6)*((A6+B6+C6)-2*C6))))*D6)/1000000)-(2*((0.25*(SQRT(((A6+B6+C6)*((A6+B6+C6)-2*A6)*((A6+B6+C6)-2*B6)*((A6+B6+C6)-2*C6))))*D6)/1000000))","v":0}]
[null,null,null,null,null,0]
[null,null,null,null,null,0]
[null,null,null,null,null,0]
[null,null,null,null,null,0]
[null,null,null,null,null,0]
[null,null,null,null,null,0]
[null,null,null,null,null,0]
[null,null,null,null,null,0]
[null,null,null,null,null,0]
[null,null,null,null,null,0]
[null,null,null,null,null,0]
[null,null,null,null,null,0]
[null,null,null,null,null,0]
[null,null,null,null,null,0]
[null,null,null,null,null,0]
[null,null,null,null,null,0]
[null,null,null,null,null,0]
[null,null,null,null,null,0]
[null,null,null,null,null,0]
[null,null,null,null,null,0]
[null,null,null,null,null,0]
[null,null,null,null,null,0]
[null,null,null,null,null,0]
[null,null,null,null,null,0]
[null,null,null,null,null,0]
[null,null,null,null,null,0]
[null,null,null,null,null,0]
[null,null,null,null,null,0]
[null,null,null,null,null,0]
[null,null,null,null,null,0]

{"sheet":"diverse Berechnungen","index":41,"n_rows":154,"n_cols":6,"rows_kept":154,"cut":false,"hidden":false,"merged":[[121,3,121,4],[148,1,148,6]]}
[null,null,"diverse Berechnungen"]
[null,null,"Polarkoordinaten","Zeitspanvolumen Drehen","Zeitspanvolumen Fräsen"," Längenveränderung "]
[null,null,"Winkelumrechnung","Bogenmaßberechnung","tS + tA Berechnung aus tG","Stückkostenberechnung"]
[null,null,"Schneckengrundbreite","Steigungswinkel",null,"Winkelumrechnung von (°), (`), (``) in Grad mit Dezimalstelle "]
[]
[]
[null,null,"Polarkoordinatenberechnung für den 1. Quadranten bis 90°"]
[]
[]
[null,null,"X-Maß","Y-Maß","Radius","Winkel"]
[null,null,{"$f":"(COS(F11*PI()/180)*E11)","v":0},{"$f":"(SIN(F11*PI()/180)*E11)","v":0}]
[null,null,"X-Maß","Y-Maß","Radius","Winkel"]
[null,null,null,null,{"$f":"SQRT((C13*C13)+(D13*D13))","v":0},{"$f":"IF(C13=0,0,ATAN(D13/C13)*180/PI())","v":0}]
[null,null,"X-Maß","Y-Maß","Radius","Winkel"]
[null,null,null,{"$f":"IF(E15=0,0,SQRT((E15*E15)-(C15*C15)))","v":0},null,{"$f":"IF(C15=0,0,ATAN(D15/C15)*180/PI())","v":0}]
[null,null,"X-Maß","Y-Maß","Radius","Winkel"]
[null,null,{"$f":"SQRT((E17*E17)-(D17*D17))","v":0},null,null,{"$f":"IF(C17=0,0,ATAN(D17/C17)*180/PI())","v":0}]
[null,null,"X-Maß","Y-Maß","Radius","Winkel"]
[null,null,null,{"$f":"SQRT((E19*E19)-(C19*C19))","v":0},{"$f":"IF(C19=0,0,C19/(COS(F19*PI()/180)))","v":0}]
[null,null,"X-Maß","Y-Maß","Radius","Winkel"]
[null,null,{"$f":"(COS(F21*PI()/180)*E21)","v":0},null,{"$f":"IF(D21=0,0,D21/(SIN(F21*PI()/180)))","v":0}]
[]
[]
[null,null,"Zeitspanungsvolumen Drehen"]
[]
[null,null,"Schnittgeschwindigkeit (m/min)",null,100,"Bearbeitungsdauer in Min."]
[null,null,"Schnitttiefe in mm",null,1,{"$f":"E29/((E27*E28*E26*1000)/1000000)","v":0}]
[null,null,"Vorschub in mm pro Umdrehung",null,1]
[null,null,"Zerspanungsvolumen in Kubikdezimeter",null,0]
[]
[]
[]
[]
[null,null,"Zeitspanungsvolumen Fräsen"]
[]
[null,null,"Schnittbreite in mm",null,1,"Bearbeitungsdauer in Min."]
[null,null,"Schnitttiefe in mm",null,1,{"$f":"E39/((E37*E38*E36)/1000000)","v":0}]
[null,null,"Vorschubgeschwindigkeit in mm pro Minute",null,1]
[null,null,"Zerspanungsvolumen in Kubikdezimeter",null,0]
[]
[]
[]
[]
[]
[null,null,"Berechnung der Längenveränderung von Stoffen bei Temperaturschwankungen"]
[]
[null,null,"Stoff","Länge/Dm in mm","Temperaturdifferenz","Längenunterschied "]
[null,null,"Stahl, unlegiert",null,null,{"$f":"D48*0.000011*E48","v":0}]
[null,null,"Stahl, niedrichl.",null,null,{"$f":"D49*0.0000111*E49","v":0}]
[null,null,"Stahl, hochl.",null,null,{"$f":"D50*0.0000167*E50","v":0}]
[null,null,"Gusseisen",null,null,{"$f":"D51*0.0000105*E51","v":0}]
[null,null,"AL-Legierungen",null,null,{"$f":"D52*0.000023*E52","v":0}]
[null,null,"CuAl10Ni",null,null,{"$f":"D53*0.000016*E53","v":0}]
[null,null,"CuSn6",null,null,{"$f":"D54*0.0000175*E54","v":0}]
[null,null,"CuZn30",null,null,{"$f":"D55*0.0000185*E55","v":0}]
[null,null,"Berechnung mit bekantem Längenausdehnungskoeffizienten verschiedener Stoffe"]
[null,null,"Ausdehnungskoeffizient","Länge/Dm in mm","Temperaturdifferenz","Längenunterschied "]
[null,null,null,null,null,{"$f":"C58*D58*E58","v":0}]
[]
[]
[null,null,"Winkelumrechnung im Teilkreis mit max. 20 Bohrungen"]
[]
[null,null,"Ausgangswinkel","Fortschaltwinkel","Zwischenrechnung","Endwinkel"]
[null,null,null,null,{"$f":"C64+D64","v":0},{"$f":"IF(E64>360,E64-360,E64)","v":0}]
[null,null,null,null,{"$f":"C64+D65","v":0},0]
[null,null,null,null,{"$f":"C64+D66","v":0},0]
[null,null,null,null,{"$f":"C64+D67","v":0},0]
[null,null,null,null,{"$f":"C64+D68","v":0},0]
[null,null,null,null,{"$f":"C64+D69","v":0},0]
[null,null,null,null,{"$f":"C64+D70","v":0},0]
[null,null,null,null,{"$f":"C64+D71","v":0},0]
[null,null,null,null,{"$f":"C64+D72","v":0},0]
[null,null,null,null,{"$f":"C64+D73","v":0},0]
[null,null,null,null,{"$f":"C64+D74","v":0},0]
[null,null,null,null,{"$f":"C64+D75","v":0},0]
[null,null,null,null,{"$f":"C64+D76","v":0},0]
[null,null,null,null,{"$f":"C64+D77","v":0},0]
[null,null,null,null,{"$f":"C64+D78","v":0},0]
[null,null,null,null,{"$f":"C64+D79","v":0},0]
[null,null,null,null,{"$f":"C64+D80","v":0},0]
[null,null,null,null,{"$f":"C64+D81","v":0},0]
[null,null,null,null,{"$f":"C64+D82","v":0},0]
[null,null,null,null,{"$f":"C64+D83","v":0},0]
[null,null,null,null,{"$f":"C64+D84","v":0},0]
[]
[]
[]
[null,null,"Bogenmaßberechnung"]
[]
[null,null,"Radius (r) eingeben","Winkel (a) eingeben"]
[null,null,50,106.26]
[null,null,"Ergebnis (b)","Ergebnis (s)"]
[null,null,{"$f":"PI()*C91*D91/180","v":92.729343158458732},{"$f":"2*C91*SIN((D91*PI()/180)/2)","v":79.999892814850853}]
[null,null,"Ergebnis (h)","Ergebnis (F)"]
[null,null,{"$f":"C91*(1-(COS((D91/2)*PI()/180)))","v":19.999928543366874},{"$f":"C93*C91/2","v":2318.2335789614681}]
[]
[]
[]
[]
[]
[]
[]
[]
[]
[null,null,"Stückzeit und Rüstzeitberechnung aus Gesamtzeit von Position1 und Position 2"]
[]
[]
[null,null,"Position 1 (kleine Stückzahl)",null,"Position 2 (große Stückzahl)"]
[null,null,"Stückzahl","Gesamtzeit","Stückzahl","Gesamtzeit"]
[null,null,2,25,4,45]
[null,null,null,"Stückzeit","Rüstzeit"]
[null,null,null,{"$f":"(F110-D110)/(-C110+E110)","v":10},{"$f":"D110-(D112*C110)","v":5},{"$f":"F110-(D112*E110)","v":5}]
[]
[]
[]
[null,null,"Stückkosten und Rüstkostenberechnung aus Gesamtpreis von Position1 und Position 2"]
[]
[]
[null,null,"Position 1 (kleine Stückzahl)",null,"Position 2 (große Stückzahl)"]
[null,null,"Stückzahl","Gesamtkosten","Stückzahl","Gesamtkosten"]
[null,null,2,25,4,35]
[null,null,"Gesamtstückkosten","Einzelkosten",null,"Gesamtstückkosten"]
[null,null,{"$f":"D121/C121","v":12.5},"Stückkosten","Rüstkosten",{"$f":"F121/E121","v":8.75}]
[null,null,null,{"$f":"(F121-D121)/(-C121+E121)","v":5},{"$f":"D121-(D124*C121)","v":15},{"$f":"F121-(D124*E121)","v":15}]
[null,null,null,"Stück und Gesamtkostenberechnung bei X Stück"]
[null,null,"Stückzahl","Stückkosten","Gesamtkosten"]
[null,null,8,{"$f":"(E124/C127)+D124","v":6.875},{"$f":"D127*C127","v":55}]
[]
[]
[]
[null,null,"Winkelumrechnung von (°), (`), (``) in Grad mit Dezimalstelle "]
[]
[null,null,"Grad (°)","Minuten (´)","Sekunden (``)","Dezimal (°)"]
[null,null,9,34,42,{"$f":"(((E134/60)+D134)/60)+C134","v":9.5783333333333331}]
[null,null,{"$f":"TRUNC(F135)","v":9},{"$f":"TRUNC(D136)","v":34},{"$f":"(D136-D135)*60","v":42.24000000000089},9.5784000000000002]
[null,null,null,{"$f":"(F135-C135)*60","v":34.704000000000015}]
[]
[]
[null,null,"Berechnung kleinste/größte Schneckengrundbreite bei Duplexschnecken"]
[]
[null,null,"Messzahnbreite (P8)","Zahnkreis-Ø (P7)","Fußkreis-Ø (P4)","Grundbreite am Messzahn"]
[null,null,3.93,32,27,{"$f":"((C144+D144)/2)-C142-(2*((TAN(C146*PI()/180)*((D142-E142)/2))))","v":2.1751488286689877}]
[null,null,"Steigung groß (P6)","Steigung klein (P5)","Anzahl Steigungen (P11)","Breite minimal"]
[null,null,8,7.85,5,{"$f":"F142-((C144-D144)*E144)","v":1.425148828668986}]
[null,null,"Flankenwinkel (°) (P10)",null,null,"Breite maximal"]
[null,null,20,null,null,{"$f":"F142+((C144-D144)*E144)","v":2.9251488286689895}]
[]
[]
[null,"Berechnung Steigungswinkel für Schraubengewinde"]
[null,null,"Steigung / P","Nenn-Ø / d","Flanken-Ø / d2","Abwicklung (d2)"]
[null,null,1.5,50,{"$f":"D151-(0.6495*C151)","v":49.025750000000002},{"$f":"E151*PI()","v":154.0189360367298}]
[null,null,"Grad (°)","Minuten (´)","Sekunden (``)","Dezimal (°)"]
[null,null,{"$f":"TRUNC(F153)","v":0},{"$f":"TRUNC(D154)","v":33},{"$f":"(D154-D153)*60","v":28.762272022790683},{"$f":"ATAN(C151/F151)*180/PI()","v":0.55798952000633073}]
[null,null,null,{"$f":"(F153-C153)*60","v":33.479371200379845}]

{"sheet":"Flächen","index":42,"n_rows":179,"n_cols":12,"rows_kept":179,"cut":false,"hidden":false,"merged":[[3,7,3,10],[0,0,0,6],[2,5,2,6],[2,7,2,10]]}
["Strecken+Flächenberechnung"]
[]
[]
[]
[]
[]
[]
[]
[null,"Kreisabschnitt"]
[null,"Eingabe (r + Winkel)",null,null,"Eingabe (b+Winkel)",null,null,"Eingabe (h + s)",null,null,"Eingabe (r + b)"]
[null,"r","a",null,"b","a",null,"h","s  ",null,"r","b"]
[null,50,106.26,null,62.831850000000003,60,null,8.0384759999999993,60,null,60,62.831850000000003]
[null,"b =","s =",null,"h =","s =",null,"r =","b =",null,"h =","s ="]
[null,{"$f":"PI()*B12*C12/180","v":92.729343158458732},{"$f":"2*B12*SIN((C12*PI()/180)/2)","v":79.999892814850853},null,{"$f":"E16*(1-(COS((F12/2)*PI()/180)))","v":8.0384760799808603},{"$f":"2*E16*SIN((F12*PI()/180)/2)","v":60.000002291831372},null,{"$f":"(H12/2)+((I12*I12)/(8*H12))","v":59.999998532220296},{"$f":"PI()*H14*H16/180","v":62.831853229586571},null,{"$f":"K12*(1-(COS((K16/2)*PI()/180)))","v":8.0384750049847327},{"$f":"2*K12*SIN((K16*PI()/180)/2)","v":59.999997339746734}]
[null,"h =","F =",null,"r =","F =",null,"a=","F =",null,"a=","F ="]
[null,{"$f":"B12*(1-(COS((C12/2)*PI()/180)))","v":19.999928543366874},{"$f":"(B14*B12)/2","v":2318.2335789614681},null,{"$f":"E12/(0.017453291*F12)","v":60.000002291831379},{"$f":"(E12*E16)/2","v":1884.9555720000028},null,{"$f":"(ASIN(I12/(2*H14))*180/PI())*2","v":60.000001618458782},{"$f":"I14*H14/2","v":1884.9555507759376},null,{"$f":"(L12*180)/(PI()*K12)","v":59.999997066651034},{"$f":"(L12*K12)/2","v":1884.9555}]
[null,"Eingabe (r + s)",null,null,null,null,null,null,null,null,"Eingabe (Winkel+s)"]
[null,"r","s  ",null,null,null,null,null,null,null,"a","s  "]
[null,60,60,null,null,null,null,null,null,null,60,60]
[null,"b =","a=",null,null,null,null,null,null,null,"r =","b ="]
[null,{"$f":"PI()*B19*C21/180","v":62.831853071795862},{"$f":"(ASIN(C19/(2*B19))*180/PI())*2","v":60.000000000000007},null,null,null,null,null,null,null,{"$f":"L19/(2*(SIN((K19/2)*PI()/180)))","v":60.000000000000007},{"$f":"PI()*K21*K19/180","v":62.831853071795869}]
[null,"h =","F =",null,null,null,null,null,null,null,"h =","F ="]
[null,{"$f":"B19*(1-(COS((C21/2)*PI()/180)))","v":8.0384757729336833},{"$f":"(B21*B19)/2","v":1884.9555921538758},null,null,null,null,null,null,null,{"$f":"K21*(1-(COS((K19/2)*PI()/180)))","v":8.038475772933678},{"$f":"L21*K21/2","v":1884.9555921538763}]
[null,"Eingabe (r+h)"]
[null,"r","h"]
[null,212,147]
[null,"a=","s ="]
[null,{"$f":"(ASIN(C28/(2*B26))*180/PI())*2","v":144.29064637356166},{"$f":"SQRT((B26-(C26/2))*8*C26)","v":403.5789885511881}]
[null,"b =","F ="]
[null,{"$f":"PI()*B26*B28/180","v":533.88953411848695},{"$f":"(B26*B30)/2","v":56592.290616559614}]
[null,"F1 =","F2 ="]
[null,{"$f":"(B26-C26)*(C28/2)","v":13116.317127913613},{"$f":"C30-B32","v":43475.973488645999}]
[]
[]
[]
[null,"Ellipse",null,null,"Eingabe"]
[null,null,"D","d","a","b","U","F"]
[null,null,100,50]
[null,null,null,null,"Ergebnisse"]
[null,null,{"$f":"C38","v":100},{"$f":"D38","v":50},{"$f":"C38/2","v":50},{"$f":"D38/2","v":25},{"$f":"(3*PI()/4)*(C38+D38)-(PI()/2)*SQRT(C38*D38)","v":242.35710007489257},{"$f":"PI()*E40*F40","v":3926.9908169872415}]
[]
[]
[]
[]
[]
[]
[]
[]
[]
[]
[null,"Kreis",null,null,"Eingabe"]
[null,null,null,"d","U","F"]
[null,null,null,0,0,0]
[null,null,null,null,"Ergebnis"]
[null,null,null,{"$f":"E53/PI()","v":0},{"$f":"PI()*D53","v":0},{"$f":"PI()*D53*D53/4","v":0}]
[null,null,null,{"$f":"SQRT(4*F53/PI())","v":0},{"$f":"PI()*D56","v":0},{"$f":"PI()*D55*D55/4","v":0}]
[]
[]
[]
[]
[]
[]
[]
[]
[]
[]
[]
[null,"Kreisring",null,null,"Eingabe"]
[null,null,null,"a","d","D","F"]
[null,null,null,null,90,100]
[null,null,null,null,"Ergebnis"]
[null,null,null,{"$f":"(F70-E70)/2","v":5},null,null,{"$f":"(PI()/4)*(SUMSQ(F70)-SUMSQ(E70))","v":1492.2565104551518}]
[]
[]
[]
[]
[]
[]
[]
[]
[]
[]
[]
[]
[]
[]
[null,"Rechtwinkliges Dreieck"]
[null,null,"Eingabe (a + b)",null,null,"Eingabe (a + c)",null,null,"Eingabe (b + c)"]
[null,null,"a","b",null,"a","c",null,"b","c"]
[null,null,30,60,null,30,67.082040000000006,null,60,67.082040000000006]
[null," ","c =","hc =",null,"b =","hc =",null,"a =","hc ="]
[null,null,{"$f":"SQRT((C90*C90)+(D90*D90))","v":67.082039324993687},{"$f":"SQRT(C94*D94)","v":26.832815729997478},null,{"$f":"SQRT((G90*G90)-(F90*F90))","v":60.000000754680002},{"$f":"SQRT(F94*G94)","v":26.832815797498107},null,{"$f":"SQRT((J90*J90)-(I90*I90))","v":30.000001509359972},{"$f":"SQRT(I94*J94)","v":26.832816810007539}]
[null,null,"q =","p =",null,"p =","q =",null,"p =","q ="]
[null,null,{"$f":"(D90*D90)/C92","v":53.665631459994955},{"$f":"(C90*C90)/C92","v":13.416407864998739},null,{"$f":"F90*F90/G90","v":13.416407729997477},{"$f":"F92*F92/G90","v":53.665632270002526},null,{"$f":"I92*I92/J90","v":13.416409080010096},{"$f":"I90*I90/J90","v":53.665630919989908}]
[null,null,"F =",null,null,"F =",null,null,"F ="]
[null,null,{"$f":"(C90*D90)/2","v":900},null,null,{"$f":"F90*F92/2","v":900.00001132019997},null,null,{"$f":"I90*I92/2","v":900.00004528079921}]
[null,null,"Eingabe (c + p)"]
[null,null,"c","p"]
[null,null,67.082040000000006,13.416410000000001]
[null,null,"a =","b ="]
[null,null,{"$f":"SQRT(C99*D99)","v":30.000002537939896},{"$f":"SQRT(C99*C103)","v":59.999999485710006}]
[null,null,"q =","hc ="]
[null,null,{"$f":"C99-D99","v":53.665630000000007},{"$f":"SQRT(D99*C103)","v":26.832817499999887}]
[null,null,"F ="]
[null,null,{"$f":"(C101*D101)/2","v":900.0000684238463}]
[null,null,"Eingabe (c + q)"]
[null,null,"c","q"]
[null,null,67.082040000000006,53.66563]
[null,null,"a =","b ="]
[null,null,{"$f":"SQRT(C108*C112)","v":30.000002537939903},{"$f":"SQRT(C108*D108)","v":59.999999485709999}]
[null,null,"p =","hc ="]
[null,null,{"$f":"C108-D108","v":13.416410000000006},{"$f":"SQRT(D108*C112)","v":26.832817499999891}]
[null,null,"F ="]
[null,null,{"$f":"(C110*D110)/2","v":900.00006842384641}]
[]
[]
[]
[]
[]
[]
[]
[]
[]
[]
[]
[]
[]
[]
[]
[]
[]
[]
[]
[]
[]
[null,"Eingabe (Winkel A + Schenkel c)",null,null,"Eingabe (Winkel A + Schenkel b)",null,null,"Eingabe (Winkel A + Schenkel a)",null,null,"Eingabe (Schenkel c + Schenkel a)"]
[null,"A","c",null,"A","b",null,"A","a",null,"c","a"]
[null,55,60,null,20,5.4,null,55,50,null,60,49.149000000000001]
[null,"B=","b =",null,"B=","a =",null,"B=","b =",null,"B=","A="]
[null,{"$f":"90-B138","v":35},{"$f":"COS(B138*PI()/180)*C138","v":34.414586181062766},null,{"$f":"90-E138","v":70},{"$f":"TAN(E138*PI()/180)*F138","v":1.9654392650374928},null,{"$f":"90-H138","v":35},{"$f":"I138/TAN(H138*PI()/180)","v":35.01037691048549},null,{"$f":"ACOS(L138/K138)*(180/PI())","v":35.000204207888977},{"$f":"ASIN(L138/K138)*(180/PI())","v":54.999795792111023}]
[null,"a =","F =",null,"c =","F =",null,"c =","F =",null,"b=","F ="]
[null,{"$f":"SIN(B138*PI()/180)*C138","v":49.149122657339511},{"$f":"B142*C140/2","v":845.72335870731763},null,{"$f":"F138/COS(E138*PI()/180)","v":5.7465599713699254},{"$f":"F138*F140/2","v":5.3066860156012305},null,{"$f":"I140/COS(H138*PI()/180)","v":61.038729438072799},{"$f":"I138*I140/2","v":875.25942276213732},null,{"$f":"COS(L140*PI()/180)*K138","v":34.414761353233288},{"$f":"L138*K142/2","v":845.72555287503144}]
[null,"Eingabe (Winkel B + Schenkel c)",null,null,"Eingabe (Winkel B + Schenkel b)",null,null,"Eingabe (Winkel B + Schenkel a)",null,null,"Eingabe (Schenkel c + Schenkel b)"]
[null,"B ","c",null,"B","b",null,"B","a",null,"c","b"]
[null,35,60,null,35,34.414999999999999,null,35,49.149000000000001,null,60,34.414999999999999]
[null,"A=","b =",null,"A=","a =",null,"A=","b =",null,"B=","A="]
[null,{"$f":"90-B145","v":55},{"$f":"SIN(B145*PI()/180)*C145","v":34.414586181062759},null,{"$f":"90-E145","v":55},{"$f":"F145/(TAN(E145*PI()/180))","v":49.149713652029874},null,{"$f":"90-H145","v":55},{"$f":"TAN(H145*PI()/180)*I145","v":34.414500295469026},null,{"$f":"ASIN(L145/K145)*(180/PI())","v":35.000482412445969},{"$f":"ACOS(L145/K145)*(180/PI())","v":54.999517587554031}]
[null,"a =","F =",null,"c =","F =",null,"c =","F =",null,"a =","F ="]
[null,{"$f":"COS(B145*PI()/180)*C145","v":49.149122657339511},{"$f":"B149*C147/2","v":845.7233587073174},null,{"$f":"F145/(SIN(E145*PI()/180))","v":60.000721471300089},{"$f":"F145*F147/2","v":845.74369766730399},null,{"$f":"I145/(COS(H145*PI()/180))","v":59.999850263036805},{"$f":"I145*I147/2","v":845.71913751100362},null,{"$f":"SIN(L147*PI()/180)*K145","v":49.148832895603938},{"$f":"K149*L145/2","v":845.7285420511048}]
[null,null,null,null,null,null,null,null,null,null,"Eingabe (Schenkel a + Schenkel b)"]
[null,null,null,null,null,null,null,null,null,null,"a","b"]
[null,null,null,null,null,null,null,null,null,null,49.149000000000001,34.414999999999999]
[null,null,null,null,null,null,null,null,null,null,"B=","A="]
[null,null,null,null,null,null,null,null,null,null,{"$f":"ATAN(L152/K152)*(180/PI())","v":35.00039088427372},{"$f":"ATAN(K152/L152)*(180/PI())","v":54.999609115726287}]
[null,null,null,null,null,null,null,null,null,null,"c =","F ="]
[null,null,null,null,null,null,null,null,null,null,{"$f":"L152/(COS(L154*PI()/180))","v":60.000136883177206},{"$f":"K152*L152/2","v":845.73141750000002}]
[]
[]
[null,"Winkelfunktionen im schiefwinkligen Dreieck"]
[]
[null,"Sinussatz:",null,null,"Cosinussatz:"]
[null,null,null,null,"a²=b²+c²-2b*c*COS Winkel A"]
[null,null,null,null,"b²=a²+c²-2a*c*COS Winkel B"]
[null,"a/sinA = b/sinB = c/sinC",null,null,"c²=a²+b²-2a*b*COS Winkel C"]
[]
[null,null,"gegeben",null,null,"gesucht"]
[null,"Winkel A","Winkel B","a","Winkel C","b","c"]
[null,44.415308600000003,57.1216504,50,{"$f":"180-(B168+C168)","v":78.463041000000004},{"$f":"(D168*SIN(C168*PI()/180))/SIN(B168*PI()/180)","v":59.99999997288694},{"$f":"(D168*SIN(E168*PI()/180))/SIN(B168*PI()/180)","v":70.000000004683528}]
[null,"Winkel A","Winkel B","c","Winkel C","a","b"]
[null,44.415308600000003,57.1216504,61.038729400000001,{"$f":"180-(B170+C170)","v":78.463041000000004},{"$f":"(D170*SIN(B170*PI()/180))/SIN(E170*PI()/180)","v":43.59909242565432},{"$f":"(D170*SIN(C170*PI()/180))/SIN(E170*PI()/180)","v":52.31891088714309}]
[null,"Winkel A","a","b","Winkel B","Winkel C","c"]
[null,44.415308600000003,50,60,{"$f":"ASIN(D172*(SIN(B172*PI()/180))/C172)*(180/PI())","v":57.121650440054673},{"$f":"180-(B172+E172)","v":78.463040959945317},{"$f":"(C172*SIN(F172*PI()/180))/SIN(B172*PI()/180)","v":69.999999994694505}]
[null,"Winkel A","a","c","Winkel B","Winkel C","b"]
[null,44.415308600000003,50,70,{"$f":"180-(B174+F174)","v":57.121650418780334},{"$f":"ASIN(D174*(SIN(B174*PI()/180))/C174)*(180/PI())","v":78.463040981219663},{"$f":"(D174*SIN(E174*PI()/180))/SIN(F174*PI()/180)","v":59.999999985599381}]
[null,"Winkel A","b","c","Winkel B","Winkel C","a"]
[null,44.415308600000003,60,70,{"$f":"ASIN(C176*(SIN(B176*PI()/180))/G176)*(180/PI())","v":57.121650434948833},{"$f":"180-(B176+E176)","v":78.463040965051164},{"$f":"SQRT((C176*C176)+(D176*D176)-(2*C176*D176*COS(B176*PI()/180)))","v":50.000000002880121}]
[null,"a","b","c","Winkel A","Winkel B","Winkel C",null,"ARCCOC Winkel A =(b²+c²-a²)/(2b*c)"]
[null,50,60,70,{"$f":"ACOS(((C178*C178)+(D178*D178)-(B178*B178))/(2*C178*D178))*(180/PI())","v":44.415308597192968},{"$f":"ACOS(((B178*B178)+(D178*D178)-(C178*C178))/(2*B178*D178))*(180/PI())","v":57.121650435622513},{"$f":"180-(E178+F178)","v":78.463040967184526},null,"ARCCOS Winkel B =(a²+c²-b²)/(2a*c)"]
[null,null,null,null,null,null,null,null,"Winkel C = 180-(Winkel A+ Winkel B)"]

{"sheet":"Umrechnungen","index":43,"n_rows":111,"n_cols":13,"rows_kept":111,"cut":false,"hidden":false,"merged":[[1,10,1,11],[2,1,2,2],[1,1,1,3],[1,6,1,7]]}
[null,null,null,null,"Umrechnungen"]
[null,"Winkelumrechnung in Dezimalstelle",null,null,"Längenmaße","Massemaße","Maße des Drucks",null,"Temperatur","Flächenmaße","Volumenmaße"]
[null,"Geschwindigkeit"]
[]
[]
[]
[null,"Winkelumrechnung von (°), (`), (``) in Grad mit Dezimalstelle "]
[]
[null,"Grad (°)","Minuten (´)","Sekunden (``)","Dezimal (°)"]
[null,30,15,45,{"$f":"(((D10/60)+C10)/60)+B10","v":30.262499999999999}]
[null,{"$f":"TRUNC(E11)","v":30},{"$f":"TRUNC(C12)","v":15},{"$f":"(C12-C11)*60","v":44.999999999997442},30.262499999999999]
[null,null,{"$f":"(E11-B11)*60","v":15.749999999999957}]
[]
[]
[null,"Längenmaße"]
[]
[null,"Einheit","Millimeter","Zentimeter","Dezimeter","Meter","Kilometer","Yard","Zoll","Inch","Landmeile","Seemeile","Food"]
[null,"Eingabe",0,0,0,0,0,0,0,0,0,0,0]
[null,"Millimeter",{"$f":"C18","v":0},{"$f":"D18*10","v":0},{"$f":"E18*100","v":0},{"$f":"F18*1000","v":0},{"$f":"G18*1000000","v":0},{"$f":"H18*914.39","v":0},{"$f":"I18*25.4","v":0},{"$f":"J18*25.4","v":0},{"$f":"K18*1609000","v":0},{"$f":"L18*1852000","v":0},{"$f":"M18*304.8","v":0}]
[null,"Zentimeter",{"$f":"C18/10","v":0},{"$f":"D18","v":0},{"$f":"E18*10","v":0},{"$f":"F18*100","v":0},{"$f":"G18*100000","v":0},{"$f":"H18*91.436","v":0},{"$f":"I18*2.54","v":0},{"$f":"J18*2.54","v":0},{"$f":"K18*160900","v":0},{"$f":"L18*185200","v":0},{"$f":"M18*30.48","v":0}]
[null,"Dezimeter",{"$f":"C18/100","v":0},{"$f":"D18/10","v":0},{"$f":"E18","v":0},{"$f":"F18*10","v":0},{"$f":"G18*10000","v":0},{"$f":"H18*9.1436","v":0},{"$f":"I18*0.254","v":0},{"$f":"J18*0.254","v":0},{"$f":"K18*16090","v":0},{"$f":"L18*18520","v":0},{"$f":"M18*3.048","v":0}]
[null,"Meter",{"$f":"C18/1000","v":0},{"$f":"D18/100","v":0},{"$f":"E18/10","v":0},{"$f":"F18","v":0},{"$f":"G18*1000","v":0},{"$f":"H18*0.91439","v":0},{"$f":"I18*0.0254","v":0},{"$f":"J18*0.0254","v":0},{"$f":"K18*1609","v":0},{"$f":"L18*1852","v":0},{"$f":"M18*0.3048","v":0}]
[null,"Kilometer",{"$f":"C18/1000000","v":0},{"$f":"D18/100000","v":0},{"$f":"E18/10000","v":0},{"$f":"F18/1000","v":0},{"$f":"G18","v":0},{"$f":"H18*0.00091439","v":0},{"$f":"I18*0.0000254","v":0},{"$f":"J18*0.0000254","v":0},{"$f":"K18*1.609","v":0},{"$f":"L18*1.852","v":0},{"$f":"M18*0.0003048","v":0}]
[null,"Yard",{"$f":"C18/914.39","v":0},{"$f":"D18/91.439","v":0},{"$f":"E18/9.1439","v":0},{"$f":"F18/0.91439","v":0},{"$f":"G18*1093.62525836897","v":0},{"$f":"H18","v":0},{"$f":"I18*0.027778081793","v":0},{"$f":"J18*0.027778081793","v":0},{"$f":"K18*1759.643","v":0},{"$f":"L18*2025.394","v":0},{"$f":"M18*0.333336977818","v":0}]
[null,"Zoll",{"$f":"C18/25.4","v":0},{"$f":"D18/2.54","v":0},{"$f":"E18/0.254","v":0},{"$f":"F18/0.0254","v":0},{"$f":"G18*39370.0787401575","v":0},{"$f":"H18*35.999606","v":0},{"$f":"I18","v":0},{"$f":"J18","v":0},{"$f":"K18*63346.457","v":0},{"$f":"L18*72913.386","v":0},{"$f":"M18*12","v":0}]
[null,"Inch",{"$f":"C18/25.4","v":0},{"$f":"D18/2.54","v":0},{"$f":"E18/0.254","v":0},{"$f":"F18/0.0254","v":0},{"$f":"G18*39370.0787401575","v":0},{"$f":"H18*35.999606","v":0},{"$f":"I18","v":0},{"$f":"J18","v":0},{"$f":"K18*63346.457","v":0},{"$f":"L18*72913.386","v":0},{"$f":"M18*12","v":0}]
[null,"Landmeile",{"$f":"C18/1609000","v":0},{"$f":"D18/160900","v":0},{"$f":"E18/16090","v":0},{"$f":"F18/1609","v":0},{"$f":"G18*0.621504039776","v":0},{"$f":"H18*0.000568297092","v":0},{"$f":"I18*0.000015786203","v":0},{"$f":"J18*0.000015786203","v":0},{"$f":"K18","v":0},{"$f":"L18*1.1510255","v":0},{"$f":"M18*0.000189434431","v":0}]
[null,"Seemeile",{"$f":"C18/1852000","v":0},{"$f":"D18/185200","v":0},{"$f":"E18/18520","v":0},{"$f":"F18/1852","v":0},{"$f":"G18*0.539956803456","v":0},{"$f":"H18*0.000493731096","v":0},{"$f":"I18*0.000013714903","v":0},{"$f":"J18*0.000013714903","v":0},{"$f":"K18*0.868790482922","v":0},{"$f":"L18","v":0},{"$f":"M18*0.000164578833","v":0}]
[null,"Food",{"$f":"C18/304.8","v":0},{"$f":"D18/30.48","v":0},{"$f":"E18/3.048","v":0},{"$f":"F18/0.3048","v":0},{"$f":"G18*3280.83989501312","v":0},{"$f":"H18*2.9999672","v":0},{"$f":"I18*0.083333333333","v":0},{"$f":"J18*0.083333333333","v":0},{"$f":"K18*5278.8714","v":0},{"$f":"L18*6076.1155","v":0},{"$f":"M18","v":0}]
[]
[]
[]
[null,"Massenmaße"]
[]
[null,"Einheit","Milligramm","Gramm","Kilogramm","Megagramm","Pfund","Zentner","Tonne","Karat"]
[null,"Eingabe",0,0,0,0,0,0,0,0]
[null,"Milligramm",{"$f":"C36","v":0},{"$f":"D36*1000","v":0},{"$f":"E36*1000000","v":0},{"$f":"F36*1000000000","v":0},{"$f":"G36*500000","v":0},{"$f":"H36*50000000","v":0},{"$f":"I36*1000000000","v":0},{"$f":"J36*200","v":0}]
[null,"Gramm",{"$f":"C36*0.001","v":0},{"$f":"D36","v":0},{"$f":"E36*1000","v":0},{"$f":"F36*1000000","v":0},{"$f":"G36*500","v":0},{"$f":"H36*50000","v":0},{"$f":"I36*1000000","v":0},{"$f":"J36*0.2","v":0}]
[null,"Kilogramm",{"$f":"C36*0.000001","v":0},{"$f":"D36*0.001","v":0},{"$f":"E36","v":0},{"$f":"F36*1000","v":0},{"$f":"G36*0.5","v":0},{"$f":"H36*50","v":0},{"$f":"I36*1000","v":0},{"$f":"J36*0.0002","v":0}]
[null,"Megegramm",{"$f":"C36*0.000000001","v":0},{"$f":"D36*0.000001","v":0},{"$f":"E36*0.001","v":0},{"$f":"F36","v":0},{"$f":"G36*0.0005","v":0},{"$f":"H36*0.05","v":0},{"$f":"I36","v":0},{"$f":"J36*0.0000002","v":0}]
[null,"Pfund",{"$f":"C36*0.000002","v":0},{"$f":"D36*0.002","v":0},{"$f":"E36*2","v":0},{"$f":"F36*2000","v":0},{"$f":"G36","v":0},{"$f":"H36*100","v":0},{"$f":"I36*2000","v":0},{"$f":"J36*0.0004","v":0}]
[null,"Zentner",{"$f":"C36*0.00000002","v":0},{"$f":"D36*0.00002","v":0},{"$f":"E36*0.02","v":0},{"$f":"F36*20","v":0},{"$f":"G36*0.01","v":0},{"$f":"H36","v":0},{"$f":"I36*20","v":0},{"$f":"J36*0.000004","v":0}]
[null,"Tonne",{"$f":"C36*0.000000001","v":0},{"$f":"D36*0.000001","v":0},{"$f":"E36*0.001","v":0},{"$f":"F36*1","v":0},{"$f":"G36*0.0005","v":0},{"$f":"H36*0.05","v":0},{"$f":"I36*1","v":0},{"$f":"J36*0.0000002","v":0}]
[null,"Karat",{"$f":"C36*0.005","v":0},{"$f":"D36*5","v":0},{"$f":"E36*5000","v":0},{"$f":"F36*5000000","v":0},{"$f":"G36*2500","v":0},{"$f":"H36*250000","v":0},{"$f":"I36*5000000","v":0},{"$f":"J36","v":0}]
[]
[]
[]
[null,"Maße des Drucks"]
[]
[null,"Einheit","Millibar","Bar","Pascall","Megapascall","Hektopascall","Newton/mm^2","Newton/cm^2","Newton/m^2"]
[null,"Eingabe",0,0,0,0,0,0,0,0]
[null,"Millibar",{"$f":"C51","v":0},{"$f":"D51*1000","v":0},{"$f":"E51*0.01","v":0},{"$f":"F51*10000","v":0},{"$f":"G51*1","v":0},{"$f":"H51*10000","v":0},{"$f":"I51*100","v":0},{"$f":"J51*0.01","v":0}]
[null,"Bar",{"$f":"C51*0.001","v":0},{"$f":"D51","v":0},{"$f":"E51*0.00001","v":0},{"$f":"F51*10","v":0},{"$f":"G51*0.001","v":0},{"$f":"H51*10","v":0},{"$f":"I51*0.1","v":0},{"$f":"J51*0.00001","v":0}]
[null,"Pascall",{"$f":"C51*100","v":0},{"$f":"D51*100000","v":0},{"$f":"E51","v":0},{"$f":"F51*1000000","v":0},{"$f":"G51*100","v":0},{"$f":"H51*1000000","v":0},{"$f":"I51*10000","v":0},{"$f":"J51*1","v":0}]
[null,"Megapascall",{"$f":"C51*0.0001","v":0},{"$f":"D51*0.1","v":0},{"$f":"E51*0.000001","v":0},{"$f":"F51","v":0},{"$f":"G51*0.0001","v":0},{"$f":"H51*1","v":0},{"$f":"I51*0.01","v":0},{"$f":"J51*0.000001","v":0}]
[null,"Hektopascall",{"$f":"C51*1","v":0},{"$f":"D51*1000","v":0},{"$f":"E51*0.01","v":0},{"$f":"F51*10000","v":0},{"$f":"G51","v":0},{"$f":"H51*10000","v":0},{"$f":"I51*100","v":0},{"$f":"J51*0.01","v":0}]
[null,"Newton/mm2",{"$f":"C51*0.0001","v":0},{"$f":"D51*0.1","v":0},{"$f":"E51*0.000001","v":0},{"$f":"F51*1","v":0},{"$f":"G51*0.0001","v":0},{"$f":"H51","v":0},{"$f":"I51*0.01","v":0},{"$f":"J51*0.000001","v":0}]
[null,"Newton/cm2",{"$f":"C51*0.01","v":0},{"$f":"D51*10","v":0},{"$f":"E51*0.0001","v":0},{"$f":"F51*100","v":0},{"$f":"G51*0.01","v":0},{"$f":"H51*100","v":0},{"$f":"I51","v":0},{"$f":"J51*0.0001","v":0}]
[null,"Newton/m2",{"$f":"C51*100","v":0},{"$f":"D51*100000","v":0},{"$f":"E51*1","v":0},{"$f":"F51*1000000","v":0},{"$f":"G51*100","v":0},{"$f":"H51*1000000","v":0},{"$f":"I51*10000","v":0},{"$f":"J51","v":0}]
[]
[]
[]
[null,"Temperatur",null,"(Hinweis: Δ1°C = 1,8° F)"]
[]
[null,"Einheit","Celsius","Fahrenheit","Kelvin"]
[null,"Eingabe",0,32,273]
[null,"Celsius",{"$f":"C66","v":0},{"$f":"(5/9)*(D66-32)","v":0},{"$f":"E66-273","v":0}]
[null,"Fahrenheit",{"$f":"((9/5)*C66)+32","v":32},{"$f":"D66","v":32},{"$f":"((9/5)*E67)+32","v":32}]
[null,"Kelvin",{"$f":"C66+273","v":273},{"$f":"D67+273","v":273},{"$f":"E66","v":273}]
[]
[]
[]
[null,"Flächenmaße"]
[]
[null,"Einheit","mm²","cm²","dm²","m²","km²","Ar","Hektar"]
[null,"Eingabe",0,0,0,0,0,0,0]
[null,"mm²",{"$f":"C76","v":0},{"$f":"D76*100","v":0},{"$f":"E76*10000","v":0},{"$f":"F76*1000000","v":0},{"$f":"G76*1000000000000","v":0},{"$f":"H76*100000000","v":0},{"$f":"I76*10000000000","v":0}]
[null,"cm²",{"$f":"C76*0.01","v":0},{"$f":"D76","v":0},{"$f":"E76*100","v":0},{"$f":"F76*10000","v":0},{"$f":"G76*10000000000","v":0},{"$f":"H76*1000000","v":0},{"$f":"I76*100000000","v":0}]
[null,"dm²",{"$f":"C76*0.0001","v":0},{"$f":"D76*0.01","v":0},{"$f":"E76","v":0},{"$f":"F76*100","v":0},{"$f":"G76*100000000","v":0},{"$f":"H76*10000","v":0},{"$f":"I76*1000000","v":0}]
[null,"m²",{"$f":"C76*0.000001","v":0},{"$f":"D76*0.0001","v":0},{"$f":"E76*0.01","v":0},{"$f":"F76","v":0},{"$f":"G76*1000000","v":0},{"$f":"H76*100","v":0},{"$f":"I76*10000","v":0}]
[null,"km²",{"$f":"C76*0.000000000001","v":0},{"$f":"D76*0.0000000001","v":0},{"$f":"E76*0.00000001","v":0},{"$f":"F76*0.000001","v":0},{"$f":"G76","v":0},{"$f":"H76/10000","v":0},{"$f":"I76*0.01","v":0}]
[null,"Ar",{"$f":"C76*0.00000001","v":0},{"$f":"D76*0.000001","v":0},{"$f":"E76*0.0001","v":0},{"$f":"F76*0.01","v":0},{"$f":"G76*10000","v":0},{"$f":"H76","v":0},{"$f":"I76*100","v":0}]
[null,"Hektar",{"$f":"C76*0.0000000001","v":0},{"$f":"D76*0.00000001","v":0},{"$f":"E76*0.000001","v":0},{"$f":"F76*0.0001","v":0},{"$f":"G76*100","v":0},{"$f":"H76*0.01","v":0},{"$f":"I76","v":0}]
[]
[]
[]
[null,"Volumenmaße"]
[]
[null,"Einheit","mm³","cm³","dm³","m³","Milliliter","Liter","Hektoliter"]
[null,"Eingabe",0,0,0,0,0,0,0]
[null,"mm³",{"$f":"C90","v":0},{"$f":"D90*1000","v":0},{"$f":"E90*1000000","v":0},{"$f":"F90*1000000000","v":0},{"$f":"G90*1000","v":0},{"$f":"H90*1000000","v":0},{"$f":"I90*100000000","v":0}]
[null,"cm³",{"$f":"C90*0.001","v":0},{"$f":"D90","v":0},{"$f":"E90*1000","v":0},{"$f":"F90*1000000","v":0},{"$f":"G90*1","v":0},{"$f":"H90*1000","v":0},{"$f":"I90*100000","v":0}]
[null,"dm³",{"$f":"C90*0.000001","v":0},{"$f":"D90*0.001","v":0},{"$f":"E90","v":0},{"$f":"F90*1000","v":0},{"$f":"G90*0.001","v":0},{"$f":"H90*1","v":0},{"$f":"I90*100","v":0}]
[null,"m³",{"$f":"C90*0.000000001","v":0},{"$f":"D90*0.000001","v":0},{"$f":"E90*0.001","v":0},{"$f":"F90","v":0},{"$f":"G90*0.000001","v":0},{"$f":"H90*0.001","v":0},{"$f":"I90*0.1","v":0}]
[null,"Milliliter",{"$f":"C90*0.001","v":0},{"$f":"D90","v":0},{"$f":"E90*1000","v":0},{"$f":"F90*1000000","v":0},{"$f":"G90","v":0},{"$f":"H90*1000","v":0},{"$f":"I90*100000","v":0}]
[null,"Liter",{"$f":"C90*0.000001","v":0},{"$f":"D90*0.001","v":0},{"$f":"E90","v":0},{"$f":"F90*1000","v":0},{"$f":"G90*0.001","v":0},{"$f":"H90","v":0},{"$f":"I90*100","v":0}]
[null,"Hektoliter",{"$f":"C90*0.000000001","v":0},{"$f":"D90*0.00001","v":0},{"$f":"E90*0.01","v":0},{"$f":"F90*10","v":0},{"$f":"G90*0.00001","v":0},{"$f":"H90*0.1","v":0},{"$f":"I90","v":0}]
[]
[]
[]
[null,"Geschwindigkeit"]
[]
[null,"Einheit","m/s","m/min","km/h","Lichtgeschw.","Schallg.(15°C)","Schallg.(0°C)","Mach(15°C)"]
[null,"Eingabe",0,0,0,0,0,0,0]
[null,"m/s",{"$f":"C104","v":0},{"$f":"D104*0.016666666667","v":0},{"$f":"E104*0.277777777778","v":0},{"$f":"F104*300000000","v":0},{"$f":"G104*340.6","v":0},{"$f":"H104*331.6","v":0},{"$f":"I104*341.6666","v":0}]
[null,"m/min",{"$f":"C104*60","v":0},{"$f":"D104","v":0},{"$f":"E104*16.666666666667","v":0},{"$f":"F104*18000000000","v":0},{"$f":"G104*20436","v":0},{"$f":"H104*19896","v":0},{"$f":"I104*20499.996","v":0}]
[null,"km/h",{"$f":"C104*3.6","v":0},{"$f":"D104*0.06","v":0},{"$f":"E104","v":0},{"$f":"F104*1080000000","v":0},{"$f":"G104*1226.16","v":0},{"$f":"H104*1193.76","v":0},{"$f":"I104*1229.99976","v":0}]
[null,"Lichtgeschw.",{"$f":"C104*0.000000003333","v":0},{"$f":"D104*0.000000000056","v":0},{"$f":"E104*0.000000000926","v":0},{"$f":"F104","v":0},{"$f":"G104*0.000001135333","v":0},{"$f":"H104*0.000001105333","v":0},{"$f":"I104*0.000001138889","v":0}]
[null,"Schallg.(15°C)",{"$f":"C104*0.002935995302","v":0},{"$f":"D104*0.000048933255","v":0},{"$f":"E104*0.000815554251","v":0},{"$f":"F104*880798.590722255","v":0},{"$f":"G104","v":0},{"$f":"H104*0.973576042278","v":0},{"$f":"I104*1.00313153259","v":0}]
[null,"Schallg.(0°C)",{"$f":"C104*0.003015681544","v":0},{"$f":"D104*0.000050261359","v":0},{"$f":"E104*0.000837689318","v":0},{"$f":"F104*904704.463208685","v":0},{"$f":"G104*1.027141133896","v":0},{"$f":"H104","v":0},{"$f":"I104*1.030357659831","v":0}]
[null,"Mach(15°C)",{"$f":"C104*0.002926829839","v":0},{"$f":"D104*0.000048780479","v":0},{"$f":"E104*0.000813008289","v":0},{"$f":"F104*878048.95181443","v":0},{"$f":"G104*0.996878243293","v":0},{"$f":"H104*0.970536774739","v":0},{"$f":"I104","v":0}]

{"sheet":"Rechner","index":44,"n_rows":8,"n_cols":5,"rows_kept":8,"cut":false,"hidden":false,"merged":[]}
[null,null,null,{"$f":"NOW()","v":"2016-12-21T14:11:15.240"}]
[null,null,null,0]
[]
[]
[]
[null,null,null,0]
[null,null,null,0]
[null,null,null,0,0]

{"sheet":"Pfad für Ordner","index":45,"n_rows":770,"n_cols":26,"rows_kept":770,"cut":false,"hidden":false,"merged":[]}
[null,null,null,"Druckausgabe",{"$f":"Start!E1","v":1},null,null,null,null,null,null,null,null,null,null,"Druckausgabe",1]
[null,"Pfadeingabe für Ordner Hauptnutzungszeit",null,{"$f":"Druckausgabe!A3","v":"Teile-Nr.:"},{"$f":"IF(Druckausgabe!B3=0,\"\",Druckausgabe!B3)","v":""},null,null,null,null,null,null,null,null,null,null,"Teile-Nr.:","ZSB_002"]
[null,null,null,{"$f":"Druckausgabe!A4","v":"Teilebezeichnung:"},{"$f":"Druckausgabe!B4","v":0},null,null,null,null,null,null,null,null,null,null,"Teilebezeichnung:","Kalotte"]
[null,"Automatische Pfadübernahme",null,{"$f":"Druckausgabe!A5","v":"Material:"},{"$f":"Druckausgabe!B5","v":0},null,null,null,null,null,null,null,null,null,null,"Material:","St37"]
[null,"z.B.  C:\\Dokumente und Einstellungen\\Benutzer\\Mustermann\\Excel_Dateien\\",null,{"$f":"Druckausgabe!A6","v":"für Firma:"},{"$f":"Druckausgabe!B6","v":0},null,null,null,null,null,null,null,null,null,null,"für Firma:","ZSB Zwickauer Sonderstahlbau GmbH"]
[null,"Die Datei Hauptnutzungszeit.xlsm muss im Ordner Hauptnutzungszeit gespeichert sein !",null,{"$f":"Druckausgabe!A7","v":"Anfrage-Nr.:"},{"$f":"Druckausgabe!B7","v":0},null,null,null,null,null,null,null,null,null,null,"Anfrage-Nr.:",0]
[null,{"$f":"CELL(\"dateiname\")","v":"C:\\Uli\\Excel-Dateien\\ULDA-Tabellen\\Erweiterungen\\Hauptnutzungszeit\\[Hauptnutzungszeit.xlsm]Werkzeugdaten"},null,{"$f":"Druckausgabe!A8","v":"Angebots-Nr.:"},{"$f":"Druckausgabe!B8","v":0},null,null,null,null,null,null,null,null,null,null,"Angebots-Nr.:","16D0030"]
[null,{"$f":"IF(B13=0,LEFT(B7,SEARCH(\"[\",B7,1)-1),B13)","v":"dd"},null,{"$f":"Druckausgabe!A9","v":0},{"$f":"Druckausgabe!B9","v":0},null,null,null,null,null,null,null,null,null,null,0,0]
[null,{"$f":"MID(B8,1,1)","v":"d"},null,{"$f":"Druckausgabe!A10","v":"Hinweis für die Berechnung:"},{"$f":"Druckausgabe!B10","v":0},null,null,null,null,null,null,null,null,null,null,"Hinweis für die Berechnung:",0]
[null,null,null,{"$f":"Druckausgabe!A11","v":0},{"$f":"Druckausgabe!B11","v":0},null,null,null,null,null,null,null,null,null,null,0,0]
[null,null,null,{"$f":"Druckausgabe!A12","v":0},{"$f":"Druckausgabe!B12","v":0},null,null,null,null,null,null,null,null,null,null,0,0]
[null,"Dateipfad bis zum Ordner Hauptnutzungszeit hier eingeben, wenn Hauptnutzungszeit.xlsm außerhalb von Ordner Hauptnutzungszeit gespeichert ist!",null,{"$f":"Druckausgabe!A13","v":0},{"$f":"Druckausgabe!B13","v":0},null,null,null,null,null,null,null,null,null,null,0,0]
[null,"dd"]
[]
[null,null,null,"Start",null,null,null,null,null,null,null,null,null,null,null,"Start"]
[null,null,null,{"$f":"Start!A3","v":30},null,null,null,null,null,null,null,null,null,null,null,30]
[null,null,null,{"$f":"Start!A5","v":70},null,null,null,null,null,null,null,null,null,null,null,75.11]
[]
[]
[null,null,null,"diverse Arbeiten",null,null,null,null,null,null,null,null,null,null,null,"diverse Arbeiten"]
[null,null,null,{"$f":"'diverse Arbeiten'!A4","v":0},{"$f":"'diverse Arbeiten'!B4","v":0},{"$f":"'diverse Arbeiten'!C4","v":0},{"$f":"'diverse Arbeiten'!D4","v":0},null,null,null,null,null,null,null,null,"AG1 ","aufspannen, umspannen für 2. Sp., abspannen",1,15]
[null,null,null,{"$f":"'diverse Arbeiten'!A5","v":0},{"$f":"'diverse Arbeiten'!B5","v":0},{"$f":"'diverse Arbeiten'!C5","v":0},{"$f":"'diverse Arbeiten'!D5","v":0},null,null,null,null,null,null,null,null,0,0,0,0]
[null,null,null,{"$f":"'diverse Arbeiten'!A6","v":0},{"$f":"'diverse Arbeiten'!B6","v":0},{"$f":"'diverse Arbeiten'!C6","v":0},{"$f":"'diverse Arbeiten'!D6","v":0},null,null,null,null,null,null,null,null,0,0,0,0]
[null,null,null,{"$f":"'diverse Arbeiten'!A7","v":0},{"$f":"'diverse Arbeiten'!B7","v":0},{"$f":"'diverse Arbeiten'!C7","v":0},{"$f":"'diverse Arbeiten'!D7","v":0},null,null,null,null,null,null,null,null,0,0,0,0]
[null,null,null,{"$f":"'diverse Arbeiten'!A8","v":0},{"$f":"'diverse Arbeiten'!B8","v":0},{"$f":"'diverse Arbeiten'!C8","v":0},{"$f":"'diverse Arbeiten'!D8","v":0},null,null,null,null,null,null,null,null,0,0,0,0]
[null,null,null,{"$f":"'diverse Arbeiten'!A9","v":0},{"$f":"'diverse Arbeiten'!B9","v":0},{"$f":"'diverse Arbeiten'!C9","v":0},{"$f":"'diverse Arbeiten'!D9","v":0},null,null,null,null,null,null,null,null,0,0,0,0]
[null,null,null,{"$f":"'diverse Arbeiten'!A10","v":0},{"$f":"'diverse Arbeiten'!B10","v":0},{"$f":"'diverse Arbeiten'!C10","v":0},{"$f":"'diverse Arbeiten'!D10","v":0},null,null,null,null,null,null,null,null,0,0,0,0]
[null,null,null,{"$f":"'diverse Arbeiten'!A11","v":0},{"$f":"'diverse Arbeiten'!B11","v":0},{"$f":"'diverse Arbeiten'!C11","v":0},{"$f":"'diverse Arbeiten'!D11","v":0},null,null,null,null,null,null,null,null,0,0,0,0]
[null,null,null,{"$f":"'diverse Arbeiten'!A12","v":0},{"$f":"'diverse Arbeiten'!B12","v":0},{"$f":"'diverse Arbeiten'!C12","v":0},{"$f":"'diverse Arbeiten'!D12","v":0},null,null,null,null,null,null,null,null,0,0,0,0]
[null,null,null,{"$f":"'diverse Arbeiten'!A13","v":0},{"$f":"'diverse Arbeiten'!B13","v":0},{"$f":"'diverse Arbeiten'!C13","v":0},{"$f":"'diverse Arbeiten'!D13","v":0},null,null,null,null,null,null,null,null,0,0,0,0]
[null,null,null,{"$f":"'diverse Arbeiten'!A14","v":0},{"$f":"'diverse Arbeiten'!B14","v":0},{"$f":"'diverse Arbeiten'!C14","v":0},{"$f":"'diverse Arbeiten'!D14","v":0},null,null,null,null,null,null,null,null,0,0,0,0]
[null,null,null,{"$f":"'diverse Arbeiten'!A15","v":0},{"$f":"'diverse Arbeiten'!B15","v":0},{"$f":"'diverse Arbeiten'!C15","v":0},{"$f":"'diverse Arbeiten'!D15","v":0},null,null,null,null,null,null,null,null,0,0,0,0]
[null,null,null,{"$f":"'diverse Arbeiten'!A16","v":0},{"$f":"'diverse Arbeiten'!B16","v":0},{"$f":"'diverse Arbeiten'!C16","v":0},{"$f":"'diverse Arbeiten'!D16","v":0},null,null,null,null,null,null,null,null,0,0,0,0]
[null,null,null,{"$f":"'diverse Arbeiten'!A17","v":0},{"$f":"'diverse Arbeiten'!B17","v":0},{"$f":"'diverse Arbeiten'!C17","v":0},{"$f":"'diverse Arbeiten'!D17","v":0},null,null,null,null,null,null,null,null,0,0,0,0]
[null,null,null,{"$f":"'diverse Arbeiten'!A18","v":0},{"$f":"'diverse Arbeiten'!B18","v":0},{"$f":"'diverse Arbeiten'!C18","v":0},{"$f":"'diverse Arbeiten'!D18","v":0},null,null,null,null,null,null,null,null,0,0,0,0]
[null,null,null,{"$f":"'diverse Arbeiten'!A19","v":0},{"$f":"'diverse Arbeiten'!B19","v":0},{"$f":"'diverse Arbeiten'!C19","v":0},{"$f":"'diverse Arbeiten'!D19","v":0},null,null,null,null,null,null,null,null,0,0,0,0]
[null,null,null,{"$f":"'diverse Arbeiten'!A20","v":0},{"$f":"'diverse Arbeiten'!B20","v":0},{"$f":"'diverse Arbeiten'!C20","v":0},{"$f":"'diverse Arbeiten'!D20","v":0},null,null,null,null,null,null,null,null,0,0,0,0]
[null,null,null,{"$f":"'diverse Arbeiten'!A21","v":0},{"$f":"'diverse Arbeiten'!B21","v":0},{"$f":"'diverse Arbeiten'!C21","v":0},{"$f":"'diverse Arbeiten'!D21","v":0},null,null,null,null,null,null,null,null,0,0,0,0]
[null,null,null,{"$f":"'diverse Arbeiten'!A22","v":0},{"$f":"'diverse Arbeiten'!B22","v":0},{"$f":"'diverse Arbeiten'!C22","v":0},{"$f":"'diverse Arbeiten'!D22","v":0},null,null,null,null,null,null,null,null,0,0,0,0]
[null,null,null,{"$f":"'diverse Arbeiten'!A23","v":0},{"$f":"'diverse Arbeiten'!B23","v":0},{"$f":"'diverse Arbeiten'!C23","v":0},{"$f":"'diverse Arbeiten'!D23","v":0},null,null,null,null,null,null,null,null,0,0,0,0]
[null,null,null,{"$f":"'diverse Arbeiten'!A24","v":0},{"$f":"'diverse Arbeiten'!B24","v":0},{"$f":"'diverse Arbeiten'!C24","v":0},{"$f":"'diverse Arbeiten'!D24","v":0},null,null,null,null,null,null,null,null,0,0,0,0]
[null,null,null,{"$f":"'diverse Arbeiten'!A25","v":0},{"$f":"'diverse Arbeiten'!B25","v":0},{"$f":"'diverse Arbeiten'!C25","v":0},{"$f":"'diverse Arbeiten'!D25","v":0},null,null,null,null,null,null,null,null,0,0,0,0]
[null,null,null,{"$f":"'diverse Arbeiten'!A26","v":0},{"$f":"'diverse Arbeiten'!B26","v":0},{"$f":"'diverse Arbeiten'!C26","v":0},{"$f":"'diverse Arbeiten'!D26","v":0},null,null,null,null,null,null,null,null,0,0,0,0]
[null,null,null,{"$f":"'diverse Arbeiten'!A27","v":0},{"$f":"'diverse Arbeiten'!B27","v":0},{"$f":"'diverse Arbeiten'!C27","v":0},{"$f":"'diverse Arbeiten'!D27","v":0},null,null,null,null,null,null,null,null,0,0,0,0]
[null,null,null,{"$f":"'diverse Arbeiten'!A28","v":0},{"$f":"'diverse Arbeiten'!B28","v":0},{"$f":"'diverse Arbeiten'!C28","v":0},{"$f":"'diverse Arbeiten'!D28","v":0},null,null,null,null,null,null,null,null,0,0,0,0]
[null,null,null,{"$f":"'diverse Arbeiten'!A29","v":0},{"$f":"'diverse Arbeiten'!B29","v":0},{"$f":"'diverse Arbeiten'!C29","v":0},{"$f":"'diverse Arbeiten'!D29","v":0},null,null,null,null,null,null,null,null,0,0,0,0]
[null,null,null,{"$f":"'diverse Arbeiten'!A30","v":0},{"$f":"'diverse Arbeiten'!B30","v":0},{"$f":"'diverse Arbeiten'!C30","v":0},{"$f":"'diverse Arbeiten'!D30","v":0},null,null,null,null,null,null,null,null,0,0,0,0]
[null,null,null,{"$f":"'diverse Arbeiten'!A31","v":0},{"$f":"'diverse Arbeiten'!B31","v":0},{"$f":"'diverse Arbeiten'!C31","v":0},{"$f":"'diverse Arbeiten'!D31","v":0},null,null,null,null,null,null,null,null,0,0,0,0]
[null,null,null,{"$f":"'diverse Arbeiten'!A32","v":0},{"$f":"'diverse Arbeiten'!B32","v":0},{"$f":"'diverse Arbeiten'!C32","v":0},{"$f":"'diverse Arbeiten'!D32","v":0},null,null,null,null,null,null,null,null,0,0,0,0]
[null,null,null,{"$f":"'diverse Arbeiten'!A33","v":0},{"$f":"'diverse Arbeiten'!B33","v":0},{"$f":"'diverse Arbeiten'!C33","v":0},{"$f":"'diverse Arbeiten'!D33","v":0},null,null,null,null,null,null,null,null,0,0,0,0]
[null,null,null,{"$f":"'diverse Arbeiten'!A34","v":0},{"$f":"'diverse Arbeiten'!B34","v":0},{"$f":"'diverse Arbeiten'!C34","v":0},{"$f":"'diverse Arbeiten'!D34","v":0},null,null,null,null,null,null,null,null,0,0,0,0]
[null,null,null,{"$f":"'diverse Arbeiten'!A35","v":0},{"$f":"'diverse Arbeiten'!B35","v":0},{"$f":"'diverse Arbeiten'!C35","v":0},{"$f":"'diverse Arbeiten'!D35","v":0},null,null,null,null,null,null,null,null,0,0,0,0]
[null,null,null,{"$f":"'diverse Arbeiten'!A36","v":0},{"$f":"'diverse Arbeiten'!B36","v":0},{"$f":"'diverse Arbeiten'!C36","v":0},{"$f":"'diverse Arbeiten'!D36","v":0},null,null,null,null,null,null,null,null,0,0,0,0]
[null,null,null,{"$f":"'diverse Arbeiten'!A37","v":0},{"$f":"'diverse Arbeiten'!B37","v":0},{"$f":"'diverse Arbeiten'!C37","v":0},{"$f":"'diverse Arbeiten'!D37","v":0},null,null,null,null,null,null,null,null,0,0,0,0]
[null,null,null,{"$f":"'diverse Arbeiten'!A38","v":0},{"$f":"'diverse Arbeiten'!B38","v":0},{"$f":"'diverse Arbeiten'!C38","v":0},{"$f":"'diverse Arbeiten'!D38","v":0},null,null,null,null,null,null,null,null,0,0,0,0]
[null,null,null,{"$f":"'diverse Arbeiten'!A39","v":0},{"$f":"'diverse Arbeiten'!B39","v":0},{"$f":"'diverse Arbeiten'!C39","v":0},{"$f":"'diverse Arbeiten'!D39","v":0},null,null,null,null,null,null,null,null,0,0,0,0]
[null,null,null,{"$f":"'diverse Arbeiten'!A40","v":0},{"$f":"'diverse Arbeiten'!B40","v":0},{"$f":"'diverse Arbeiten'!C40","v":0},{"$f":"'diverse Arbeiten'!D40","v":0},null,null,null,null,null,null,null,null,0,0,0,0]
[null,null,null,{"$f":"'diverse Arbeiten'!A41","v":0},{"$f":"'diverse Arbeiten'!B41","v":0},{"$f":"'diverse Arbeiten'!C41","v":0},{"$f":"'diverse Arbeiten'!D41","v":0},null,null,null,null,null,null,null,null,0,0,0,0]
[null,null,null,{"$f":"'diverse Arbeiten'!A42","v":0},{"$f":"'diverse Arbeiten'!B42","v":0},{"$f":"'diverse Arbeiten'!C42","v":0},{"$f":"'diverse Arbeiten'!D42","v":0},null,null,null,null,null,null,null,null,0,0,0,0]
[null,null,null,{"$f":"'diverse Arbeiten'!A43","v":0},{"$f":"'diverse Arbeiten'!B43","v":0},{"$f":"'diverse Arbeiten'!C43","v":0},{"$f":"'diverse Arbeiten'!D43","v":0},null,null,null,null,null,null,null,null,0,0,0,0]
[null,null,null,{"$f":"'diverse Arbeiten'!A44","v":0},{"$f":"'diverse Arbeiten'!B44","v":0},{"$f":"'diverse Arbeiten'!C44","v":0},{"$f":"'diverse Arbeiten'!D44","v":0},null,null,null,null,null,null,null,null,0,0,0,0]
[null,null,null,{"$f":"'diverse Arbeiten'!A45","v":0},{"$f":"'diverse Arbeiten'!B45","v":0},{"$f":"'diverse Arbeiten'!C45","v":0},{"$f":"'diverse Arbeiten'!D45","v":0},null,null,null,null,null,null,null,null,0,0,0,0]
[null,null,null,{"$f":"'diverse Arbeiten'!A46","v":0},{"$f":"'diverse Arbeiten'!B46","v":0},{"$f":"'diverse Arbeiten'!C46","v":0},{"$f":"'diverse Arbeiten'!D46","v":0},null,null,null,null,null,null,null,null,0,0,0,0]
[null,null,null,{"$f":"'diverse Arbeiten'!A47","v":0},{"$f":"'diverse Arbeiten'!B47","v":0},{"$f":"'diverse Arbeiten'!C47","v":0},{"$f":"'diverse Arbeiten'!D47","v":0},null,null,null,null,null,null,null,null,0,0,0,0]
[null,null,null,{"$f":"'diverse Arbeiten'!A48","v":0},{"$f":"'diverse Arbeiten'!B48","v":0},{"$f":"'diverse Arbeiten'!C48","v":0},{"$f":"'diverse Arbeiten'!D48","v":0},null,null,null,null,null,null,null,null,0,0,0,0]
[null,null,null,{"$f":"'diverse Arbeiten'!A49","v":0},{"$f":"'diverse Arbeiten'!B49","v":0},{"$f":"'diverse Arbeiten'!C49","v":0},{"$f":"'diverse Arbeiten'!D49","v":0},null,null,null,null,null,null,null,null,0,0,0,0]
[null,null,null,{"$f":"'diverse Arbeiten'!A50","v":0},{"$f":"'diverse Arbeiten'!B50","v":0},{"$f":"'diverse Arbeiten'!C50","v":0},{"$f":"'diverse Arbeiten'!D50","v":0},null,null,null,null,null,null,null,null,0,0,0,0]
[null,null,null,{"$f":"'diverse Arbeiten'!A51","v":0},{"$f":"'diverse Arbeiten'!B51","v":0},{"$f":"'diverse Arbeiten'!C51","v":0},{"$f":"'diverse Arbeiten'!D51","v":0},null,null,null,null,null,null,null,null,0,0,0,0]
[null,null,null,{"$f":"'diverse Arbeiten'!A52","v":0},{"$f":"'diverse Arbeiten'!B52","v":0},{"$f":"'diverse Arbeiten'!C52","v":0},{"$f":"'diverse Arbeiten'!D52","v":0},null,null,null,null,null,null,null,null,0,0,0,0]
[null,null,null,{"$f":"'diverse Arbeiten'!A53","v":0},{"$f":"'diverse Arbeiten'!B53","v":0},{"$f":"'diverse Arbeiten'!C53","v":0},{"$f":"'diverse Arbeiten'!D53","v":0},null,null,null,null,null,null,null,null,0,0,0,0]
[null,null,null,{"$f":"'diverse Arbeiten'!A54","v":0},{"$f":"'diverse Arbeiten'!B54","v":0},{"$f":"'diverse Arbeiten'!C54","v":0},{"$f":"'diverse Arbeiten'!D54","v":0},null,null,null,null,null,null,null,null,0,0,0,0]
[null,null,null,{"$f":"'diverse Arbeiten'!A55","v":0},{"$f":"'diverse Arbeiten'!B55","v":0},{"$f":"'diverse Arbeiten'!C55","v":0},{"$f":"'diverse Arbeiten'!D55","v":0},null,null,null,null,null,null,null,null,0,0,0,0]
[null,null,null,{"$f":"'diverse Arbeiten'!A56","v":0},{"$f":"'diverse Arbeiten'!B56","v":0},{"$f":"'diverse Arbeiten'!C56","v":0},{"$f":"'diverse Arbeiten'!D56","v":0},null,null,null,null,null,null,null,null,0,0,0,0]
[null,null,null,{"$f":"'diverse Arbeiten'!A57","v":0},{"$f":"'diverse Arbeiten'!B57","v":0},{"$f":"'diverse Arbeiten'!C57","v":0},{"$f":"'diverse Arbeiten'!D57","v":0},null,null,null,null,null,null,null,null,0,0,0,0]
[null,null,null,{"$f":"'diverse Arbeiten'!A58","v":0},{"$f":"'diverse Arbeiten'!B58","v":0},{"$f":"'diverse Arbeiten'!C58","v":0},{"$f":"'diverse Arbeiten'!D58","v":0},null,null,null,null,null,null,null,null,0,0,0,0]
[null,null,null,{"$f":"'diverse Arbeiten'!A59","v":0},{"$f":"'diverse Arbeiten'!B59","v":0},{"$f":"'diverse Arbeiten'!C59","v":0},{"$f":"'diverse Arbeiten'!D59","v":0},null,null,null,null,null,null,null,null,0,0,0,0]
[null,null,null,{"$f":"'diverse Arbeiten'!A60","v":0},{"$f":"'diverse Arbeiten'!B60","v":0},{"$f":"'diverse Arbeiten'!C60","v":0},{"$f":"'diverse Arbeiten'!D60","v":0},null,null,null,null,null,null,null,null,0,0,0,0]
[null,null,null,{"$f":"'diverse Arbeiten'!A61","v":0},{"$f":"'diverse Arbeiten'!B61","v":0},{"$f":"'diverse Arbeiten'!C61","v":0},{"$f":"'diverse Arbeiten'!D61","v":0},null,null,null,null,null,null,null,null,0,0,0,0]
[null,null,null,{"$f":"'diverse Arbeiten'!A62","v":0},{"$f":"'diverse Arbeiten'!B62","v":0},{"$f":"'diverse Arbeiten'!C62","v":0},{"$f":"'diverse Arbeiten'!D62","v":0},null,null,null,null,null,null,null,null,0,0,0,0]
[null,null,null,{"$f":"'diverse Arbeiten'!A63","v":0},{"$f":"'diverse Arbeiten'!B63","v":0},{"$f":"'diverse Arbeiten'!C63","v":0},{"$f":"'diverse Arbeiten'!D63","v":0},null,null,null,null,null,null,null,null,0,0,0,0]
[null,null,null,{"$f":"'diverse Arbeiten'!A64","v":0},{"$f":"'diverse Arbeiten'!B64","v":0},{"$f":"'diverse Arbeiten'!C64","v":0},{"$f":"'diverse Arbeiten'!D64","v":0},null,null,null,null,null,null,null,null,0,0,0,0]
[null,null,null,{"$f":"'diverse Arbeiten'!A65","v":0},{"$f":"'diverse Arbeiten'!B65","v":0},{"$f":"'diverse Arbeiten'!C65","v":0},{"$f":"'diverse Arbeiten'!D65","v":0},null,null,null,null,null,null,null,null,0,0,0,0]
[null,null,null,{"$f":"'diverse Arbeiten'!A66","v":0},{"$f":"'diverse Arbeiten'!B66","v":0},{"$f":"'diverse Arbeiten'!C66","v":0},{"$f":"'diverse Arbeiten'!D66","v":0},null,null,null,null,null,null,null,null,0,0,0,0]
[null,null,null,{"$f":"'diverse Arbeiten'!A67","v":0},{"$f":"'diverse Arbeiten'!B67","v":0},{"$f":"'diverse Arbeiten'!C67","v":0},{"$f":"'diverse Arbeiten'!D67","v":0},null,null,null,null,null,null,null,null,0,0,0,0]
[null,null,null,{"$f":"'diverse Arbeiten'!A68","v":0},{"$f":"'diverse Arbeiten'!B68","v":0},{"$f":"'diverse Arbeiten'!C68","v":0},{"$f":"'diverse Arbeiten'!D68","v":0},null,null,null,null,null,null,null,null,0,0,0,0]
[null,null,null,{"$f":"'diverse Arbeiten'!A69","v":0},{"$f":"'diverse Arbeiten'!B69","v":0},{"$f":"'diverse Arbeiten'!C69","v":0},{"$f":"'diverse Arbeiten'!D69","v":0},null,null,null,null,null,null,null,null,0,0,0,0]
[null,null,null,{"$f":"'diverse Arbeiten'!A70","v":0},{"$f":"'diverse Arbeiten'!B70","v":0},{"$f":"'diverse Arbeiten'!C70","v":0},{"$f":"'diverse Arbeiten'!D70","v":0},null,null,null,null,null,null,null,null,0,0,0,0]
[null,null,null,{"$f":"'diverse Arbeiten'!A71","v":0},{"$f":"'diverse Arbeiten'!B71","v":0},{"$f":"'diverse Arbeiten'!C71","v":0},{"$f":"'diverse Arbeiten'!D71","v":0},null,null,null,null,null,null,null,null,0,0,0,0]
[null,null,null,{"$f":"'diverse Arbeiten'!A72","v":0},{"$f":"'diverse Arbeiten'!B72","v":0},{"$f":"'diverse Arbeiten'!C72","v":0},{"$f":"'diverse Arbeiten'!D72","v":0},null,null,null,null,null,null,null,null,0,0,0,0]
[null,null,null,{"$f":"'diverse Arbeiten'!A73","v":0},{"$f":"'diverse Arbeiten'!B73","v":0},{"$f":"'diverse Arbeiten'!C73","v":0},{"$f":"'diverse Arbeiten'!D73","v":0},null,null,null,null,null,null,null,null,0,0,0,0]
[null,null,null,{"$f":"'diverse Arbeiten'!A74","v":0},{"$f":"'diverse Arbeiten'!B74","v":0},{"$f":"'diverse Arbeiten'!C74","v":0},{"$f":"'diverse Arbeiten'!D74","v":0},null,null,null,null,null,null,null,null,0,0,0,0]
[null,null,null,{"$f":"'diverse Arbeiten'!A75","v":0},{"$f":"'diverse Arbeiten'!B75","v":0},{"$f":"'diverse Arbeiten'!C75","v":0},{"$f":"'diverse Arbeiten'!D75","v":0},null,null,null,null,null,null,null,null,0,0,0,0]
[null,null,null,{"$f":"'diverse Arbeiten'!A76","v":0},{"$f":"'diverse Arbeiten'!B76","v":0},{"$f":"'diverse Arbeiten'!C76","v":0},{"$f":"'diverse Arbeiten'!D76","v":0},null,null,null,null,null,null,null,null,0,0,0,0]
[null,null,null,{"$f":"'diverse Arbeiten'!A77","v":0},{"$f":"'diverse Arbeiten'!B77","v":0},{"$f":"'diverse Arbeiten'!C77","v":0},{"$f":"'diverse Arbeiten'!D77","v":0},null,null,null,null,null,null,null,null,0,0,0,0]
[null,null,null,{"$f":"'diverse Arbeiten'!A78","v":0},{"$f":"'diverse Arbeiten'!B78","v":0},{"$f":"'diverse Arbeiten'!C78","v":0},{"$f":"'diverse Arbeiten'!D78","v":0},null,null,null,null,null,null,null,null,0,0,0,0]
[null,null,null,{"$f":"'diverse Arbeiten'!A79","v":0},{"$f":"'diverse Arbeiten'!B79","v":0},{"$f":"'diverse Arbeiten'!C79","v":0},{"$f":"'diverse Arbeiten'!D79","v":0},null,null,null,null,null,null,null,null,0,0,0,0]
[null,null,null,{"$f":"'diverse Arbeiten'!A80","v":0},{"$f":"'diverse Arbeiten'!B80","v":0},{"$f":"'diverse Arbeiten'!C80","v":0},{"$f":"'diverse Arbeiten'!D80","v":0},null,null,null,null,null,null,null,null,0,0,0,0]
[null,null,null,{"$f":"'diverse Arbeiten'!A81","v":0},{"$f":"'diverse Arbeiten'!B81","v":0},{"$f":"'diverse Arbeiten'!C81","v":0},{"$f":"'diverse Arbeiten'!D81","v":0},null,null,null,null,null,null,null,null,0,0,0,0]
[null,null,null,{"$f":"'diverse Arbeiten'!A82","v":0},{"$f":"'diverse Arbeiten'!B82","v":0},{"$f":"'diverse Arbeiten'!C82","v":0},{"$f":"'diverse Arbeiten'!D82","v":0},null,null,null,null,null,null,null,null,0,0,0,0]
[null,null,null,{"$f":"'diverse Arbeiten'!A83","v":0},{"$f":"'diverse Arbeiten'!B83","v":0},{"$f":"'diverse Arbeiten'!C83","v":0},{"$f":"'diverse Arbeiten'!D83","v":0},null,null,null,null,null,null,null,null,0,0,0,0]
[null,null,null,{"$f":"'diverse Arbeiten'!A84","v":0},{"$f":"'diverse Arbeiten'!B84","v":0},{"$f":"'diverse Arbeiten'!C84","v":0},{"$f":"'diverse Arbeiten'!D84","v":0},null,null,null,null,null,null,null,null,0,0,0,0]
[null,null,null,{"$f":"'diverse Arbeiten'!A85","v":0},{"$f":"'diverse Arbeiten'!B85","v":0},{"$f":"'diverse Arbeiten'!C85","v":0},{"$f":"'diverse Arbeiten'!D85","v":0},null,null,null,null,null,null,null,null,0,0,0,0]
[null,null,null,{"$f":"'diverse Arbeiten'!A86","v":0},{"$f":"'diverse Arbeiten'!B86","v":0},{"$f":"'diverse Arbeiten'!C86","v":0},{"$f":"'diverse Arbeiten'!D86","v":0},null,null,null,null,null,null,null,null,0,0,0,0]
[null,null,null,{"$f":"'diverse Arbeiten'!A87","v":0},{"$f":"'diverse Arbeiten'!B87","v":0},{"$f":"'diverse Arbeiten'!C87","v":0},{"$f":"'diverse Arbeiten'!D87","v":0},null,null,null,null,null,null,null,null,0,0,0,0]
[null,null,null,{"$f":"'diverse Arbeiten'!A88","v":0},{"$f":"'diverse Arbeiten'!B88","v":0},{"$f":"'diverse Arbeiten'!C88","v":0},{"$f":"'diverse Arbeiten'!D88","v":0},null,null,null,null,null,null,null,null,0,0,0,0]
[null,null,null,{"$f":"'diverse Arbeiten'!A89","v":0},{"$f":"'diverse Arbeiten'!B89","v":0},{"$f":"'diverse Arbeiten'!C89","v":0},{"$f":"'diverse Arbeiten'!D89","v":0},null,null,null,null,null,null,null,null,0,0,0,0]
[null,null,null,{"$f":"'diverse Arbeiten'!A90","v":0},{"$f":"'diverse Arbeiten'!B90","v":0},{"$f":"'diverse Arbeiten'!C90","v":0},{"$f":"'diverse Arbeiten'!D90","v":0},null,null,null,null,null,null,null,null,0,0,0,0]
[null,null,null,{"$f":"'diverse Arbeiten'!A91","v":0},{"$f":"'diverse Arbeiten'!B91","v":0},{"$f":"'diverse Arbeiten'!C91","v":0},{"$f":"'diverse Arbeiten'!D91","v":0},null,null,null,null,null,null,null,null,0,0,0,0]
[null,null,null,{"$f":"'diverse Arbeiten'!A92","v":0},{"$f":"'diverse Arbeiten'!B92","v":0},{"$f":"'diverse Arbeiten'!C92","v":0},{"$f":"'diverse Arbeiten'!D92","v":0},null,null,null,null,null,null,null,null,0,0,0,0]
[null,null,null,{"$f":"'diverse Arbeiten'!A93","v":0},{"$f":"'diverse Arbeiten'!B93","v":0},{"$f":"'diverse Arbeiten'!C93","v":0},{"$f":"'diverse Arbeiten'!D93","v":0},null,null,null,null,null,null,null,null,0,0,0,0]
[null,null,null,{"$f":"'diverse Arbeiten'!A94","v":0},{"$f":"'diverse Arbeiten'!B94","v":0},{"$f":"'diverse Arbeiten'!C94","v":0},{"$f":"'diverse Arbeiten'!D94","v":0},null,null,null,null,null,null,null,null,0,0,0,0]
[null,null,null,{"$f":"'diverse Arbeiten'!A95","v":0},{"$f":"'diverse Arbeiten'!B95","v":0},{"$f":"'diverse Arbeiten'!C95","v":0},{"$f":"'diverse Arbeiten'!D95","v":0},null,null,null,null,null,null,null,null,0,0,0,0]
[null,null,null,{"$f":"'diverse Arbeiten'!A96","v":0},{"$f":"'diverse Arbeiten'!B96","v":0},{"$f":"'diverse Arbeiten'!C96","v":0},{"$f":"'diverse Arbeiten'!D96","v":0},null,null,null,null,null,null,null,null,0,0,0,0]
[null,null,null,{"$f":"'diverse Arbeiten'!A97","v":0},{"$f":"'diverse Arbeiten'!B97","v":0},{"$f":"'diverse Arbeiten'!C97","v":0},{"$f":"'diverse Arbeiten'!D97","v":0},null,null,null,null,null,null,null,null,0,0,0,0]
[null,null,null,{"$f":"'diverse Arbeiten'!A98","v":0},{"$f":"'diverse Arbeiten'!B98","v":0},{"$f":"'diverse Arbeiten'!C98","v":0},{"$f":"'diverse Arbeiten'!D98","v":0},null,null,null,null,null,null,null,null,0,0,0,0]
[null,null,null,{"$f":"'diverse Arbeiten'!A99","v":0},{"$f":"'diverse Arbeiten'!B99","v":0},{"$f":"'diverse Arbeiten'!C99","v":0},{"$f":"'diverse Arbeiten'!D99","v":0},null,null,null,null,null,null,null,null,0,0,0,0]
[null,null,null,{"$f":"'diverse Arbeiten'!A100","v":0},{"$f":"'diverse Arbeiten'!B100","v":0},{"$f":"'diverse Arbeiten'!C100","v":0},{"$f":"'diverse Arbeiten'!D100","v":0},null,null,null,null,null,null,null,null,0,0,0,0]
[null,null,null,{"$f":"'diverse Arbeiten'!A101","v":0},{"$f":"'diverse Arbeiten'!B101","v":0},{"$f":"'diverse Arbeiten'!C101","v":0},{"$f":"'diverse Arbeiten'!D101","v":0},null,null,null,null,null,null,null,null,0,0,0,0]
[null,null,null,{"$f":"'diverse Arbeiten'!A102","v":0},{"$f":"'diverse Arbeiten'!B102","v":0},{"$f":"'diverse Arbeiten'!C102","v":0},{"$f":"'diverse Arbeiten'!D102","v":0},null,null,null,null,null,null,null,null,0,0,0,0]
[null,null,null,{"$f":"'diverse Arbeiten'!A103","v":0},{"$f":"'diverse Arbeiten'!B103","v":0},{"$f":"'diverse Arbeiten'!C103","v":0},{"$f":"'diverse Arbeiten'!D103","v":0},null,null,null,null,null,null,null,null,0,0,0,0]
[null,null,null,{"$f":"'diverse Arbeiten'!A104","v":0},{"$f":"'diverse Arbeiten'!B104","v":0},{"$f":"'diverse Arbeiten'!C104","v":0},{"$f":"'diverse Arbeiten'!D104","v":0},null,null,null,null,null,null,null,null,0,0,0,0]
[]
[]
[null,null,null,"TGM Standartgewinde",null,null,null,null,null,null,null,null,null,null,null,"TGM Standartgewinde"]
[]
[null,null,null,{"$f":"'TGM Standardgewinde'!A3","v":0},{"$f":"'TGM Standardgewinde'!B3","v":0},{"$f":"'TGM Standardgewinde'!C3","v":0},{"$f":"'TGM Standardgewinde'!D3","v":0},null,null,null,null,null,null,null,null,0,"M3",0,1.5]
[null,null,null,{"$f":"'TGM Standardgewinde'!A4","v":0},{"$f":"'TGM Standardgewinde'!B4","v":"M4"},{"$f":"'TGM Standardgewinde'!C4","v":0},{"$f":"'TGM Standardgewinde'!D4","v":1.7},null,null,null,null,null,null,null,null,0,"M4",0,1.7]
[null,null,null,{"$f":"'TGM Standardgewinde'!A5","v":0},{"$f":"'TGM Standardgewinde'!B5","v":"M5"},{"$f":"'TGM Standardgewinde'!C5","v":0},{"$f":"'TGM Standardgewinde'!D5","v":2},null,null,null,null,null,null,null,null,0,"M5",0,2]
[null,null,null,{"$f":"'TGM Standardgewinde'!A6","v":0},{"$f":"'TGM Standardgewinde'!B6","v":"M6"},{"$f":"'TGM Standardgewinde'!C6","v":0},{"$f":"'TGM Standardgewinde'!D6","v":2.5},null,null,null,null,null,null,null,null,0,"M6",0,2.5]
[null,null,null,{"$f":"'TGM Standardgewinde'!A7","v":0},{"$f":"'TGM Standardgewinde'!B7","v":"M8"},{"$f":"'TGM Standardgewinde'!C7","v":0},{"$f":"'TGM Standardgewinde'!D7","v":3},null,null,null,null,null,null,null,null,0,"M8",0,3]
[null,null,null,{"$f":"'TGM Standardgewinde'!A8","v":0},{"$f":"'TGM Standardgewinde'!B8","v":"M10"},{"$f":"'TGM Standardgewinde'!C8","v":0},{"$f":"'TGM Standardgewinde'!D8","v":3.5},null,null,null,null,null,null,null,null,0,"M10",0,3.5]
[null,null,null,{"$f":"'TGM Standardgewinde'!A9","v":0},{"$f":"'TGM Standardgewinde'!B9","v":"M12"},{"$f":"'TGM Standardgewinde'!C9","v":0},{"$f":"'TGM Standardgewinde'!D9","v":3.7},null,null,null,null,null,null,null,null,0,"M12",0,3.7]
[null,null,null,{"$f":"'TGM Standardgewinde'!A10","v":0},{"$f":"'TGM Standardgewinde'!B10","v":"M14"},{"$f":"'TGM Standardgewinde'!C10","v":0},{"$f":"'TGM Standardgewinde'!D10","v":4},null,null,null,null,null,null,null,null,0,"M14",0,4]
[null,null,null,{"$f":"'TGM Standardgewinde'!A11","v":0},{"$f":"'TGM Standardgewinde'!B11","v":"M16"},{"$f":"'TGM Standardgewinde'!C11","v":0},{"$f":"'TGM Standardgewinde'!D11","v":4.2},null,null,null,null,null,null,null,null,"AG1 4xM16 Transportgewinde","M16",4,4.2]
[null,null,null,{"$f":"'TGM Standardgewinde'!A12","v":0},{"$f":"'TGM Standardgewinde'!B12","v":"M18"},{"$f":"'TGM Standardgewinde'!C12","v":0},{"$f":"'TGM Standardgewinde'!D12","v":4.5},null,null,null,null,null,null,null,null,0,"M18",0,4.5]
[null,null,null,{"$f":"'TGM Standardgewinde'!A13","v":0},{"$f":"'TGM Standardgewinde'!B13","v":"M20"},{"$f":"'TGM Standardgewinde'!C13","v":0},{"$f":"'TGM Standardgewinde'!D13","v":4.7},null,null,null,null,null,null,null,null,0,"M20",0,4.7]
[null,null,null,{"$f":"'TGM Standardgewinde'!A14","v":0},{"$f":"'TGM Standardgewinde'!B14","v":"M22"},{"$f":"'TGM Standardgewinde'!C14","v":0},{"$f":"'TGM Standardgewinde'!D14","v":5},null,null,null,null,null,null,null,null,0,"M22",0,5]
[null,null,null,{"$f":"'TGM Standardgewinde'!A15","v":0},{"$f":"'TGM Standardgewinde'!B15","v":"M24"},{"$f":"'TGM Standardgewinde'!C15","v":0},{"$f":"'TGM Standardgewinde'!D15","v":5.5},null,null,null,null,null,null,null,null,0,"M24",0,5.5]
[null,null,null,{"$f":"'TGM Standardgewinde'!A16","v":0},{"$f":"'TGM Standardgewinde'!B16","v":"G1/8\""},{"$f":"'TGM Standardgewinde'!C16","v":0},{"$f":"'TGM Standardgewinde'!D16","v":2},null,null,null,null,null,null,null,null,0,"G1/8\"",0,2]
[null,null,null,{"$f":"'TGM Standardgewinde'!A17","v":0},{"$f":"'TGM Standardgewinde'!B17","v":"G1/4\""},{"$f":"'TGM Standardgewinde'!C17","v":0},{"$f":"'TGM Standardgewinde'!D17","v":3},null,null,null,null,null,null,null,null,0,"G1/4\"",0,3]
[null,null,null,{"$f":"'TGM Standardgewinde'!A18","v":0},{"$f":"'TGM Standardgewinde'!B18","v":"G1/2\""},{"$f":"'TGM Standardgewinde'!C18","v":0},{"$f":"'TGM Standardgewinde'!D18","v":3.5},null,null,null,null,null,null,null,null,0,"G1/2\"",0,3.5]
[null,null,null,{"$f":"'TGM Standardgewinde'!A19","v":0},{"$f":"'TGM Standardgewinde'!B19","v":"G3/4\""},{"$f":"'TGM Standardgewinde'!C19","v":0},{"$f":"'TGM Standardgewinde'!D19","v":4},null,null,null,null,null,null,null,null,0,"G3/4\"",0,4]
[null,null,null,{"$f":"'TGM Standardgewinde'!A20","v":0},{"$f":"'TGM Standardgewinde'!B20","v":"G1"},{"$f":"'TGM Standardgewinde'!C20","v":0},{"$f":"'TGM Standardgewinde'!D20","v":5},null,null,null,null,null,null,null,null,0,"G1",0,5]
[null,null,null,{"$f":"'TGM Standardgewinde'!A21","v":0},{"$f":"'TGM Standardgewinde'!B21","v":0},{"$f":"'TGM Standardgewinde'!C21","v":0},{"$f":"'TGM Standardgewinde'!D21","v":0},null,null,null,null,null,null,null,null,0,0,0,0]
[null,null,null,{"$f":"'TGM Standardgewinde'!A22","v":0},{"$f":"'TGM Standardgewinde'!B22","v":0},{"$f":"'TGM Standardgewinde'!C22","v":0},{"$f":"'TGM Standardgewinde'!D22","v":0},null,null,null,null,null,null,null,null,0,0,0,0]
[null,null,null,{"$f":"'TGM Standardgewinde'!A23","v":0},{"$f":"'TGM Standardgewinde'!B23","v":0},{"$f":"'TGM Standardgewinde'!C23","v":0},{"$f":"'TGM Standardgewinde'!D23","v":0},null,null,null,null,null,null,null,null,0,0,0,0]
[null,null,null,{"$f":"'TGM Standardgewinde'!A24","v":0},{"$f":"'TGM Standardgewinde'!B24","v":0},{"$f":"'TGM Standardgewinde'!C24","v":0},{"$f":"'TGM Standardgewinde'!D24","v":0},null,null,null,null,null,null,null,null,0,0,0,0]
[null,null,null,{"$f":"'TGM Standardgewinde'!A25","v":0},{"$f":"'TGM Standardgewinde'!B25","v":0},{"$f":"'TGM Standardgewinde'!C25","v":0},{"$f":"'TGM Standardgewinde'!D25","v":0},null,null,null,null,null,null,null,null,0,0,0,0]
[null,null,null,{"$f":"'TGM Standardgewinde'!A26","v":0},{"$f":"'TGM Standardgewinde'!B26","v":0},{"$f":"'TGM Standardgewinde'!C26","v":0},{"$f":"'TGM Standardgewinde'!D26","v":0},null,null,null,null,null,null,null,null,0,0,0,0]
[null,null,null,{"$f":"'TGM Standardgewinde'!A27","v":0},{"$f":"'TGM Standardgewinde'!B27","v":0},{"$f":"'TGM Standardgewinde'!C27","v":0},{"$f":"'TGM Standardgewinde'!D27","v":0},null,null,null,null,null,null,null,null,0,0,0,0]
[null,null,null,{"$f":"'TGM Standardgewinde'!A28","v":0},{"$f":"'TGM Standardgewinde'!B28","v":0},{"$f":"'TGM Standardgewinde'!C28","v":0},{"$f":"'TGM Standardgewinde'!D28","v":0},null,null,null,null,null,null,null,null,0,0,0,0]
[null,null,null,{"$f":"'TGM Standardgewinde'!A29","v":0},{"$f":"'TGM Standardgewinde'!B29","v":0},{"$f":"'TGM Standardgewinde'!C29","v":0},{"$f":"'TGM Standardgewinde'!D29","v":0},null,null,null,null,null,null,null,null,0,0,0,0]
[null,null,null,{"$f":"'TGM Standardgewinde'!A30","v":0},{"$f":"'TGM Standardgewinde'!B30","v":0},{"$f":"'TGM Standardgewinde'!C30","v":0},{"$f":"'TGM Standardgewinde'!D30","v":0},null,null,null,null,null,null,null,null,0,0,0,0]
[null,null,null,{"$f":"'TGM Standardgewinde'!A31","v":0},{"$f":"'TGM Standardgewinde'!B31","v":0},{"$f":"'TGM Standardgewinde'!C31","v":0},{"$f":"'TGM Standardgewinde'!D31","v":0},null,null,null,null,null,null,null,null,0,0,0,0]
[null,null,null,{"$f":"'TGM Standardgewinde'!A32","v":0},{"$f":"'TGM Standardgewinde'!B32","v":0},{"$f":"'TGM Standardgewinde'!C32","v":0},{"$f":"'TGM Standardgewinde'!D32","v":0},null,null,null,null,null,null,null,null,0,0,0,0]
[null,null,null,{"$f":"'TGM Standardgewinde'!A33","v":0},{"$f":"'TGM Standardgewinde'!B33","v":0},{"$f":"'TGM Standardgewinde'!C33","v":0},{"$f":"'TGM Standardgewinde'!D33","v":0},null,null,null,null,null,null,null,null,0,0,0,0]
[null,null,null,{"$f":"'TGM Standardgewinde'!A34","v":0},{"$f":"'TGM Standardgewinde'!B34","v":0},{"$f":"'TGM Standardgewinde'!C34","v":0},{"$f":"'TGM Standardgewinde'!D34","v":0},null,null,null,null,null,null,null,null,0,0,0,0]
[null,null,null,{"$f":"'TGM Standardgewinde'!A35","v":0},{"$f":"'TGM Standardgewinde'!B35","v":0},{"$f":"'TGM Standardgewinde'!C35","v":0},{"$f":"'TGM Standardgewinde'!D35","v":0},null,null,null,null,null,null,null,null,0,0,0,0]
[null,null,null,{"$f":"'TGM Standardgewinde'!A36","v":0},{"$f":"'TGM Standardgewinde'!B36","v":0},{"$f":"'TGM Standardgewinde'!C36","v":0},{"$f":"'TGM Standardgewinde'!D36","v":0},null,null,null,null,null,null,null,null,0,0,0,0]
[null,null,null,{"$f":"'TGM Standardgewinde'!A37","v":0},{"$f":"'TGM Standardgewinde'!B37","v":0},{"$f":"'TGM Standardgewinde'!C37","v":0},{"$f":"'TGM Standardgewinde'!D37","v":0},null,null,null,null,null,null,null,null,0,0,0,0]
[null,null,null,{"$f":"'TGM Standardgewinde'!A38","v":0},{"$f":"'TGM Standardgewinde'!B38","v":0},{"$f":"'TGM Standardgewinde'!C38","v":0},{"$f":"'TGM Standardgewinde'!D38","v":0},null,null,null,null,null,null,null,null,0,0,0,0]
[null,null,null,{"$f":"'TGM Standardgewinde'!A39","v":0},{"$f":"'TGM Standardgewinde'!B39","v":0},{"$f":"'TGM Standardgewinde'!C39","v":0},{"$f":"'TGM Standardgewinde'!D39","v":0},null,null,null,null,null,null,null,null,0,0,0,0]
[null,null,null,{"$f":"'TGM Standardgewinde'!A40","v":0},{"$f":"'TGM Standardgewinde'!B40","v":0},{"$f":"'TGM Standardgewinde'!C40","v":0},{"$f":"'TGM Standardgewinde'!D40","v":0},null,null,null,null,null,null,null,null,0,0,0,0]
[null,null,null,{"$f":"'TGM Standardgewinde'!A41","v":0},{"$f":"'TGM Standardgewinde'!B41","v":0},{"$f":"'TGM Standardgewinde'!C41","v":0},{"$f":"'TGM Standardgewinde'!D41","v":0},null,null,null,null,null,null,null,null,0,0,0,0]
[null,null,null,{"$f":"'TGM Standardgewinde'!A42","v":0},{"$f":"'TGM Standardgewinde'!B42","v":0},{"$f":"'TGM Standardgewinde'!C42","v":0},{"$f":"'TGM Standardgewinde'!D42","v":0},null,null,null,null,null,null,null,null,0,0,0,0]
[null,null,null,{"$f":"'TGM Standardgewinde'!A43","v":0},{"$f":"'TGM Standardgewinde'!B43","v":0},{"$f":"'TGM Standardgewinde'!C43","v":0},{"$f":"'TGM Standardgewinde'!D43","v":0},null,null,null,null,null,null,null,null,0,0,0,0]
[null,null,null,{"$f":"'TGM Standardgewinde'!A44","v":0},{"$f":"'TGM Standardgewinde'!B44","v":0},{"$f":"'TGM Standardgewinde'!C44","v":0},{"$f":"'TGM Standardgewinde'!D44","v":0},null,null,null,null,null,null,null,null,0,0,0,0]
[null,null,null,{"$f":"'TGM Standardgewinde'!A45","v":0},{"$f":"'TGM Standardgewinde'!B45","v":0},{"$f":"'TGM Standardgewinde'!C45","v":0},{"$f":"'TGM Standardgewinde'!D45","v":0},null,null,null,null,null,null,null,null,0,0,0,0]
[null,null,null,{"$f":"'TGM Standardgewinde'!A46","v":0},{"$f":"'TGM Standardgewinde'!B46","v":0},{"$f":"'TGM Standardgewinde'!C46","v":0},{"$f":"'TGM Standardgewinde'!D46","v":0},null,null,null,null,null,null,null,null,0,0,0,0]
[null,null,null,{"$f":"'TGM Standardgewinde'!A47","v":0},{"$f":"'TGM Standardgewinde'!B47","v":0},{"$f":"'TGM Standardgewinde'!C47","v":0},{"$f":"'TGM Standardgewinde'!D47","v":0},null,null,null,null,null,null,null,null,0,0,0,0]
[null,null,null,{"$f":"'TGM Standardgewinde'!A48","v":0},{"$f":"'TGM Standardgewinde'!B48","v":0},{"$f":"'TGM Standardgewinde'!C48","v":0},{"$f":"'TGM Standardgewinde'!D48","v":0},null,null,null,null,null,null,null,null,0,0,0,0]
[null,null,null,{"$f":"'TGM Standardgewinde'!A49","v":0},{"$f":"'TGM Standardgewinde'!B49","v":0},{"$f":"'TGM Standardgewinde'!C49","v":0},{"$f":"'TGM Standardgewinde'!D49","v":0},null,null,null,null,null,null,null,null,0,0,0,0]
[null,null,null,{"$f":"'TGM Standardgewinde'!A50","v":0},{"$f":"'TGM Standardgewinde'!B50","v":0},{"$f":"'TGM Standardgewinde'!C50","v":0},{"$f":"'TGM Standardgewinde'!D50","v":0},null,null,null,null,null,null,null,null,0,0,0,0]
[null,null,null,{"$f":"'TGM Standardgewinde'!A51","v":0},{"$f":"'TGM Standardgewinde'!B51","v":0},{"$f":"'TGM Standardgewinde'!C51","v":0},{"$f":"'TGM Standardgewinde'!D51","v":0},null,null,null,null,null,null,null,null,0,0,0,0]
[null,null,null,{"$f":"'TGM Standardgewinde'!A52","v":0},{"$f":"'TGM Standardgewinde'!B52","v":0},{"$f":"'TGM Standardgewinde'!C52","v":0},{"$f":"'TGM Standardgewinde'!D52","v":0},null,null,null,null,null,null,null,null,0,0,0,0]
[]
[]
[null,null,null,"TGM Bohren",null,null,null,null,null,null,null,null,null,null,null,"TGM Bohren"]
[]
[null,null,null,{"$f":"'TGM Bohren'!A4","v":0},{"$f":"'TGM Bohren'!B4","v":0},{"$f":"'TGM Bohren'!C4","v":0},{"$f":"'TGM Bohren'!D4","v":0},{"$f":"'TGM Bohren'!E4","v":0},{"$f":"'TGM Bohren'!F4","v":0},null,null,null,null,null,null,0,0,0,0,0,0]
[null,null,null,{"$f":"'TGM Bohren'!A5","v":0},{"$f":"'TGM Bohren'!B5","v":0},{"$f":"'TGM Bohren'!C5","v":0},{"$f":"'TGM Bohren'!D5","v":0},{"$f":"'TGM Bohren'!E5","v":0},{"$f":"'TGM Bohren'!F5","v":0},null,null,null,null,null,null,0,0,0,0,0,0]
[null,null,null,{"$f":"'TGM Bohren'!A6","v":0},{"$f":"'TGM Bohren'!B6","v":0},{"$f":"'TGM Bohren'!C6","v":0},{"$f":"'TGM Bohren'!D6","v":0},{"$f":"'TGM Bohren'!E6","v":0},{"$f":"'TGM Bohren'!F6","v":0},null,null,null,null,null,null,0,0,0,0,0,0]
[null,null,null,{"$f":"'TGM Bohren'!A7","v":0},{"$f":"'TGM Bohren'!B7","v":0},{"$f":"'TGM Bohren'!C7","v":0},{"$f":"'TGM Bohren'!D7","v":0},{"$f":"'TGM Bohren'!E7","v":0},{"$f":"'TGM Bohren'!F7","v":0},null,null,null,null,null,null,0,0,0,0,0,0]
[null,null,null,{"$f":"'TGM Bohren'!A8","v":0},{"$f":"'TGM Bohren'!B8","v":0},{"$f":"'TGM Bohren'!C8","v":0},{"$f":"'TGM Bohren'!D8","v":0},{"$f":"'TGM Bohren'!E8","v":0},{"$f":"'TGM Bohren'!F8","v":0},null,null,null,null,null,null,0,0,0,0,0,0]
[null,null,null,{"$f":"'TGM Bohren'!A9","v":0},{"$f":"'TGM Bohren'!B9","v":0},{"$f":"'TGM Bohren'!C9","v":0},{"$f":"'TGM Bohren'!D9","v":0},{"$f":"'TGM Bohren'!E9","v":0},{"$f":"'TGM Bohren'!F9","v":0},null,null,null,null,null,null,0,0,0,0,0,0]
[null,null,null,{"$f":"'TGM Bohren'!A10","v":0},{"$f":"'TGM Bohren'!B10","v":0},{"$f":"'TGM Bohren'!C10","v":0},{"$f":"'TGM Bohren'!D10","v":0},{"$f":"'TGM Bohren'!E10","v":0},{"$f":"'TGM Bohren'!F10","v":0},null,null,null,null,null,null,0,0,0,0,0,0]
[null,null,null,{"$f":"'TGM Bohren'!A11","v":0},{"$f":"'TGM Bohren'!B11","v":0},{"$f":"'TGM Bohren'!C11","v":0},{"$f":"'TGM Bohren'!D11","v":0},{"$f":"'TGM Bohren'!E11","v":0},{"$f":"'TGM Bohren'!F11","v":0},null,null,null,null,null,null,0,0,0,0,0,0]
[null,null,null,{"$f":"'TGM Bohren'!A12","v":0},{"$f":"'TGM Bohren'!B12","v":0},{"$f":"'TGM Bohren'!C12","v":0},{"$f":"'TGM Bohren'!D12","v":0},{"$f":"'TGM Bohren'!E12","v":0},{"$f":"'TGM Bohren'!F12","v":0},null,null,null,null,null,null,0,0,0,0,0,0]
[null,null,null,{"$f":"'TGM Bohren'!A13","v":0},{"$f":"'TGM Bohren'!B13","v":0},{"$f":"'TGM Bohren'!C13","v":0},{"$f":"'TGM Bohren'!D13","v":0},{"$f":"'TGM Bohren'!E13","v":0},{"$f":"'TGM Bohren'!F13","v":0},null,null,null,null,null,null,0,0,0,0,0,0]
[null,null,null,{"$f":"'TGM Bohren'!A14","v":0},{"$f":"'TGM Bohren'!B14","v":0},{"$f":"'TGM Bohren'!C14","v":0},{"$f":"'TGM Bohren'!D14","v":0},{"$f":"'TGM Bohren'!E14","v":0},{"$f":"'TGM Bohren'!F14","v":0},null,null,null,null,null,null,0,0,0,0,0,0]
[null,null,null,{"$f":"'TGM Bohren'!A15","v":0},{"$f":"'TGM Bohren'!B15","v":0},{"$f":"'TGM Bohren'!C15","v":0},{"$f":"'TGM Bohren'!D15","v":0},{"$f":"'TGM Bohren'!E15","v":0},{"$f":"'TGM Bohren'!F15","v":0},null,null,null,null,null,null,0,0,0,0,0,0]
[null,null,null,{"$f":"'TGM Bohren'!A16","v":0},{"$f":"'TGM Bohren'!B16","v":0},{"$f":"'TGM Bohren'!C16","v":0},{"$f":"'TGM Bohren'!D16","v":0},{"$f":"'TGM Bohren'!E16","v":0},{"$f":"'TGM Bohren'!F16","v":0},null,null,null,null,null,null,0,0,0,0,0,0]
[null,null,null,{"$f":"'TGM Bohren'!A17","v":0},{"$f":"'TGM Bohren'!B17","v":0},{"$f":"'TGM Bohren'!C17","v":0},{"$f":"'TGM Bohren'!D17","v":0},{"$f":"'TGM Bohren'!E17","v":0},{"$f":"'TGM Bohren'!F17","v":0},null,null,null,null,null,null,0,0,0,0,0,0]
[null,null,null,{"$f":"'TGM Bohren'!A18","v":0},{"$f":"'TGM Bohren'!B18","v":0},{"$f":"'TGM Bohren'!C18","v":0},{"$f":"'TGM Bohren'!D18","v":0},{"$f":"'TGM Bohren'!E18","v":0},{"$f":"'TGM Bohren'!F18","v":0},null,null,null,null,null,null,0,0,0,0,0,0]
[null,null,null,{"$f":"'TGM Bohren'!A19","v":0},{"$f":"'TGM Bohren'!B19","v":0},{"$f":"'TGM Bohren'!C19","v":0},{"$f":"'TGM Bohren'!D19","v":0},{"$f":"'TGM Bohren'!E19","v":0},{"$f":"'TGM Bohren'!F19","v":0},null,null,null,null,null,null,0,0,0,0,0,0]
[null,null,null,{"$f":"'TGM Bohren'!A20","v":0},{"$f":"'TGM Bohren'!B20","v":0},{"$f":"'TGM Bohren'!C20","v":0},{"$f":"'TGM Bohren'!D20","v":0},{"$f":"'TGM Bohren'!E20","v":0},{"$f":"'TGM Bohren'!F20","v":0},null,null,null,null,null,null,0,0,0,0,0,0]
[null,null,null,{"$f":"'TGM Bohren'!A21","v":0},{"$f":"'TGM Bohren'!B21","v":0},{"$f":"'TGM Bohren'!C21","v":0},{"$f":"'TGM Bohren'!D21","v":0},{"$f":"'TGM Bohren'!E21","v":0},{"$f":"'TGM Bohren'!F21","v":0},null,null,null,null,null,null,0,0,0,0,0,0]
[null,null,null,{"$f":"'TGM Bohren'!A22","v":0},{"$f":"'TGM Bohren'!B22","v":0},{"$f":"'TGM Bohren'!C22","v":0},{"$f":"'TGM Bohren'!D22","v":0},{"$f":"'TGM Bohren'!E22","v":0},{"$f":"'TGM Bohren'!F22","v":0},null,null,null,null,null,null,0,0,0,0,0,0]
[null,null,null,{"$f":"'TGM Bohren'!A23","v":0},{"$f":"'TGM Bohren'!B23","v":0},{"$f":"'TGM Bohren'!C23","v":0},{"$f":"'TGM Bohren'!D23","v":0},{"$f":"'TGM Bohren'!E23","v":0},{"$f":"'TGM Bohren'!F23","v":0},null,null,null,null,null,null,0,0,0,0,0,0]
[null,null,null,{"$f":"'TGM Bohren'!A24","v":0},{"$f":"'TGM Bohren'!B24","v":0},{"$f":"'TGM Bohren'!C24","v":0},{"$f":"'TGM Bohren'!D24","v":0},{"$f":"'TGM Bohren'!E24","v":0},{"$f":"'TGM Bohren'!F24","v":0},null,null,null,null,null,null,0,0,0,0,0,0]
[null,null,null,{"$f":"'TGM Bohren'!A25","v":0},{"$f":"'TGM Bohren'!B25","v":0},{"$f":"'TGM Bohren'!C25","v":0},{"$f":"'TGM Bohren'!D25","v":0},{"$f":"'TGM Bohren'!E25","v":0},{"$f":"'TGM Bohren'!F25","v":0},null,null,null,null,null,null,0,0,0,0,0,0]
[null,null,null,{"$f":"'TGM Bohren'!A26","v":0},{"$f":"'TGM Bohren'!B26","v":0},{"$f":"'TGM Bohren'!C26","v":0},{"$f":"'TGM Bohren'!D26","v":0},{"$f":"'TGM Bohren'!E26","v":0},{"$f":"'TGM Bohren'!F26","v":0},null,null,null,null,null,null,0,0,0,0,0,0]
[]
[]
[null,null,null,"Tiefbohren mehrere Arten",null,null,null,null,null,null,null,null,null,null,null,"Tiefbohren mehrere Arten"]
[]
[null,null,null,{"$f":"' Tiefbohren mehrere Arten'!B5","v":0},{"$f":"' Tiefbohren mehrere Arten'!C5","v":0},{"$f":"' Tiefbohren mehrere Arten'!D5","v":0},{"$f":"' Tiefbohren mehrere Arten'!E5","v":0},{"$f":"' Tiefbohren mehrere Arten'!F5","v":0},{"$f":"' Tiefbohren mehrere Arten'!G5","v":0},{"$f":"' Tiefbohren mehrere Arten'!H5","v":0},{"$f":"' Tiefbohren mehrere Arten'!I5","v":0},{"$f":"' Tiefbohren mehrere Arten'!J5","v":0},null,null,null,"AG1 Kugelpfanne vorbohren",1,130,26,1000,146,1,10,1]
[null,null,null,{"$f":"' Tiefbohren mehrere Arten'!B6","v":0},{"$f":"' Tiefbohren mehrere Arten'!C6","v":0},{"$f":"' Tiefbohren mehrere Arten'!D6","v":0},{"$f":"' Tiefbohren mehrere Arten'!E6","v":0},{"$f":"' Tiefbohren mehrere Arten'!F6","v":0},{"$f":"' Tiefbohren mehrere Arten'!G6","v":0},{"$f":"' Tiefbohren mehrere Arten'!H6","v":0},{"$f":"' Tiefbohren mehrere Arten'!I6","v":0},{"$f":"' Tiefbohren mehrere Arten'!J6","v":0},null,null,null,0,0,0,0,0,0,0,0,0]
[null,null,null,{"$f":"' Tiefbohren mehrere Arten'!B7","v":0},{"$f":"' Tiefbohren mehrere Arten'!C7","v":0},{"$f":"' Tiefbohren mehrere Arten'!D7","v":0},{"$f":"' Tiefbohren mehrere Arten'!E7","v":0},{"$f":"' Tiefbohren mehrere Arten'!F7","v":0},{"$f":"' Tiefbohren mehrere Arten'!G7","v":0},{"$f":"' Tiefbohren mehrere Arten'!H7","v":0},{"$f":"' Tiefbohren mehrere Arten'!I7","v":0},{"$f":"' Tiefbohren mehrere Arten'!J7","v":0},null,null,null,0,0,0,0,0,0,0,0,0]
[null,null,null,{"$f":"' Tiefbohren mehrere Arten'!B8","v":0},{"$f":"' Tiefbohren mehrere Arten'!C8","v":0},{"$f":"' Tiefbohren mehrere Arten'!D8","v":0},{"$f":"' Tiefbohren mehrere Arten'!E8","v":0},{"$f":"' Tiefbohren mehrere Arten'!F8","v":0},{"$f":"' Tiefbohren mehrere Arten'!G8","v":0},{"$f":"' Tiefbohren mehrere Arten'!H8","v":0},{"$f":"' Tiefbohren mehrere Arten'!I8","v":0},{"$f":"' Tiefbohren mehrere Arten'!J8","v":0},null,null,null,0,0,0,0,0,0,0,0,0]
[null,null,null,{"$f":"' Tiefbohren mehrere Arten'!B9","v":0},{"$f":"' Tiefbohren mehrere Arten'!C9","v":0},{"$f":"' Tiefbohren mehrere Arten'!D9","v":0},{"$f":"' Tiefbohren mehrere Arten'!E9","v":0},{"$f":"' Tiefbohren mehrere Arten'!F9","v":0},{"$f":"' Tiefbohren mehrere Arten'!G9","v":0},{"$f":"' Tiefbohren mehrere Arten'!H9","v":0},{"$f":"' Tiefbohren mehrere Arten'!I9","v":0},{"$f":"' Tiefbohren mehrere Arten'!J9","v":0},null,null,null,0,0,0,0,0,0,0,0,0]
[null,null,null,{"$f":"' Tiefbohren mehrere Arten'!B10","v":0},{"$f":"' Tiefbohren mehrere Arten'!C10","v":0},{"$f":"' Tiefbohren mehrere Arten'!D10","v":0},{"$f":"' Tiefbohren mehrere Arten'!E10","v":0},{"$f":"' Tiefbohren mehrere Arten'!F10","v":0},{"$f":"' Tiefbohren mehrere Arten'!G10","v":0},{"$f":"' Tiefbohren mehrere Arten'!H10","v":0},{"$f":"' Tiefbohren mehrere Arten'!I10","v":0},{"$f":"' Tiefbohren mehrere Arten'!J10","v":0},null,null,null,0,0,0,0,0,0,0,0,0]
[null,null,null,{"$f":"' Tiefbohren mehrere Arten'!B11","v":0},{"$f":"' Tiefbohren mehrere Arten'!C11","v":0},{"$f":"' Tiefbohren mehrere Arten'!D11","v":0},{"$f":"' Tiefbohren mehrere Arten'!E11","v":0},{"$f":"' Tiefbohren mehrere Arten'!F11","v":0},{"$f":"' Tiefbohren mehrere Arten'!G11","v":0},{"$f":"' Tiefbohren mehrere Arten'!H11","v":0},{"$f":"' Tiefbohren mehrere Arten'!I11","v":0},{"$f":"' Tiefbohren mehrere Arten'!J11","v":0},null,null,null,0,0,0,0,0,0,0,0,0]
[null,null,null,{"$f":"' Tiefbohren mehrere Arten'!B12","v":0},{"$f":"' Tiefbohren mehrere Arten'!C12","v":0},{"$f":"' Tiefbohren mehrere Arten'!D12","v":0},{"$f":"' Tiefbohren mehrere Arten'!E12","v":0},{"$f":"' Tiefbohren mehrere Arten'!F12","v":0},{"$f":"' Tiefbohren mehrere Arten'!G12","v":0},{"$f":"' Tiefbohren mehrere Arten'!H12","v":0},{"$f":"' Tiefbohren mehrere Arten'!I12","v":0},{"$f":"' Tiefbohren mehrere Arten'!J12","v":0},null,null,null,0,0,0,0,0,0,0,0,0]
[null,null,null,{"$f":"' Tiefbohren mehrere Arten'!B13","v":0},{"$f":"' Tiefbohren mehrere Arten'!C13","v":0},{"$f":"' Tiefbohren mehrere Arten'!D13","v":0},{"$f":"' Tiefbohren mehrere Arten'!E13","v":0},{"$f":"' Tiefbohren mehrere Arten'!F13","v":0},{"$f":"' Tiefbohren mehrere Arten'!G13","v":0},{"$f":"' Tiefbohren mehrere Arten'!H13","v":0},{"$f":"' Tiefbohren mehrere Arten'!I13","v":0},{"$f":"' Tiefbohren mehrere Arten'!J13","v":0},null,null,null,0,0,0,0,0,0,0,0,0]
[null,null,null,{"$f":"' Tiefbohren mehrere Arten'!B14","v":0},{"$f":"' Tiefbohren mehrere Arten'!C14","v":0},{"$f":"' Tiefbohren mehrere Arten'!D14","v":0},{"$f":"' Tiefbohren mehrere Arten'!E14","v":0},{"$f":"' Tiefbohren mehrere Arten'!F14","v":0},{"$f":"' Tiefbohren mehrere Arten'!G14","v":0},{"$f":"' Tiefbohren mehrere Arten'!H14","v":0},{"$f":"' Tiefbohren mehrere Arten'!I14","v":0},{"$f":"' Tiefbohren mehrere Arten'!J14","v":0},null,null,null,0,0,0,0,0,0,0,0,0]
[null,null,null,{"$f":"' Tiefbohren mehrere Arten'!B15","v":0},{"$f":"' Tiefbohren mehrere Arten'!C15","v":0},{"$f":"' Tiefbohren mehrere Arten'!D15","v":0},{"$f":"' Tiefbohren mehrere Arten'!E15","v":0},{"$f":"' Tiefbohren mehrere Arten'!F15","v":0},{"$f":"' Tiefbohren mehrere Arten'!G15","v":0},{"$f":"' Tiefbohren mehrere Arten'!H15","v":0},{"$f":"' Tiefbohren mehrere Arten'!I15","v":0},{"$f":"' Tiefbohren mehrere Arten'!J15","v":0},null,null,null,0,0,0,0,0,0,0,0,0]
[null,null,null,{"$f":"' Tiefbohren mehrere Arten'!B16","v":0},{"$f":"' Tiefbohren mehrere Arten'!C16","v":0},{"$f":"' Tiefbohren mehrere Arten'!D16","v":0},{"$f":"' Tiefbohren mehrere Arten'!E16","v":0},{"$f":"' Tiefbohren mehrere Arten'!F16","v":0},{"$f":"' Tiefbohren mehrere Arten'!G16","v":0},{"$f":"' Tiefbohren mehrere Arten'!H16","v":0},{"$f":"' Tiefbohren mehrere Arten'!I16","v":0},{"$f":"' Tiefbohren mehrere Arten'!J16","v":0},null,null,null,0,0,0,0,0,0,0,0,0]
[null,null,null,{"$f":"' Tiefbohren mehrere Arten'!B17","v":0},{"$f":"' Tiefbohren mehrere Arten'!C17","v":0},{"$f":"' Tiefbohren mehrere Arten'!D17","v":0},{"$f":"' Tiefbohren mehrere Arten'!E17","v":0},{"$f":"' Tiefbohren mehrere Arten'!F17","v":0},{"$f":"' Tiefbohren mehrere Arten'!G17","v":0},{"$f":"' Tiefbohren mehrere Arten'!H17","v":0},{"$f":"' Tiefbohren mehrere Arten'!I17","v":0},{"$f":"' Tiefbohren mehrere Arten'!J17","v":0},null,null,null,0,0,0,0,0,0,0,0,0]
[null,null,null,{"$f":"' Tiefbohren mehrere Arten'!B18","v":0},{"$f":"' Tiefbohren mehrere Arten'!C18","v":0},{"$f":"' Tiefbohren mehrere Arten'!D18","v":0},{"$f":"' Tiefbohren mehrere Arten'!E18","v":0},{"$f":"' Tiefbohren mehrere Arten'!F18","v":0},{"$f":"' Tiefbohren mehrere Arten'!G18","v":0},{"$f":"' Tiefbohren mehrere Arten'!H18","v":0},{"$f":"' Tiefbohren mehrere Arten'!I18","v":0},{"$f":"' Tiefbohren mehrere Arten'!J18","v":0},null,null,null,0,0,0,0,0,0,0,0,0]
[null,null,null,{"$f":"' Tiefbohren mehrere Arten'!B19","v":0},{"$f":"' Tiefbohren mehrere Arten'!C19","v":0},{"$f":"' Tiefbohren mehrere Arten'!D19","v":0},{"$f":"' Tiefbohren mehrere Arten'!E19","v":0},{"$f":"' Tiefbohren mehrere Arten'!F19","v":0},{"$f":"' Tiefbohren mehrere Arten'!G19","v":0},{"$f":"' Tiefbohren mehrere Arten'!H19","v":0},{"$f":"' Tiefbohren mehrere Arten'!I19","v":0},{"$f":"' Tiefbohren mehrere Arten'!J19","v":0},null,null,null,0,0,0,0,0,0,0,0,0]
[null,null,null,{"$f":"' Tiefbohren mehrere Arten'!B20","v":0},{"$f":"' Tiefbohren mehrere Arten'!C20","v":0},{"$f":"' Tiefbohren mehrere Arten'!D20","v":0},{"$f":"' Tiefbohren mehrere Arten'!E20","v":0},{"$f":"' Tiefbohren mehrere Arten'!F20","v":0},{"$f":"' Tiefbohren mehrere Arten'!G20","v":0},{"$f":"' Tiefbohren mehrere Arten'!H20","v":0},{"$f":"' Tiefbohren mehrere Arten'!I20","v":0},{"$f":"' Tiefbohren mehrere Arten'!J20","v":0},null,null,null,0,0,0,0,0,0,0,0,0]
[null,null,null,{"$f":"' Tiefbohren mehrere Arten'!B21","v":0},{"$f":"' Tiefbohren mehrere Arten'!C21","v":0},{"$f":"' Tiefbohren mehrere Arten'!D21","v":0},{"$f":"' Tiefbohren mehrere Arten'!E21","v":0},{"$f":"' Tiefbohren mehrere Arten'!F21","v":0},{"$f":"' Tiefbohren mehrere Arten'!G21","v":0},{"$f":"' Tiefbohren mehrere Arten'!H21","v":0},{"$f":"' Tiefbohren mehrere Arten'!I21","v":0},{"$f":"' Tiefbohren mehrere Arten'!J21","v":0},null,null,null,0,0,0,0,0,0,0,0,0]
[null,null,null,{"$f":"' Tiefbohren mehrere Arten'!B22","v":0},{"$f":"' Tiefbohren mehrere Arten'!C22","v":0},{"$f":"' Tiefbohren mehrere Arten'!D22","v":0},{"$f":"' Tiefbohren mehrere Arten'!E22","v":0},{"$f":"' Tiefbohren mehrere Arten'!F22","v":0},{"$f":"' Tiefbohren mehrere Arten'!G22","v":0},{"$f":"' Tiefbohren mehrere Arten'!H22","v":0},{"$f":"' Tiefbohren mehrere Arten'!I22","v":0},{"$f":"' Tiefbohren mehrere Arten'!J22","v":0},null,null,null,0,0,0,0,0,0,0,0,0]
[null,null,null,{"$f":"' Tiefbohren mehrere Arten'!B23","v":0},{"$f":"' Tiefbohren mehrere Arten'!C23","v":0},{"$f":"' Tiefbohren mehrere Arten'!D23","v":0},{"$f":"' Tiefbohren mehrere Arten'!E23","v":0},{"$f":"' Tiefbohren mehrere Arten'!F23","v":0},{"$f":"' Tiefbohren mehrere Arten'!G23","v":0},{"$f":"' Tiefbohren mehrere Arten'!H23","v":0},{"$f":"' Tiefbohren mehrere Arten'!I23","v":0},{"$f":"' Tiefbohren mehrere Arten'!J23","v":0},null,null,null,0,0,0,0,0,0,0,0,0]
[null,null,null,{"$f":"' Tiefbohren mehrere Arten'!B24","v":0},{"$f":"' Tiefbohren mehrere Arten'!C24","v":0},{"$f":"' Tiefbohren mehrere Arten'!D24","v":0},{"$f":"' Tiefbohren mehrere Arten'!E24","v":0},{"$f":"' Tiefbohren mehrere Arten'!F24","v":0},{"$f":"' Tiefbohren mehrere Arten'!G24","v":0},{"$f":"' Tiefbohren mehrere Arten'!H24","v":0},{"$f":"' Tiefbohren mehrere Arten'!I24","v":0},{"$f":"' Tiefbohren mehrere Arten'!J24","v":0},null,null,null,0,0,0,0,0,0,0,0,0]
[null,null,null,{"$f":"' Tiefbohren mehrere Arten'!B25","v":0},{"$f":"' Tiefbohren mehrere Arten'!C25","v":0},{"$f":"' Tiefbohren mehrere Arten'!D25","v":0},{"$f":"' Tiefbohren mehrere Arten'!E25","v":0},{"$f":"' Tiefbohren mehrere Arten'!F25","v":0},{"$f":"' Tiefbohren mehrere Arten'!G25","v":0},{"$f":"' Tiefbohren mehrere Arten'!H25","v":0},{"$f":"' Tiefbohren mehrere Arten'!I25","v":0},{"$f":"' Tiefbohren mehrere Arten'!J25","v":0},null,null,null,0,0,0,0,0,0,0,0,0]
[null,null,null,{"$f":"' Tiefbohren mehrere Arten'!B26","v":0},{"$f":"' Tiefbohren mehrere Arten'!C26","v":0},{"$f":"' Tiefbohren mehrere Arten'!D26","v":0},{"$f":"' Tiefbohren mehrere Arten'!E26","v":0},{"$f":"' Tiefbohren mehrere Arten'!F26","v":0},{"$f":"' Tiefbohren mehrere Arten'!G26","v":0},{"$f":"' Tiefbohren mehrere Arten'!H26","v":0},{"$f":"' Tiefbohren mehrere Arten'!I26","v":0},{"$f":"' Tiefbohren mehrere Arten'!J26","v":0},null,null,null,0,0,0,0,0,0,0,0,0]
[null,null,null,{"$f":"' Tiefbohren mehrere Arten'!B27","v":0},{"$f":"' Tiefbohren mehrere Arten'!C27","v":0},{"$f":"' Tiefbohren mehrere Arten'!D27","v":0},{"$f":"' Tiefbohren mehrere Arten'!E27","v":0},{"$f":"' Tiefbohren mehrere Arten'!F27","v":0},{"$f":"' Tiefbohren mehrere Arten'!G27","v":0},{"$f":"' Tiefbohren mehrere Arten'!H27","v":0},{"$f":"' Tiefbohren mehrere Arten'!I27","v":0},{"$f":"' Tiefbohren mehrere Arten'!J27","v":0},null,null,null,0,0,0,0,0,0,0,0,0]
[null,null,null,{"$f":"' Tiefbohren mehrere Arten'!B28","v":0},{"$f":"' Tiefbohren mehrere Arten'!C28","v":0},{"$f":"' Tiefbohren mehrere Arten'!D28","v":0},{"$f":"' Tiefbohren mehrere Arten'!E28","v":0},{"$f":"' Tiefbohren mehrere Arten'!F28","v":0},{"$f":"' Tiefbohren mehrere Arten'!G28","v":0},{"$f":"' Tiefbohren mehrere Arten'!H28","v":0},{"$f":"' Tiefbohren mehrere Arten'!I28","v":0},{"$f":"' Tiefbohren mehrere Arten'!J28","v":0},null,null,null,0,0,0,0,0,0,0,0,0]
[null,null,null,{"$f":"' Tiefbohren mehrere Arten'!B29","v":0},{"$f":"' Tiefbohren mehrere Arten'!C29","v":0},{"$f":"' Tiefbohren mehrere Arten'!D29","v":0},{"$f":"' Tiefbohren mehrere Arten'!E29","v":0},{"$f":"' Tiefbohren mehrere Arten'!F29","v":0},{"$f":"' Tiefbohren mehrere Arten'!G29","v":0},{"$f":"' Tiefbohren mehrere Arten'!H29","v":0},{"$f":"' Tiefbohren mehrere Arten'!I29","v":0},{"$f":"' Tiefbohren mehrere Arten'!J29","v":0},null,null,null,0,0,0,0,0,0,0,0,0]
[null,null,null,{"$f":"' Tiefbohren mehrere Arten'!B30","v":0},{"$f":"' Tiefbohren mehrere Arten'!C30","v":0},{"$f":"' Tiefbohren mehrere Arten'!D30","v":0},{"$f":"' Tiefbohren mehrere Arten'!E30","v":0},{"$f":"' Tiefbohren mehrere Arten'!F30","v":0},{"$f":"' Tiefbohren mehrere Arten'!G30","v":0},{"$f":"' Tiefbohren mehrere Arten'!H30","v":0},{"$f":"' Tiefbohren mehrere Arten'!I30","v":0},{"$f":"' Tiefbohren mehrere Arten'!J30","v":0},null,null,null,0,0,0,0,0,0,0,0,0]
[null,null,null,{"$f":"' Tiefbohren mehrere Arten'!B31","v":0},{"$f":"' Tiefbohren mehrere Arten'!C31","v":0},{"$f":"' Tiefbohren mehrere Arten'!D31","v":0},{"$f":"' Tiefbohren mehrere Arten'!E31","v":0},{"$f":"' Tiefbohren mehrere Arten'!F31","v":0},{"$f":"' Tiefbohren mehrere Arten'!G31","v":0},{"$f":"' Tiefbohren mehrere Arten'!H31","v":0},{"$f":"' Tiefbohren mehrere Arten'!I31","v":0},{"$f":"' Tiefbohren mehrere Arten'!J31","v":0},null,null,null,0,0,0,0,0,0,0,0,0]
[null,null,null,{"$f":"' Tiefbohren mehrere Arten'!B32","v":0},{"$f":"' Tiefbohren mehrere Arten'!C32","v":0},{"$f":"' Tiefbohren mehrere Arten'!D32","v":0},{"$f":"' Tiefbohren mehrere Arten'!E32","v":0},{"$f":"' Tiefbohren mehrere Arten'!F32","v":0},{"$f":"' Tiefbohren mehrere Arten'!G32","v":0},{"$f":"' Tiefbohren mehrere Arten'!H32","v":0},{"$f":"' Tiefbohren mehrere Arten'!I32","v":0},{"$f":"' Tiefbohren mehrere Arten'!J32","v":0},null,null,null,0,0,0,0,0,0,0,0,0]
[null,null,null,{"$f":"' Tiefbohren mehrere Arten'!B33","v":0},{"$f":"' Tiefbohren mehrere Arten'!C33","v":0},{"$f":"' Tiefbohren mehrere Arten'!D33","v":0},{"$f":"' Tiefbohren mehrere Arten'!E33","v":0},{"$f":"' Tiefbohren mehrere Arten'!F33","v":0},{"$f":"' Tiefbohren mehrere Arten'!G33","v":0},{"$f":"' Tiefbohren mehrere Arten'!H33","v":0},{"$f":"' Tiefbohren mehrere Arten'!I33","v":0},{"$f":"' Tiefbohren mehrere Arten'!J33","v":0},null,null,null,0,0,0,0,0,0,0,0,0]
[null,null,null,{"$f":"' Tiefbohren mehrere Arten'!B34","v":0},{"$f":"' Tiefbohren mehrere Arten'!C34","v":0},{"$f":"' Tiefbohren mehrere Arten'!D34","v":0},{"$f":"' Tiefbohren mehrere Arten'!E34","v":0},{"$f":"' Tiefbohren mehrere Arten'!F34","v":0},{"$f":"' Tiefbohren mehrere Arten'!G34","v":0},{"$f":"' Tiefbohren mehrere Arten'!H34","v":0},{"$f":"' Tiefbohren mehrere Arten'!I34","v":0},{"$f":"' Tiefbohren mehrere Arten'!J34","v":0},null,null,null,0,0,0,0,0,0,0,0,0]
[null,null,null,{"$f":"' Tiefbohren mehrere Arten'!B35","v":0},{"$f":"' Tiefbohren mehrere Arten'!C35","v":0},{"$f":"' Tiefbohren mehrere Arten'!D35","v":0},{"$f":"' Tiefbohren mehrere Arten'!E35","v":0},{"$f":"' Tiefbohren mehrere Arten'!F35","v":0},{"$f":"' Tiefbohren mehrere Arten'!G35","v":0},{"$f":"' Tiefbohren mehrere Arten'!H35","v":0},{"$f":"' Tiefbohren mehrere Arten'!I35","v":0},{"$f":"' Tiefbohren mehrere Arten'!J35","v":0},null,null,null,0,0,0,0,0,0,0,0,0]
[null,null,null,{"$f":"' Tiefbohren mehrere Arten'!B36","v":0},{"$f":"' Tiefbohren mehrere Arten'!C36","v":0},{"$f":"' Tiefbohren mehrere Arten'!D36","v":0},{"$f":"' Tiefbohren mehrere Arten'!E36","v":0},{"$f":"' Tiefbohren mehrere Arten'!F36","v":0},{"$f":"' Tiefbohren mehrere Arten'!G36","v":0},{"$f":"' Tiefbohren mehrere Arten'!H36","v":0},{"$f":"' Tiefbohren mehrere Arten'!I36","v":0},{"$f":"' Tiefbohren mehrere Arten'!J36","v":0},null,null,null,0,0,0,0,0,0,0,0,0]
[null,null,null,{"$f":"' Tiefbohren mehrere Arten'!B37","v":0},{"$f":"' Tiefbohren mehrere Arten'!C37","v":0},{"$f":"' Tiefbohren mehrere Arten'!D37","v":0},{"$f":"' Tiefbohren mehrere Arten'!E37","v":0},{"$f":"' Tiefbohren mehrere Arten'!F37","v":0},{"$f":"' Tiefbohren mehrere Arten'!G37","v":0},{"$f":"' Tiefbohren mehrere Arten'!H37","v":0},{"$f":"' Tiefbohren mehrere Arten'!I37","v":0},{"$f":"' Tiefbohren mehrere Arten'!J37","v":0},null,null,null,0,0,0,0,0,0,0,0,0]
[null,null,null,{"$f":"' Tiefbohren mehrere Arten'!B38","v":0},{"$f":"' Tiefbohren mehrere Arten'!C38","v":0},{"$f":"' Tiefbohren mehrere Arten'!D38","v":0},{"$f":"' Tiefbohren mehrere Arten'!E38","v":0},{"$f":"' Tiefbohren mehrere Arten'!F38","v":0},{"$f":"' Tiefbohren mehrere Arten'!G38","v":0},{"$f":"' Tiefbohren mehrere Arten'!H38","v":0},{"$f":"' Tiefbohren mehrere Arten'!I38","v":0},{"$f":"' Tiefbohren mehrere Arten'!J38","v":0},null,null,null,0,0,0,0,0,0,0,0,0]
[null,null,null,{"$f":"' Tiefbohren mehrere Arten'!B39","v":0},{"$f":"' Tiefbohren mehrere Arten'!C39","v":0},{"$f":"' Tiefbohren mehrere Arten'!D39","v":0},{"$f":"' Tiefbohren mehrere Arten'!E39","v":0},{"$f":"' Tiefbohren mehrere Arten'!F39","v":0},{"$f":"' Tiefbohren mehrere Arten'!G39","v":0},{"$f":"' Tiefbohren mehrere Arten'!H39","v":0},{"$f":"' Tiefbohren mehrere Arten'!I39","v":0},{"$f":"' Tiefbohren mehrere Arten'!J39","v":0},null,null,null,0,0,0,0,0,0,0,0,0]
[null,null,null,{"$f":"' Tiefbohren mehrere Arten'!B40","v":0},{"$f":"' Tiefbohren mehrere Arten'!C40","v":0},{"$f":"' Tiefbohren mehrere Arten'!D40","v":0},{"$f":"' Tiefbohren mehrere Arten'!E40","v":0},{"$f":"' Tiefbohren mehrere Arten'!F40","v":0},{"$f":"' Tiefbohren mehrere Arten'!G40","v":0},{"$f":"' Tiefbohren mehrere Arten'!H40","v":0},{"$f":"' Tiefbohren mehrere Arten'!I40","v":0},{"$f":"' Tiefbohren mehrere Arten'!J40","v":0},null,null,null,0,0,0,0,0,0,0,0,0]
[null,null,null,{"$f":"' Tiefbohren mehrere Arten'!B41","v":0},{"$f":"' Tiefbohren mehrere Arten'!C41","v":0},{"$f":"' Tiefbohren mehrere Arten'!D41","v":0},{"$f":"' Tiefbohren mehrere Arten'!E41","v":0},{"$f":"' Tiefbohren mehrere Arten'!F41","v":0},{"$f":"' Tiefbohren mehrere Arten'!G41","v":0},{"$f":"' Tiefbohren mehrere Arten'!H41","v":0},{"$f":"' Tiefbohren mehrere Arten'!I41","v":0},{"$f":"' Tiefbohren mehrere Arten'!J41","v":0},null,null,null,0,0,0,0,0,0,0,0,0]
[null,null,null,{"$f":"' Tiefbohren mehrere Arten'!B42","v":0},{"$f":"' Tiefbohren mehrere Arten'!C42","v":0},{"$f":"' Tiefbohren mehrere Arten'!D42","v":0},{"$f":"' Tiefbohren mehrere Arten'!E42","v":0},{"$f":"' Tiefbohren mehrere Arten'!F42","v":0},{"$f":"' Tiefbohren mehrere Arten'!G42","v":0},{"$f":"' Tiefbohren mehrere Arten'!H42","v":0},{"$f":"' Tiefbohren mehrere Arten'!I42","v":0},{"$f":"' Tiefbohren mehrere Arten'!J42","v":0},null,null,null,0,0,0,0,0,0,0,0,0]
[null,null,null,{"$f":"' Tiefbohren mehrere Arten'!B43","v":0},{"$f":"' Tiefbohren mehrere Arten'!C43","v":0},{"$f":"' Tiefbohren mehrere Arten'!D43","v":0},{"$f":"' Tiefbohren mehrere Arten'!E43","v":0},{"$f":"' Tiefbohren mehrere Arten'!F43","v":0},{"$f":"' Tiefbohren mehrere Arten'!G43","v":0},{"$f":"' Tiefbohren mehrere Arten'!H43","v":0},{"$f":"' Tiefbohren mehrere Arten'!I43","v":0},{"$f":"' Tiefbohren mehrere Arten'!J43","v":0},null,null,null,0,0,0,0,0,0,0,0,0]
[null,null,null,{"$f":"' Tiefbohren mehrere Arten'!B44","v":0},{"$f":"' Tiefbohren mehrere Arten'!C44","v":0},{"$f":"' Tiefbohren mehrere Arten'!D44","v":0},{"$f":"' Tiefbohren mehrere Arten'!E44","v":0},{"$f":"' Tiefbohren mehrere Arten'!F44","v":0},{"$f":"' Tiefbohren mehrere Arten'!G44","v":0},{"$f":"' Tiefbohren mehrere Arten'!H44","v":0},{"$f":"' Tiefbohren mehrere Arten'!I44","v":0},{"$f":"' Tiefbohren mehrere Arten'!J44","v":0},null,null,null,0,0,0,0,0,0,0,0,0]
[]
[]
[null,null,null,"TGM Rundschleifen",null,null,null,null,null,null,null,null,null,null,null,"TGM Rundschleifen"]
[]
[null,null,null,{"$f":"'TGM Rundschleifen'!B6","v":0},{"$f":"'TGM Rundschleifen'!C6","v":0},{"$f":"'TGM Rundschleifen'!D6","v":0},{"$f":"'TGM Rundschleifen'!E6","v":0},{"$f":"'TGM Rundschleifen'!F6","v":0},{"$f":"'TGM Rundschleifen'!G6","v":0},{"$f":"'TGM Rundschleifen'!H6","v":0},{"$f":"'TGM Rundschleifen'!I6","v":0},{"$f":"'TGM Rundschleifen'!J6","v":0},{"$f":"'TGM Rundschleifen'!K6","v":0},{"$f":"'TGM Rundschleifen'!L6","v":0},null,0,0,0,0,0,0,0,0,0,0,0]
[null,null,null,{"$f":"'TGM Rundschleifen'!B7","v":0},{"$f":"'TGM Rundschleifen'!C7","v":0},{"$f":"'TGM Rundschleifen'!D7","v":0},{"$f":"'TGM Rundschleifen'!E7","v":0},{"$f":"'TGM Rundschleifen'!F7","v":0},{"$f":"'TGM Rundschleifen'!G7","v":0},{"$f":"'TGM Rundschleifen'!H7","v":0},{"$f":"'TGM Rundschleifen'!I7","v":0},{"$f":"'TGM Rundschleifen'!J7","v":0},{"$f":"'TGM Rundschleifen'!K7","v":0},{"$f":"'TGM Rundschleifen'!L7","v":0},null,0,0,0,0,0,0,0,0,0,0,0]
[null,null,null,{"$f":"'TGM Rundschleifen'!B8","v":0},{"$f":"'TGM Rundschleifen'!C8","v":0},{"$f":"'TGM Rundschleifen'!D8","v":0},{"$f":"'TGM Rundschleifen'!E8","v":0},{"$f":"'TGM Rundschleifen'!F8","v":0},{"$f":"'TGM Rundschleifen'!G8","v":0},{"$f":"'TGM Rundschleifen'!H8","v":0},{"$f":"'TGM Rundschleifen'!I8","v":0},{"$f":"'TGM Rundschleifen'!J8","v":0},{"$f":"'TGM Rundschleifen'!K8","v":0},{"$f":"'TGM Rundschleifen'!L8","v":0},null,0,0,0,0,0,0,0,0,0,0,0]
[null,null,null,{"$f":"'TGM Rundschleifen'!B9","v":0},{"$f":"'TGM Rundschleifen'!C9","v":0},{"$f":"'TGM Rundschleifen'!D9","v":0},{"$f":"'TGM Rundschleifen'!E9","v":0},{"$f":"'TGM Rundschleifen'!F9","v":0},{"$f":"'TGM Rundschleifen'!G9","v":0},{"$f":"'TGM Rundschleifen'!H9","v":0},{"$f":"'TGM Rundschleifen'!I9","v":0},{"$f":"'TGM Rundschleifen'!J9","v":0},{"$f":"'TGM Rundschleifen'!K9","v":0},{"$f":"'TGM Rundschleifen'!L9","v":0},null,0,0,0,0,0,0,0,0,0,0,0]
[null,null,null,{"$f":"'TGM Rundschleifen'!B10","v":0},{"$f":"'TGM Rundschleifen'!C10","v":0},{"$f":"'TGM Rundschleifen'!D10","v":0},{"$f":"'TGM Rundschleifen'!E10","v":0},{"$f":"'TGM Rundschleifen'!F10","v":0},{"$f":"'TGM Rundschleifen'!G10","v":0},{"$f":"'TGM Rundschleifen'!H10","v":0},{"$f":"'TGM Rundschleifen'!I10","v":0},{"$f":"'TGM Rundschleifen'!J10","v":0},{"$f":"'TGM Rundschleifen'!K10","v":0},{"$f":"'TGM Rundschleifen'!L10","v":0},null,0,0,0,0,0,0,0,0,0,0,0]
[null,null,null,{"$f":"'TGM Rundschleifen'!B11","v":0},{"$f":"'TGM Rundschleifen'!C11","v":0},{"$f":"'TGM Rundschleifen'!D11","v":0},{"$f":"'TGM Rundschleifen'!E11","v":0},{"$f":"'TGM Rundschleifen'!F11","v":0},{"$f":"'TGM Rundschleifen'!G11","v":0},{"$f":"'TGM Rundschleifen'!H11","v":0},{"$f":"'TGM Rundschleifen'!I11","v":0},{"$f":"'TGM Rundschleifen'!J11","v":0},{"$f":"'TGM Rundschleifen'!K11","v":0},{"$f":"'TGM Rundschleifen'!L11","v":0},null,0,0,0,0,0,0,0,0,0,0,0]
[null,null,null,{"$f":"'TGM Rundschleifen'!B12","v":0},{"$f":"'TGM Rundschleifen'!C12","v":0},{"$f":"'TGM Rundschleifen'!D12","v":0},{"$f":"'TGM Rundschleifen'!E12","v":0},{"$f":"'TGM Rundschleifen'!F12","v":0},{"$f":"'TGM Rundschleifen'!G12","v":0},{"$f":"'TGM Rundschleifen'!H12","v":0},{"$f":"'TGM Rundschleifen'!I12","v":0},{"$f":"'TGM Rundschleifen'!J12","v":0},{"$f":"'TGM Rundschleifen'!K12","v":0},{"$f":"'TGM Rundschleifen'!L12","v":0},null,0,0,0,0,0,0,0,0,0,0,0]
[null,null,null,{"$f":"'TGM Rundschleifen'!B13","v":0},{"$f":"'TGM Rundschleifen'!C13","v":0},{"$f":"'TGM Rundschleifen'!D13","v":0},{"$f":"'TGM Rundschleifen'!E13","v":0},{"$f":"'TGM Rundschleifen'!F13","v":0},{"$f":"'TGM Rundschleifen'!G13","v":0},{"$f":"'TGM Rundschleifen'!H13","v":0},{"$f":"'TGM Rundschleifen'!I13","v":0},{"$f":"'TGM Rundschleifen'!J13","v":0},{"$f":"'TGM Rundschleifen'!K13","v":0},{"$f":"'TGM Rundschleifen'!L13","v":0},null,0,0,0,0,0,0,0,0,0,0,0]
[null,null,null,{"$f":"'TGM Rundschleifen'!B14","v":0},{"$f":"'TGM Rundschleifen'!C14","v":0},{"$f":"'TGM Rundschleifen'!D14","v":0},{"$f":"'TGM Rundschleifen'!E14","v":0},{"$f":"'TGM Rundschleifen'!F14","v":0},{"$f":"'TGM Rundschleifen'!G14","v":0},{"$f":"'TGM Rundschleifen'!H14","v":0},{"$f":"'TGM Rundschleifen'!I14","v":0},{"$f":"'TGM Rundschleifen'!J14","v":0},{"$f":"'TGM Rundschleifen'!K14","v":0},{"$f":"'TGM Rundschleifen'!L14","v":0},null,0,0,0,0,0,0,0,0,0,0,0]
[null,null,null,{"$f":"'TGM Rundschleifen'!B15","v":0},{"$f":"'TGM Rundschleifen'!C15","v":0},{"$f":"'TGM Rundschleifen'!D15","v":0},{"$f":"'TGM Rundschleifen'!E15","v":0},{"$f":"'TGM Rundschleifen'!F15","v":0},{"$f":"'TGM Rundschleifen'!G15","v":0},{"$f":"'TGM Rundschleifen'!H15","v":0},{"$f":"'TGM Rundschleifen'!I15","v":0},{"$f":"'TGM Rundschleifen'!J15","v":0},{"$f":"'TGM Rundschleifen'!K15","v":0},{"$f":"'TGM Rundschleifen'!L15","v":0},null,0,0,0,0,0,0,0,0,0,0,0]
[null,null,null,{"$f":"'TGM Rundschleifen'!B16","v":0},{"$f":"'TGM Rundschleifen'!C16","v":0},{"$f":"'TGM Rundschleifen'!D16","v":0},{"$f":"'TGM Rundschleifen'!E16","v":0},{"$f":"'TGM Rundschleifen'!F16","v":0},{"$f":"'TGM Rundschleifen'!G16","v":0},{"$f":"'TGM Rundschleifen'!H16","v":0},{"$f":"'TGM Rundschleifen'!I16","v":0},{"$f":"'TGM Rundschleifen'!J16","v":0},{"$f":"'TGM Rundschleifen'!K16","v":0},{"$f":"'TGM Rundschleifen'!L16","v":0},null,0,0,0,0,0,0,0,0,0,0,0]
[null,null,null,{"$f":"'TGM Rundschleifen'!B17","v":0},{"$f":"'TGM Rundschleifen'!C17","v":0},{"$f":"'TGM Rundschleifen'!D17","v":0},{"$f":"'TGM Rundschleifen'!E17","v":0},{"$f":"'TGM Rundschleifen'!F17","v":0},{"$f":"'TGM Rundschleifen'!G17","v":0},{"$f":"'TGM Rundschleifen'!H17","v":0},{"$f":"'TGM Rundschleifen'!I17","v":0},{"$f":"'TGM Rundschleifen'!J17","v":0},{"$f":"'TGM Rundschleifen'!K17","v":0},{"$f":"'TGM Rundschleifen'!L17","v":0},null,0,0,0,0,0,0,0,0,0,0,0]
[null,null,null,{"$f":"'TGM Rundschleifen'!B18","v":0},{"$f":"'TGM Rundschleifen'!C18","v":0},{"$f":"'TGM Rundschleifen'!D18","v":0},{"$f":"'TGM Rundschleifen'!E18","v":0},{"$f":"'TGM Rundschleifen'!F18","v":0},{"$f":"'TGM Rundschleifen'!G18","v":0},{"$f":"'TGM Rundschleifen'!H18","v":0},{"$f":"'TGM Rundschleifen'!I18","v":0},{"$f":"'TGM Rundschleifen'!J18","v":0},{"$f":"'TGM Rundschleifen'!K18","v":0},{"$f":"'TGM Rundschleifen'!L18","v":0},null,0,0,0,0,0,0,0,0,0,0,0]
[null,null,null,{"$f":"'TGM Rundschleifen'!B19","v":0},{"$f":"'TGM Rundschleifen'!C19","v":0},{"$f":"'TGM Rundschleifen'!D19","v":0},{"$f":"'TGM Rundschleifen'!E19","v":0},{"$f":"'TGM Rundschleifen'!F19","v":0},{"$f":"'TGM Rundschleifen'!G19","v":0},{"$f":"'TGM Rundschleifen'!H19","v":0},{"$f":"'TGM Rundschleifen'!I19","v":0},{"$f":"'TGM Rundschleifen'!J19","v":0},{"$f":"'TGM Rundschleifen'!K19","v":0},{"$f":"'TGM Rundschleifen'!L19","v":0},null,0,0,0,0,0,0,0,0,0,0,0]
[null,null,null,{"$f":"'TGM Rundschleifen'!B20","v":0},{"$f":"'TGM Rundschleifen'!C20","v":0},{"$f":"'TGM Rundschleifen'!D20","v":0},{"$f":"'TGM Rundschleifen'!E20","v":0},{"$f":"'TGM Rundschleifen'!F20","v":0},{"$f":"'TGM Rundschleifen'!G20","v":0},{"$f":"'TGM Rundschleifen'!H20","v":0},{"$f":"'TGM Rundschleifen'!I20","v":0},{"$f":"'TGM Rundschleifen'!J20","v":0},{"$f":"'TGM Rundschleifen'!K20","v":0},{"$f":"'TGM Rundschleifen'!L20","v":0},null,0,0,0,0,0,0,0,0,0,0,0]
[null,null,null,{"$f":"'TGM Rundschleifen'!B21","v":0},{"$f":"'TGM Rundschleifen'!C21","v":0},{"$f":"'TGM Rundschleifen'!D21","v":0},{"$f":"'TGM Rundschleifen'!E21","v":0},{"$f":"'TGM Rundschleifen'!F21","v":0},{"$f":"'TGM Rundschleifen'!G21","v":0},{"$f":"'TGM Rundschleifen'!H21","v":0},{"$f":"'TGM Rundschleifen'!I21","v":0},{"$f":"'TGM Rundschleifen'!J21","v":0},{"$f":"'TGM Rundschleifen'!K21","v":0},{"$f":"'TGM Rundschleifen'!L21","v":0},null,0,0,0,0,0,0,0,0,0,0,0]
[null,null,null,{"$f":"'TGM Rundschleifen'!B22","v":0},{"$f":"'TGM Rundschleifen'!C22","v":0},{"$f":"'TGM Rundschleifen'!D22","v":0},{"$f":"'TGM Rundschleifen'!E22","v":0},{"$f":"'TGM Rundschleifen'!F22","v":0},{"$f":"'TGM Rundschleifen'!G22","v":0},{"$f":"'TGM Rundschleifen'!H22","v":0},{"$f":"'TGM Rundschleifen'!I22","v":0},{"$f":"'TGM Rundschleifen'!J22","v":0},{"$f":"'TGM Rundschleifen'!K22","v":0},{"$f":"'TGM Rundschleifen'!L22","v":0},null,0,0,0,0,0,0,0,0,0,0,0]
[null,null,null,{"$f":"'TGM Rundschleifen'!B23","v":0},{"$f":"'TGM Rundschleifen'!C23","v":0},{"$f":"'TGM Rundschleifen'!D23","v":0},{"$f":"'TGM Rundschleifen'!E23","v":0},{"$f":"'TGM Rundschleifen'!F23","v":0},{"$f":"'TGM Rundschleifen'!G23","v":0},{"$f":"'TGM Rundschleifen'!H23","v":0},{"$f":"'TGM Rundschleifen'!I23","v":0},{"$f":"'TGM Rundschleifen'!J23","v":0},{"$f":"'TGM Rundschleifen'!K23","v":0},{"$f":"'TGM Rundschleifen'!L23","v":0},null,0,0,0,0,0,0,0,0,0,0,0]
[null,null,null,{"$f":"'TGM Rundschleifen'!B24","v":0},{"$f":"'TGM Rundschleifen'!C24","v":0},{"$f":"'TGM Rundschleifen'!D24","v":0},{"$f":"'TGM Rundschleifen'!E24","v":0},{"$f":"'TGM Rundschleifen'!F24","v":0},{"$f":"'TGM Rundschleifen'!G24","v":0},{"$f":"'TGM Rundschleifen'!H24","v":0},{"$f":"'TGM Rundschleifen'!I24","v":0},{"$f":"'TGM Rundschleifen'!J24","v":0},{"$f":"'TGM Rundschleifen'!K24","v":0},{"$f":"'TGM Rundschleifen'!L24","v":0},null,0,0,0,0,0,0,0,0,0,0,0]
[null,null,null,{"$f":"'TGM Rundschleifen'!B25","v":0},{"$f":"'TGM Rundschleifen'!C25","v":0},{"$f":"'TGM Rundschleifen'!D25","v":0},{"$f":"'TGM Rundschleifen'!E25","v":0},{"$f":"'TGM Rundschleifen'!F25","v":0},{"$f":"'TGM Rundschleifen'!G25","v":0},{"$f":"'TGM Rundschleifen'!H25","v":0},{"$f":"'TGM Rundschleifen'!I25","v":0},{"$f":"'TGM Rundschleifen'!J25","v":0},{"$f":"'TGM Rundschleifen'!K25","v":0},{"$f":"'TGM Rundschleifen'!L25","v":0},null,0,0,0,0,0,0,0,0,0,0,0]
[null,null,null,{"$f":"'TGM Rundschleifen'!B26","v":0},{"$f":"'TGM Rundschleifen'!C26","v":0},{"$f":"'TGM Rundschleifen'!D26","v":0},{"$f":"'TGM Rundschleifen'!E26","v":0},{"$f":"'TGM Rundschleifen'!F26","v":0},{"$f":"'TGM Rundschleifen'!G26","v":0},{"$f":"'TGM Rundschleifen'!H26","v":0},{"$f":"'TGM Rundschleifen'!I26","v":0},{"$f":"'TGM Rundschleifen'!J26","v":0},{"$f":"'TGM Rundschleifen'!K26","v":0},{"$f":"'TGM Rundschleifen'!L26","v":0},null,0,0,0,0,0,0,0,0,0,0,0]
[null,null,null,{"$f":"'TGM Rundschleifen'!B27","v":0},{"$f":"'TGM Rundschleifen'!C27","v":0},{"$f":"'TGM Rundschleifen'!D27","v":0},{"$f":"'TGM Rundschleifen'!E27","v":0},{"$f":"'TGM Rundschleifen'!F27","v":0},{"$f":"'TGM Rundschleifen'!G27","v":0},{"$f":"'TGM Rundschleifen'!H27","v":0},{"$f":"'TGM Rundschleifen'!I27","v":0},{"$f":"'TGM Rundschleifen'!J27","v":0},{"$f":"'TGM Rundschleifen'!K27","v":0},{"$f":"'TGM Rundschleifen'!L27","v":0},null,0,0,0,0,0,0,0,0,0,0,0]
[null,null,null,{"$f":"'TGM Rundschleifen'!B28","v":0},{"$f":"'TGM Rundschleifen'!C28","v":0},{"$f":"'TGM Rundschleifen'!D28","v":0},{"$f":"'TGM Rundschleifen'!E28","v":0},{"$f":"'TGM Rundschleifen'!F28","v":0},{"$f":"'TGM Rundschleifen'!G28","v":0},{"$f":"'TGM Rundschleifen'!H28","v":0},{"$f":"'TGM Rundschleifen'!I28","v":0},{"$f":"'TGM Rundschleifen'!J28","v":0},{"$f":"'TGM Rundschleifen'!K28","v":0},{"$f":"'TGM Rundschleifen'!L28","v":0},null,0,0,0,0,0,0,0,0,0,0,0]
[null,null,null,{"$f":"'TGM Rundschleifen'!B29","v":0},{"$f":"'TGM Rundschleifen'!C29","v":0},{"$f":"'TGM Rundschleifen'!D29","v":0},{"$f":"'TGM Rundschleifen'!E29","v":0},{"$f":"'TGM Rundschleifen'!F29","v":0},{"$f":"'TGM Rundschleifen'!G29","v":0},{"$f":"'TGM Rundschleifen'!H29","v":0},{"$f":"'TGM Rundschleifen'!I29","v":0},{"$f":"'TGM Rundschleifen'!J29","v":0},{"$f":"'TGM Rundschleifen'!K29","v":0},{"$f":"'TGM Rundschleifen'!L29","v":0},null,0,0,0,0,0,0,0,0,0,0,0]
[null,null,null,{"$f":"'TGM Rundschleifen'!B30","v":0},{"$f":"'TGM Rundschleifen'!C30","v":0},{"$f":"'TGM Rundschleifen'!D30","v":0},{"$f":"'TGM Rundschleifen'!E30","v":0},{"$f":"'TGM Rundschleifen'!F30","v":0},{"$f":"'TGM Rundschleifen'!G30","v":0},{"$f":"'TGM Rundschleifen'!H30","v":0},{"$f":"'TGM Rundschleifen'!I30","v":0},{"$f":"'TGM Rundschleifen'!J30","v":0},{"$f":"'TGM Rundschleifen'!K30","v":0},{"$f":"'TGM Rundschleifen'!L30","v":0},null,0,0,0,0,0,0,0,0,0,0,0]
[null,null,null,{"$f":"'TGM Rundschleifen'!B31","v":0},{"$f":"'TGM Rundschleifen'!C31","v":0},{"$f":"'TGM Rundschleifen'!D31","v":0},{"$f":"'TGM Rundschleifen'!E31","v":0},{"$f":"'TGM Rundschleifen'!F31","v":0},{"$f":"'TGM Rundschleifen'!G31","v":0},{"$f":"'TGM Rundschleifen'!H31","v":0},{"$f":"'TGM Rundschleifen'!I31","v":0},{"$f":"'TGM Rundschleifen'!J31","v":0},{"$f":"'TGM Rundschleifen'!K31","v":0},{"$f":"'TGM Rundschleifen'!L31","v":0},null,0,0,0,0,0,0,0,0,0,0,0]
[null,null,null,{"$f":"'TGM Rundschleifen'!B32","v":0},{"$f":"'TGM Rundschleifen'!C32","v":0},{"$f":"'TGM Rundschleifen'!D32","v":0},{"$f":"'TGM Rundschleifen'!E32","v":0},{"$f":"'TGM Rundschleifen'!F32","v":0},{"$f":"'TGM Rundschleifen'!G32","v":0},{"$f":"'TGM Rundschleifen'!H32","v":0},{"$f":"'TGM Rundschleifen'!I32","v":0},{"$f":"'TGM Rundschleifen'!J32","v":0},{"$f":"'TGM Rundschleifen'!K32","v":0},{"$f":"'TGM Rundschleifen'!L32","v":0},null,0,0,0,0,0,0,0,0,0,0,0]
[null,null,null,{"$f":"'TGM Rundschleifen'!B33","v":0},{"$f":"'TGM Rundschleifen'!C33","v":0},{"$f":"'TGM Rundschleifen'!D33","v":0},{"$f":"'TGM Rundschleifen'!E33","v":0},{"$f":"'TGM Rundschleifen'!F33","v":0},{"$f":"'TGM Rundschleifen'!G33","v":0},{"$f":"'TGM Rundschleifen'!H33","v":0},{"$f":"'TGM Rundschleifen'!I33","v":0},{"$f":"'TGM Rundschleifen'!J33","v":0},{"$f":"'TGM Rundschleifen'!K33","v":0},{"$f":"'TGM Rundschleifen'!L33","v":0},null,0,0,0,0,0,0,0,0,0,0,0]
[null,null,null,{"$f":"'TGM Rundschleifen'!B34","v":0},{"$f":"'TGM Rundschleifen'!C34","v":0},{"$f":"'TGM Rundschleifen'!D34","v":0},{"$f":"'TGM Rundschleifen'!E34","v":0},{"$f":"'TGM Rundschleifen'!F34","v":0},{"$f":"'TGM Rundschleifen'!G34","v":0},{"$f":"'TGM Rundschleifen'!H34","v":0},{"$f":"'TGM Rundschleifen'!I34","v":0},{"$f":"'TGM Rundschleifen'!J34","v":0},{"$f":"'TGM Rundschleifen'!K34","v":0},{"$f":"'TGM Rundschleifen'!L34","v":0},null,0,0,0,0,0,0,0,0,0,0,0]
[null,null,null,{"$f":"'TGM Rundschleifen'!B35","v":0},{"$f":"'TGM Rundschleifen'!C35","v":0},{"$f":"'TGM Rundschleifen'!D35","v":0},{"$f":"'TGM Rundschleifen'!E35","v":0},{"$f":"'TGM Rundschleifen'!F35","v":0},{"$f":"'TGM Rundschleifen'!G35","v":0},{"$f":"'TGM Rundschleifen'!H35","v":0},{"$f":"'TGM Rundschleifen'!I35","v":0},{"$f":"'TGM Rundschleifen'!J35","v":0},{"$f":"'TGM Rundschleifen'!K35","v":0},{"$f":"'TGM Rundschleifen'!L35","v":0},null,0,0,0,0,0,0,0,0,0,0,0]
[null,null,null,{"$f":"'TGM Rundschleifen'!B36","v":0},{"$f":"'TGM Rundschleifen'!C36","v":0},{"$f":"'TGM Rundschleifen'!D36","v":0},{"$f":"'TGM Rundschleifen'!E36","v":0},{"$f":"'TGM Rundschleifen'!F36","v":0},{"$f":"'TGM Rundschleifen'!G36","v":0},{"$f":"'TGM Rundschleifen'!H36","v":0},{"$f":"'TGM Rundschleifen'!I36","v":0},{"$f":"'TGM Rundschleifen'!J36","v":0},{"$f":"'TGM Rundschleifen'!K36","v":0},{"$f":"'TGM Rundschleifen'!L36","v":0},null,0,0,0,0,0,0,0,0,0,0,0]
[null,null,null,{"$f":"'TGM Rundschleifen'!B37","v":0},{"$f":"'TGM Rundschleifen'!C37","v":0},{"$f":"'TGM Rundschleifen'!D37","v":0},{"$f":"'TGM Rundschleifen'!E37","v":0},{"$f":"'TGM Rundschleifen'!F37","v":0},{"$f":"'TGM Rundschleifen'!G37","v":0},{"$f":"'TGM Rundschleifen'!H37","v":0},{"$f":"'TGM Rundschleifen'!I37","v":0},{"$f":"'TGM Rundschleifen'!J37","v":0},{"$f":"'TGM Rundschleifen'!K37","v":0},{"$f":"'TGM Rundschleifen'!L37","v":0},null,0,0,0,0,0,0,0,0,0,0,0]
[null,null,null,{"$f":"'TGM Rundschleifen'!B38","v":0},{"$f":"'TGM Rundschleifen'!C38","v":0},{"$f":"'TGM Rundschleifen'!D38","v":0},{"$f":"'TGM Rundschleifen'!E38","v":0},{"$f":"'TGM Rundschleifen'!F38","v":0},{"$f":"'TGM Rundschleifen'!G38","v":0},{"$f":"'TGM Rundschleifen'!H38","v":0},{"$f":"'TGM Rundschleifen'!I38","v":0},{"$f":"'TGM Rundschleifen'!J38","v":0},{"$f":"'TGM Rundschleifen'!K38","v":0},{"$f":"'TGM Rundschleifen'!L38","v":0},null,0,0,0,0,0,0,0,0,0,0,0]
[null,null,null,{"$f":"'TGM Rundschleifen'!B39","v":0},{"$f":"'TGM Rundschleifen'!C39","v":0},{"$f":"'TGM Rundschleifen'!D39","v":0},{"$f":"'TGM Rundschleifen'!E39","v":0},{"$f":"'TGM Rundschleifen'!F39","v":0},{"$f":"'TGM Rundschleifen'!G39","v":0},{"$f":"'TGM Rundschleifen'!H39","v":0},{"$f":"'TGM Rundschleifen'!I39","v":0},{"$f":"'TGM Rundschleifen'!J39","v":0},{"$f":"'TGM Rundschleifen'!K39","v":0},{"$f":"'TGM Rundschleifen'!L39","v":0},null,0,0,0,0,0,0,0,0,0,0,0]
[null,null,null,{"$f":"'TGM Rundschleifen'!B40","v":0},{"$f":"'TGM Rundschleifen'!C40","v":0},{"$f":"'TGM Rundschleifen'!D40","v":0},{"$f":"'TGM Rundschleifen'!E40","v":0},{"$f":"'TGM Rundschleifen'!F40","v":0},{"$f":"'TGM Rundschleifen'!G40","v":0},{"$f":"'TGM Rundschleifen'!H40","v":0},{"$f":"'TGM Rundschleifen'!I40","v":0},{"$f":"'TGM Rundschleifen'!J40","v":0},{"$f":"'TGM Rundschleifen'!K40","v":0},{"$f":"'TGM Rundschleifen'!L40","v":0},null,0,0,0,0,0,0,0,0,0,0,0]
[null,null,null,{"$f":"'TGM Rundschleifen'!B41","v":0},{"$f":"'TGM Rundschleifen'!C41","v":0},{"$f":"'TGM Rundschleifen'!D41","v":0},{"$f":"'TGM Rundschleifen'!E41","v":0},{"$f":"'TGM Rundschleifen'!F41","v":0},{"$f":"'TGM Rundschleifen'!G41","v":0},{"$f":"'TGM Rundschleifen'!H41","v":0},{"$f":"'TGM Rundschleifen'!I41","v":0},{"$f":"'TGM Rundschleifen'!J41","v":0},{"$f":"'TGM Rundschleifen'!K41","v":0},{"$f":"'TGM Rundschleifen'!L41","v":0},null,0,0,0,0,0,0,0,0,0,0,0]
[null,null,null,{"$f":"'TGM Rundschleifen'!B42","v":0},{"$f":"'TGM Rundschleifen'!C42","v":0},{"$f":"'TGM Rundschleifen'!D42","v":0},{"$f":"'TGM Rundschleifen'!E42","v":0},{"$f":"'TGM Rundschleifen'!F42","v":0},{"$f":"'TGM Rundschleifen'!G42","v":0},{"$f":"'TGM Rundschleifen'!H42","v":0},{"$f":"'TGM Rundschleifen'!I42","v":0},{"$f":"'TGM Rundschleifen'!J42","v":0},{"$f":"'TGM Rundschleifen'!K42","v":0},{"$f":"'TGM Rundschleifen'!L42","v":0},null,0,0,0,0,0,0,0,0,0,0,0]
[null,null,null,{"$f":"'TGM Rundschleifen'!B43","v":0},{"$f":"'TGM Rundschleifen'!C43","v":0},{"$f":"'TGM Rundschleifen'!D43","v":0},{"$f":"'TGM Rundschleifen'!E43","v":0},{"$f":"'TGM Rundschleifen'!F43","v":0},{"$f":"'TGM Rundschleifen'!G43","v":0},{"$f":"'TGM Rundschleifen'!H43","v":0},{"$f":"'TGM Rundschleifen'!I43","v":0},{"$f":"'TGM Rundschleifen'!J43","v":0},{"$f":"'TGM Rundschleifen'!K43","v":0},{"$f":"'TGM Rundschleifen'!L43","v":0},null,0,0,0,0,0,0,0,0,0,0,0]
[null,null,null,{"$f":"'TGM Rundschleifen'!B44","v":0},{"$f":"'TGM Rundschleifen'!C44","v":0},{"$f":"'TGM Rundschleifen'!D44","v":0},{"$f":"'TGM Rundschleifen'!E44","v":0},{"$f":"'TGM Rundschleifen'!F44","v":0},{"$f":"'TGM Rundschleifen'!G44","v":0},{"$f":"'TGM Rundschleifen'!H44","v":0},{"$f":"'TGM Rundschleifen'!I44","v":0},{"$f":"'TGM Rundschleifen'!J44","v":0},{"$f":"'TGM Rundschleifen'!K44","v":0},{"$f":"'TGM Rundschleifen'!L44","v":0},null,0,0,0,0,0,0,0,0,0,0,0]
[null,null,null,{"$f":"'TGM Rundschleifen'!B45","v":0},{"$f":"'TGM Rundschleifen'!C45","v":0},{"$f":"'TGM Rundschleifen'!D45","v":0},{"$f":"'TGM Rundschleifen'!E45","v":0},{"$f":"'TGM Rundschleifen'!F45","v":0},{"$f":"'TGM Rundschleifen'!G45","v":0},{"$f":"'TGM Rundschleifen'!H45","v":0},{"$f":"'TGM Rundschleifen'!I45","v":0},{"$f":"'TGM Rundschleifen'!J45","v":0},{"$f":"'TGM Rundschleifen'!K45","v":0},{"$f":"'TGM Rundschleifen'!L45","v":0},null,0,0,0,0,0,0,0,0,0,0,0]
[]
[]
[null,null,null,"TGM Plandrehen",null,null,null,null,null,null,null,null,null,null,null,"TGM Plandrehen"]
[]
[null,null,null,{"$f":"'TGM Plandrehen'!A15","v":0},{"$f":"'TGM Plandrehen'!B15","v":0},{"$f":"'TGM Plandrehen'!C15","v":0},{"$f":"'TGM Plandrehen'!D15","v":0},{"$f":"'TGM Plandrehen'!E15","v":0},{"$f":"'TGM Plandrehen'!F15","v":0},{"$f":"'TGM Plandrehen'!G15","v":0},null,null,null,null,null,"AG1 Kugelpfanne fertigdrehen",150,666.01764256103615,0,2,0.1,1000]
[null,null,null,{"$f":"'TGM Plandrehen'!A16","v":0},{"$f":"'TGM Plandrehen'!B16","v":0},{"$f":"'TGM Plandrehen'!C16","v":0},{"$f":"'TGM Plandrehen'!D16","v":0},{"$f":"'TGM Plandrehen'!E16","v":0},{"$f":"'TGM Plandrehen'!F16","v":0},{"$f":"'TGM Plandrehen'!G16","v":0},null,null,null,null,null,0,0,0,0,0,0,0]
[null,null,null,{"$f":"'TGM Plandrehen'!A17","v":0},{"$f":"'TGM Plandrehen'!B17","v":0},{"$f":"'TGM Plandrehen'!C17","v":0},{"$f":"'TGM Plandrehen'!D17","v":0},{"$f":"'TGM Plandrehen'!E17","v":0},{"$f":"'TGM Plandrehen'!F17","v":0},{"$f":"'TGM Plandrehen'!G17","v":0},null,null,null,null,null,0,0,0,0,0,0,0]
[null,null,null,{"$f":"'TGM Plandrehen'!A18","v":0},{"$f":"'TGM Plandrehen'!B18","v":0},{"$f":"'TGM Plandrehen'!C18","v":0},{"$f":"'TGM Plandrehen'!D18","v":0},{"$f":"'TGM Plandrehen'!E18","v":0},{"$f":"'TGM Plandrehen'!F18","v":0},{"$f":"'TGM Plandrehen'!G18","v":0},null,null,null,null,null,0,0,0,0,0,0,0]
[null,null,null,{"$f":"'TGM Plandrehen'!A19","v":0},{"$f":"'TGM Plandrehen'!B19","v":0},{"$f":"'TGM Plandrehen'!C19","v":0},{"$f":"'TGM Plandrehen'!D19","v":0},{"$f":"'TGM Plandrehen'!E19","v":0},{"$f":"'TGM Plandrehen'!F19","v":0},{"$f":"'TGM Plandrehen'!G19","v":0},null,null,null,null,null,0,0,0,0,0,0,0]
[null,null,null,{"$f":"'TGM Plandrehen'!A20","v":0},{"$f":"'TGM Plandrehen'!B20","v":0},{"$f":"'TGM Plandrehen'!C20","v":0},{"$f":"'TGM Plandrehen'!D20","v":0},{"$f":"'TGM Plandrehen'!E20","v":0},{"$f":"'TGM Plandrehen'!F20","v":0},{"$f":"'TGM Plandrehen'!G20","v":0},null,null,null,null,null,0,0,0,0,0,0,0]
[null,null,null,{"$f":"'TGM Plandrehen'!A21","v":0},{"$f":"'TGM Plandrehen'!B21","v":0},{"$f":"'TGM Plandrehen'!C21","v":0},{"$f":"'TGM Plandrehen'!D21","v":0},{"$f":"'TGM Plandrehen'!E21","v":0},{"$f":"'TGM Plandrehen'!F21","v":0},{"$f":"'TGM Plandrehen'!G21","v":0},null,null,null,null,null,0,0,0,0,0,0,0]
[null,null,null,{"$f":"'TGM Plandrehen'!A22","v":0},{"$f":"'TGM Plandrehen'!B22","v":0},{"$f":"'TGM Plandrehen'!C22","v":0},{"$f":"'TGM Plandrehen'!D22","v":0},{"$f":"'TGM Plandrehen'!E22","v":0},{"$f":"'TGM Plandrehen'!F22","v":0},{"$f":"'TGM Plandrehen'!G22","v":0},null,null,null,null,null,0,0,0,0,0,0,0]
[null,null,null,{"$f":"'TGM Plandrehen'!A23","v":0},{"$f":"'TGM Plandrehen'!B23","v":0},{"$f":"'TGM Plandrehen'!C23","v":0},{"$f":"'TGM Plandrehen'!D23","v":0},{"$f":"'TGM Plandrehen'!E23","v":0},{"$f":"'TGM Plandrehen'!F23","v":0},{"$f":"'TGM Plandrehen'!G23","v":0},null,null,null,null,null,0,0,0,0,0,0,0]
[null,null,null,{"$f":"'TGM Plandrehen'!A24","v":0},{"$f":"'TGM Plandrehen'!B24","v":0},{"$f":"'TGM Plandrehen'!C24","v":0},{"$f":"'TGM Plandrehen'!D24","v":0},{"$f":"'TGM Plandrehen'!E24","v":0},{"$f":"'TGM Plandrehen'!F24","v":0},{"$f":"'TGM Plandrehen'!G24","v":0},null,null,null,null,null,0,0,0,0,0,0,0]
[null,null,null,{"$f":"'TGM Plandrehen'!A25","v":0},{"$f":"'TGM Plandrehen'!B25","v":0},{"$f":"'TGM Plandrehen'!C25","v":0},{"$f":"'TGM Plandrehen'!D25","v":0},{"$f":"'TGM Plandrehen'!E25","v":0},{"$f":"'TGM Plandrehen'!F25","v":0},{"$f":"'TGM Plandrehen'!G25","v":0},null,null,null,null,null,0,0,0,0,0,0,0]
[null,null,null,{"$f":"'TGM Plandrehen'!A26","v":0},{"$f":"'TGM Plandrehen'!B26","v":0},{"$f":"'TGM Plandrehen'!C26","v":0},{"$f":"'TGM Plandrehen'!D26","v":0},{"$f":"'TGM Plandrehen'!E26","v":0},{"$f":"'TGM Plandrehen'!F26","v":0},{"$f":"'TGM Plandrehen'!G26","v":0},null,null,null,null,null,0,0,0,0,0,0,0]
[null,null,null,{"$f":"'TGM Plandrehen'!A27","v":0},{"$f":"'TGM Plandrehen'!B27","v":0},{"$f":"'TGM Plandrehen'!C27","v":0},{"$f":"'TGM Plandrehen'!D27","v":0},{"$f":"'TGM Plandrehen'!E27","v":0},{"$f":"'TGM Plandrehen'!F27","v":0},{"$f":"'TGM Plandrehen'!G27","v":0},null,null,null,null,null,0,0,0,0,0,0,0]
[null,null,null,{"$f":"'TGM Plandrehen'!A28","v":0},{"$f":"'TGM Plandrehen'!B28","v":0},{"$f":"'TGM Plandrehen'!C28","v":0},{"$f":"'TGM Plandrehen'!D28","v":0},{"$f":"'TGM Plandrehen'!E28","v":0},{"$f":"'TGM Plandrehen'!F28","v":0},{"$f":"'TGM Plandrehen'!G28","v":0},null,null,null,null,null,0,0,0,0,0,0,0]
[null,null,null,{"$f":"'TGM Plandrehen'!A29","v":0},{"$f":"'TGM Plandrehen'!B29","v":0},{"$f":"'TGM Plandrehen'!C29","v":0},{"$f":"'TGM Plandrehen'!D29","v":0},{"$f":"'TGM Plandrehen'!E29","v":0},{"$f":"'TGM Plandrehen'!F29","v":0},{"$f":"'TGM Plandrehen'!G29","v":0},null,null,null,null,null,0,0,0,0,0,0,0]
[null,null,null,{"$f":"'TGM Plandrehen'!A30","v":0},{"$f":"'TGM Plandrehen'!B30","v":0},{"$f":"'TGM Plandrehen'!C30","v":0},{"$f":"'TGM Plandrehen'!D30","v":0},{"$f":"'TGM Plandrehen'!E30","v":0},{"$f":"'TGM Plandrehen'!F30","v":0},{"$f":"'TGM Plandrehen'!G30","v":0},null,null,null,null,null,0,0,0,0,0,0,0]
[null,null,null,{"$f":"'TGM Plandrehen'!A31","v":0},{"$f":"'TGM Plandrehen'!B31","v":0},{"$f":"'TGM Plandrehen'!C31","v":0},{"$f":"'TGM Plandrehen'!D31","v":0},{"$f":"'TGM Plandrehen'!E31","v":0},{"$f":"'TGM Plandrehen'!F31","v":0},{"$f":"'TGM Plandrehen'!G31","v":0},null,null,null,null,null,0,0,0,0,0,0,0]
[null,null,null,{"$f":"'TGM Plandrehen'!A32","v":0},{"$f":"'TGM Plandrehen'!B32","v":0},{"$f":"'TGM Plandrehen'!C32","v":0},{"$f":"'TGM Plandrehen'!D32","v":0},{"$f":"'TGM Plandrehen'!E32","v":0},{"$f":"'TGM Plandrehen'!F32","v":0},{"$f":"'TGM Plandrehen'!G32","v":0},null,null,null,null,null,0,0,0,0,0,0,0]
[null,null,null,{"$f":"'TGM Plandrehen'!A33","v":0},{"$f":"'TGM Plandrehen'!B33","v":0},{"$f":"'TGM Plandrehen'!C33","v":0},{"$f":"'TGM Plandrehen'!D33","v":0},{"$f":"'TGM Plandrehen'!E33","v":0},{"$f":"'TGM Plandrehen'!F33","v":0},{"$f":"'TGM Plandrehen'!G33","v":0},null,null,null,null,null,0,0,0,0,0,0,0]
[null,null,null,{"$f":"'TGM Plandrehen'!A34","v":0},{"$f":"'TGM Plandrehen'!B34","v":0},{"$f":"'TGM Plandrehen'!C34","v":0},{"$f":"'TGM Plandrehen'!D34","v":0},{"$f":"'TGM Plandrehen'!E34","v":0},{"$f":"'TGM Plandrehen'!F34","v":0},{"$f":"'TGM Plandrehen'!G34","v":0},null,null,null,null,null,0,0,0,0,0,0,0]
[null,null,null,{"$f":"'TGM Plandrehen'!A35","v":0},{"$f":"'TGM Plandrehen'!B35","v":0},{"$f":"'TGM Plandrehen'!C35","v":0},{"$f":"'TGM Plandrehen'!D35","v":0},{"$f":"'TGM Plandrehen'!E35","v":0},{"$f":"'TGM Plandrehen'!F35","v":0},{"$f":"'TGM Plandrehen'!G35","v":0},null,null,null,null,null,0,0,0,0,0,0,0]
[null,null,null,{"$f":"'TGM Plandrehen'!A36","v":0},{"$f":"'TGM Plandrehen'!B36","v":0},{"$f":"'TGM Plandrehen'!C36","v":0},{"$f":"'TGM Plandrehen'!D36","v":0},{"$f":"'TGM Plandrehen'!E36","v":0},{"$f":"'TGM Plandrehen'!F36","v":0},{"$f":"'TGM Plandrehen'!G36","v":0},null,null,null,null,null,0,0,0,0,0,0,0]
[null,null,null,{"$f":"'TGM Plandrehen'!A37","v":0},{"$f":"'TGM Plandrehen'!B37","v":0},{"$f":"'TGM Plandrehen'!C37","v":0},{"$f":"'TGM Plandrehen'!D37","v":0},{"$f":"'TGM Plandrehen'!E37","v":0},{"$f":"'TGM Plandrehen'!F37","v":0},{"$f":"'TGM Plandrehen'!G37","v":0},null,null,null,null,null,0,0,0,0,0,0,0]
[null,null,null,{"$f":"'TGM Plandrehen'!A38","v":0},{"$f":"'TGM Plandrehen'!B38","v":0},{"$f":"'TGM Plandrehen'!C38","v":0},{"$f":"'TGM Plandrehen'!D38","v":0},{"$f":"'TGM Plandrehen'!E38","v":0},{"$f":"'TGM Plandrehen'!F38","v":0},{"$f":"'TGM Plandrehen'!G38","v":0},null,null,null,null,null,0,0,0,0,0,0,0]
[null,null,null,{"$f":"'TGM Plandrehen'!A39","v":0},{"$f":"'TGM Plandrehen'!B39","v":0},{"$f":"'TGM Plandrehen'!C39","v":0},{"$f":"'TGM Plandrehen'!D39","v":0},{"$f":"'TGM Plandrehen'!E39","v":0},{"$f":"'TGM Plandrehen'!F39","v":0},{"$f":"'TGM Plandrehen'!G39","v":0},null,null,null,null,null,0,0,0,0,0,0,0]
[null,null,null,{"$f":"'TGM Plandrehen'!A40","v":0},{"$f":"'TGM Plandrehen'!B40","v":0},{"$f":"'TGM Plandrehen'!C40","v":0},{"$f":"'TGM Plandrehen'!D40","v":0},{"$f":"'TGM Plandrehen'!E40","v":0},{"$f":"'TGM Plandrehen'!F40","v":0},{"$f":"'TGM Plandrehen'!G40","v":0},null,null,null,null,null,0,0,0,0,0,0,0]
[null,null,null,{"$f":"'TGM Plandrehen'!A41","v":0},{"$f":"'TGM Plandrehen'!B41","v":0},{"$f":"'TGM Plandrehen'!C41","v":0},{"$f":"'TGM Plandrehen'!D41","v":0},{"$f":"'TGM Plandrehen'!E41","v":0},{"$f":"'TGM Plandrehen'!F41","v":0},{"$f":"'TGM Plandrehen'!G41","v":0},null,null,null,null,null,0,0,0,0,0,0,0]
[null,null,null,{"$f":"'TGM Plandrehen'!A42","v":0},{"$f":"'TGM Plandrehen'!B42","v":0},{"$f":"'TGM Plandrehen'!C42","v":0},{"$f":"'TGM Plandrehen'!D42","v":0},{"$f":"'TGM Plandrehen'!E42","v":0},{"$f":"'TGM Plandrehen'!F42","v":0},{"$f":"'TGM Plandrehen'!G42","v":0},null,null,null,null,null,0,0,0,0,0,0,0]
[null,null,null,{"$f":"'TGM Plandrehen'!A43","v":0},{"$f":"'TGM Plandrehen'!B43","v":0},{"$f":"'TGM Plandrehen'!C43","v":0},{"$f":"'TGM Plandrehen'!D43","v":0},{"$f":"'TGM Plandrehen'!E43","v":0},{"$f":"'TGM Plandrehen'!F43","v":0},{"$f":"'TGM Plandrehen'!G43","v":0},null,null,null,null,null,0,0,0,0,0,0,0]
[null,null,null,{"$f":"'TGM Plandrehen'!A44","v":0},{"$f":"'TGM Plandrehen'!B44","v":0},{"$f":"'TGM Plandrehen'!C44","v":0},{"$f":"'TGM Plandrehen'!D44","v":0},{"$f":"'TGM Plandrehen'!E44","v":0},{"$f":"'TGM Plandrehen'!F44","v":0},{"$f":"'TGM Plandrehen'!G44","v":0},null,null,null,null,null,0,0,0,0,0,0,0]
[null,null,null,{"$f":"'TGM Plandrehen'!A45","v":0},{"$f":"'TGM Plandrehen'!B45","v":0},{"$f":"'TGM Plandrehen'!C45","v":0},{"$f":"'TGM Plandrehen'!D45","v":0},{"$f":"'TGM Plandrehen'!E45","v":0},{"$f":"'TGM Plandrehen'!F45","v":0},{"$f":"'TGM Plandrehen'!G45","v":0},null,null,null,null,null,0,0,0,0,0,0,0]
[null,null,null,{"$f":"'TGM Plandrehen'!A46","v":0},{"$f":"'TGM Plandrehen'!B46","v":0},{"$f":"'TGM Plandrehen'!C46","v":0},{"$f":"'TGM Plandrehen'!D46","v":0},{"$f":"'TGM Plandrehen'!E46","v":0},{"$f":"'TGM Plandrehen'!F46","v":0},{"$f":"'TGM Plandrehen'!G46","v":0},null,null,null,null,null,0,0,0,0,0,0,0]
[null,null,null,{"$f":"'TGM Plandrehen'!A47","v":0},{"$f":"'TGM Plandrehen'!B47","v":0},{"$f":"'TGM Plandrehen'!C47","v":0},{"$f":"'TGM Plandrehen'!D47","v":0},{"$f":"'TGM Plandrehen'!E47","v":0},{"$f":"'TGM Plandrehen'!F47","v":0},{"$f":"'TGM Plandrehen'!G47","v":0},null,null,null,null,null,0,0,0,0,0,0,0]
[null,null,null,{"$f":"'TGM Plandrehen'!A48","v":0},{"$f":"'TGM Plandrehen'!B48","v":0},{"$f":"'TGM Plandrehen'!C48","v":0},{"$f":"'TGM Plandrehen'!D48","v":0},{"$f":"'TGM Plandrehen'!E48","v":0},{"$f":"'TGM Plandrehen'!F48","v":0},{"$f":"'TGM Plandrehen'!G48","v":0},null,null,null,null,null,0,0,0,0,0,0,0]
[null,null,null,{"$f":"'TGM Plandrehen'!A49","v":0},{"$f":"'TGM Plandrehen'!B49","v":0},{"$f":"'TGM Plandrehen'!C49","v":0},{"$f":"'TGM Plandrehen'!D49","v":0},{"$f":"'TGM Plandrehen'!E49","v":0},{"$f":"'TGM Plandrehen'!F49","v":0},{"$f":"'TGM Plandrehen'!G49","v":0},null,null,null,null,null,0,0,0,0,0,0,0]
[null,null,null,{"$f":"'TGM Plandrehen'!A50","v":0},{"$f":"'TGM Plandrehen'!B50","v":0},{"$f":"'TGM Plandrehen'!C50","v":0},{"$f":"'TGM Plandrehen'!D50","v":0},{"$f":"'TGM Plandrehen'!E50","v":0},{"$f":"'TGM Plandrehen'!F50","v":0},{"$f":"'TGM Plandrehen'!G50","v":0},null,null,null,null,null,0,0,0,0,0,0,0]
[null,null,null,{"$f":"'TGM Plandrehen'!A51","v":0},{"$f":"'TGM Plandrehen'!B51","v":0},{"$f":"'TGM Plandrehen'!C51","v":0},{"$f":"'TGM Plandrehen'!D51","v":0},{"$f":"'TGM Plandrehen'!E51","v":0},{"$f":"'TGM Plandrehen'!F51","v":0},{"$f":"'TGM Plandrehen'!G51","v":0},null,null,null,null,null,0,0,0,0,0,0,0]
[null,null,null,{"$f":"'TGM Plandrehen'!A52","v":0},{"$f":"'TGM Plandrehen'!B52","v":0},{"$f":"'TGM Plandrehen'!C52","v":0},{"$f":"'TGM Plandrehen'!D52","v":0},{"$f":"'TGM Plandrehen'!E52","v":0},{"$f":"'TGM Plandrehen'!F52","v":0},{"$f":"'TGM Plandrehen'!G52","v":0},null,null,null,null,null,0,0,0,0,0,0,0]
[null,null,null,{"$f":"'TGM Plandrehen'!A53","v":0},{"$f":"'TGM Plandrehen'!B53","v":0},{"$f":"'TGM Plandrehen'!C53","v":0},{"$f":"'TGM Plandrehen'!D53","v":0},{"$f":"'TGM Plandrehen'!E53","v":0},{"$f":"'TGM Plandrehen'!F53","v":0},{"$f":"'TGM Plandrehen'!G53","v":0},null,null,null,null,null,0,0,0,0,0,0,0]
[null,null,null,{"$f":"'TGM Plandrehen'!A54","v":0},{"$f":"'TGM Plandrehen'!B54","v":0},{"$f":"'TGM Plandrehen'!C54","v":0},{"$f":"'TGM Plandrehen'!D54","v":0},{"$f":"'TGM Plandrehen'!E54","v":0},{"$f":"'TGM Plandrehen'!F54","v":0},{"$f":"'TGM Plandrehen'!G54","v":0},null,null,null,null,null,0,0,0,0,0,0,0]
[null,null,null,{"$f":"'TGM Plandrehen'!A55","v":0},{"$f":"'TGM Plandrehen'!B55","v":0},{"$f":"'TGM Plandrehen'!C55","v":0},{"$f":"'TGM Plandrehen'!D55","v":0},{"$f":"'TGM Plandrehen'!E55","v":0},{"$f":"'TGM Plandrehen'!F55","v":0},{"$f":"'TGM Plandrehen'!G55","v":0},null,null,null,null,null,0,0,0,0,0,0,0]
[null,null,null,{"$f":"'TGM Plandrehen'!A56","v":0},{"$f":"'TGM Plandrehen'!B56","v":0},{"$f":"'TGM Plandrehen'!C56","v":0},{"$f":"'TGM Plandrehen'!D56","v":0},{"$f":"'TGM Plandrehen'!E56","v":0},{"$f":"'TGM Plandrehen'!F56","v":0},{"$f":"'TGM Plandrehen'!G56","v":0},null,null,null,null,null,0,0,0,0,0,0,0]
[null,null,null,{"$f":"'TGM Plandrehen'!A57","v":0},{"$f":"'TGM Plandrehen'!B57","v":0},{"$f":"'TGM Plandrehen'!C57","v":0},{"$f":"'TGM Plandrehen'!D57","v":0},{"$f":"'TGM Plandrehen'!E57","v":0},{"$f":"'TGM Plandrehen'!F57","v":0},{"$f":"'TGM Plandrehen'!G57","v":0},null,null,null,null,null,0,0,0,0,0,0,0]
[null,null,null,{"$f":"'TGM Plandrehen'!A58","v":0},{"$f":"'TGM Plandrehen'!B58","v":0},{"$f":"'TGM Plandrehen'!C58","v":0},{"$f":"'TGM Plandrehen'!D58","v":0},{"$f":"'TGM Plandrehen'!E58","v":0},{"$f":"'TGM Plandrehen'!F58","v":0},{"$f":"'TGM Plandrehen'!G58","v":0},null,null,null,null,null,0,0,0,0,0,0,0]
[null,null,null,{"$f":"'TGM Plandrehen'!A59","v":0},{"$f":"'TGM Plandrehen'!B59","v":0},{"$f":"'TGM Plandrehen'!C59","v":0},{"$f":"'TGM Plandrehen'!D59","v":0},{"$f":"'TGM Plandrehen'!E59","v":0},{"$f":"'TGM Plandrehen'!F59","v":0},{"$f":"'TGM Plandrehen'!G59","v":0},null,null,null,null,null,0,0,0,0,0,0,0]
[null,null,null,{"$f":"'TGM Plandrehen'!A60","v":0},{"$f":"'TGM Plandrehen'!B60","v":0},{"$f":"'TGM Plandrehen'!C60","v":0},{"$f":"'TGM Plandrehen'!D60","v":0},{"$f":"'TGM Plandrehen'!E60","v":0},{"$f":"'TGM Plandrehen'!F60","v":0},{"$f":"'TGM Plandrehen'!G60","v":0},null,null,null,null,null,0,0,0,0,0,0,0]
[null,null,null,{"$f":"'TGM Plandrehen'!A61","v":0},{"$f":"'TGM Plandrehen'!B61","v":0},{"$f":"'TGM Plandrehen'!C61","v":0},{"$f":"'TGM Plandrehen'!D61","v":0},{"$f":"'TGM Plandrehen'!E61","v":0},{"$f":"'TGM Plandrehen'!F61","v":0},{"$f":"'TGM Plandrehen'!G61","v":0},null,null,null,null,null,0,0,0,0,0,0,0]
[null,null,null,{"$f":"'TGM Plandrehen'!A62","v":0},{"$f":"'TGM Plandrehen'!B62","v":0},{"$f":"'TGM Plandrehen'!C62","v":0},{"$f":"'TGM Plandrehen'!D62","v":0},{"$f":"'TGM Plandrehen'!E62","v":0},{"$f":"'TGM Plandrehen'!F62","v":0},{"$f":"'TGM Plandrehen'!G62","v":0},null,null,null,null,null,0,0,0,0,0,0,0]
[null,null,null,{"$f":"'TGM Plandrehen'!A63","v":0},{"$f":"'TGM Plandrehen'!B63","v":0},{"$f":"'TGM Plandrehen'!C63","v":0},{"$f":"'TGM Plandrehen'!D63","v":0},{"$f":"'TGM Plandrehen'!E63","v":0},{"$f":"'TGM Plandrehen'!F63","v":0},{"$f":"'TGM Plandrehen'!G63","v":0},null,null,null,null,null,0,0,0,0,0,0,0]
[null,null,null,{"$f":"'TGM Plandrehen'!A64","v":0},{"$f":"'TGM Plandrehen'!B64","v":0},{"$f":"'TGM Plandrehen'!C64","v":0},{"$f":"'TGM Plandrehen'!D64","v":0},{"$f":"'TGM Plandrehen'!E64","v":0},{"$f":"'TGM Plandrehen'!F64","v":0},{"$f":"'TGM Plandrehen'!G64","v":0},null,null,null,null,null,0,0,0,0,0,0,0]
[null,null,null,{"$f":"'TGM Plandrehen'!A65","v":0},{"$f":"'TGM Plandrehen'!B65","v":0},{"$f":"'TGM Plandrehen'!C65","v":0},{"$f":"'TGM Plandrehen'!D65","v":0},{"$f":"'TGM Plandrehen'!E65","v":0},{"$f":"'TGM Plandrehen'!F65","v":0},{"$f":"'TGM Plandrehen'!G65","v":0},null,null,null,null,null,0,0,0,0,0,0,0]
[]
[]
[null,null,null,"TGM Langdrehen",null,null,null,null,null,null,null,null,null,null,null,"TGM Langdrehen"]
[]
[null,null,null,{"$f":"'TGM Langdrehen '!A16","v":0},{"$f":"'TGM Langdrehen '!B16","v":0},{"$f":"'TGM Langdrehen '!C16","v":0},{"$f":"'TGM Langdrehen '!D16","v":0},{"$f":"'TGM Langdrehen '!E16","v":0},{"$f":"'TGM Langdrehen '!F16","v":0},{"$f":"'TGM Langdrehen '!G16","v":0},{"$f":"'TGM Langdrehen '!H16","v":0},null,null,null,null,0,0,0,0,0,0,0,0]
[null,null,null,{"$f":"'TGM Langdrehen '!A17","v":0},{"$f":"'TGM Langdrehen '!B17","v":0},{"$f":"'TGM Langdrehen '!C17","v":0},{"$f":"'TGM Langdrehen '!D17","v":0},{"$f":"'TGM Langdrehen '!E17","v":0},{"$f":"'TGM Langdrehen '!F17","v":0},{"$f":"'TGM Langdrehen '!G17","v":0},{"$f":"'TGM Langdrehen '!H17","v":0},null,null,null,null,0,0,0,0,0,0,0,0]
[null,null,null,{"$f":"'TGM Langdrehen '!A18","v":0},{"$f":"'TGM Langdrehen '!B18","v":0},{"$f":"'TGM Langdrehen '!C18","v":0},{"$f":"'TGM Langdrehen '!D18","v":0},{"$f":"'TGM Langdrehen '!E18","v":0},{"$f":"'TGM Langdrehen '!F18","v":0},{"$f":"'TGM Langdrehen '!G18","v":0},{"$f":"'TGM Langdrehen '!H18","v":0},null,null,null,null,0,0,0,0,0,0,0,0]
[null,null,null,{"$f":"'TGM Langdrehen '!A19","v":0},{"$f":"'TGM Langdrehen '!B19","v":0},{"$f":"'TGM Langdrehen '!C19","v":0},{"$f":"'TGM Langdrehen '!D19","v":0},{"$f":"'TGM Langdrehen '!E19","v":0},{"$f":"'TGM Langdrehen '!F19","v":0},{"$f":"'TGM Langdrehen '!G19","v":0},{"$f":"'TGM Langdrehen '!H19","v":0},null,null,null,null,0,0,0,0,0,0,0,0]
[null,null,null,{"$f":"'TGM Langdrehen '!A20","v":0},{"$f":"'TGM Langdrehen '!B20","v":0},{"$f":"'TGM Langdrehen '!C20","v":0},{"$f":"'TGM Langdrehen '!D20","v":0},{"$f":"'TGM Langdrehen '!E20","v":0},{"$f":"'TGM Langdrehen '!F20","v":0},{"$f":"'TGM Langdrehen '!G20","v":0},{"$f":"'TGM Langdrehen '!H20","v":0},null,null,null,null,0,0,0,0,0,0,0,0]
[null,null,null,{"$f":"'TGM Langdrehen '!A21","v":0},{"$f":"'TGM Langdrehen '!B21","v":0},{"$f":"'TGM Langdrehen '!C21","v":0},{"$f":"'TGM Langdrehen '!D21","v":0},{"$f":"'TGM Langdrehen '!E21","v":0},{"$f":"'TGM Langdrehen '!F21","v":0},{"$f":"'TGM Langdrehen '!G21","v":0},{"$f":"'TGM Langdrehen '!H21","v":0},null,null,null,null,0,0,0,0,0,0,0,0]
[null,null,null,{"$f":"'TGM Langdrehen '!A22","v":0},{"$f":"'TGM Langdrehen '!B22","v":0},{"$f":"'TGM Langdrehen '!C22","v":0},{"$f":"'TGM Langdrehen '!D22","v":0},{"$f":"'TGM Langdrehen '!E22","v":0},{"$f":"'TGM Langdrehen '!F22","v":0},{"$f":"'TGM Langdrehen '!G22","v":0},{"$f":"'TGM Langdrehen '!H22","v":0},null,null,null,null,0,0,0,0,0,0,0,0]
[null,null,null,{"$f":"'TGM Langdrehen '!A23","v":0},{"$f":"'TGM Langdrehen '!B23","v":0},{"$f":"'TGM Langdrehen '!C23","v":0},{"$f":"'TGM Langdrehen '!D23","v":0},{"$f":"'TGM Langdrehen '!E23","v":0},{"$f":"'TGM Langdrehen '!F23","v":0},{"$f":"'TGM Langdrehen '!G23","v":0},{"$f":"'TGM Langdrehen '!H23","v":0},null,null,null,null,0,0,0,0,0,0,0,0]
[null,null,null,{"$f":"'TGM Langdrehen '!A24","v":0},{"$f":"'TGM Langdrehen '!B24","v":0},{"$f":"'TGM Langdrehen '!C24","v":0},{"$f":"'TGM Langdrehen '!D24","v":0},{"$f":"'TGM Langdrehen '!E24","v":0},{"$f":"'TGM Langdrehen '!F24","v":0},{"$f":"'TGM Langdrehen '!G24","v":0},{"$f":"'TGM Langdrehen '!H24","v":0},null,null,null,null,0,0,0,0,0,0,0,0]
[null,null,null,{"$f":"'TGM Langdrehen '!A25","v":0},{"$f":"'TGM Langdrehen '!B25","v":0},{"$f":"'TGM Langdrehen '!C25","v":0},{"$f":"'TGM Langdrehen '!D25","v":0},{"$f":"'TGM Langdrehen '!E25","v":0},{"$f":"'TGM Langdrehen '!F25","v":0},{"$f":"'TGM Langdrehen '!G25","v":0},{"$f":"'TGM Langdrehen '!H25","v":0},null,null,null,null,0,0,0,0,0,0,0,0]
[null,null,null,{"$f":"'TGM Langdrehen '!A26","v":0},{"$f":"'TGM Langdrehen '!B26","v":0},{"$f":"'TGM Langdrehen '!C26","v":0},{"$f":"'TGM Langdrehen '!D26","v":0},{"$f":"'TGM Langdrehen '!E26","v":0},{"$f":"'TGM Langdrehen '!F26","v":0},{"$f":"'TGM Langdrehen '!G26","v":0},{"$f":"'TGM Langdrehen '!H26","v":0},null,null,null,null,0,0,0,0,0,0,0,0]
[null,null,null,{"$f":"'TGM Langdrehen '!A27","v":0},{"$f":"'TGM Langdrehen '!B27","v":0},{"$f":"'TGM Langdrehen '!C27","v":0},{"$f":"'TGM Langdrehen '!D27","v":0},{"$f":"'TGM Langdrehen '!E27","v":0},{"$f":"'TGM Langdrehen '!F27","v":0},{"$f":"'TGM Langdrehen '!G27","v":0},{"$f":"'TGM Langdrehen '!H27","v":0},null,null,null,null,0,0,0,0,0,0,0,0]
[null,null,null,{"$f":"'TGM Langdrehen '!A28","v":0},{"$f":"'TGM Langdrehen '!B28","v":0},{"$f":"'TGM Langdrehen '!C28","v":0},{"$f":"'TGM Langdrehen '!D28","v":0},{"$f":"'TGM Langdrehen '!E28","v":0},{"$f":"'TGM Langdrehen '!F28","v":0},{"$f":"'TGM Langdrehen '!G28","v":0},{"$f":"'TGM Langdrehen '!H28","v":0},null,null,null,null,0,0,0,0,0,0,0,0]
[null,null,null,{"$f":"'TGM Langdrehen '!A29","v":0},{"$f":"'TGM Langdrehen '!B29","v":0},{"$f":"'TGM Langdrehen '!C29","v":0},{"$f":"'TGM Langdrehen '!D29","v":0},{"$f":"'TGM Langdrehen '!E29","v":0},{"$f":"'TGM Langdrehen '!F29","v":0},{"$f":"'TGM Langdrehen '!G29","v":0},{"$f":"'TGM Langdrehen '!H29","v":0},null,null,null,null,0,0,0,0,0,0,0,0]
[null,null,null,{"$f":"'TGM Langdrehen '!A30","v":0},{"$f":"'TGM Langdrehen '!B30","v":0},{"$f":"'TGM Langdrehen '!C30","v":0},{"$f":"'TGM Langdrehen '!D30","v":0},{"$f":"'TGM Langdrehen '!E30","v":0},{"$f":"'TGM Langdrehen '!F30","v":0},{"$f":"'TGM Langdrehen '!G30","v":0},{"$f":"'TGM Langdrehen '!H30","v":0},null,null,null,null,0,0,0,0,0,0,0,0]
[null,null,null,{"$f":"'TGM Langdrehen '!A31","v":0},{"$f":"'TGM Langdrehen '!B31","v":0},{"$f":"'TGM Langdrehen '!C31","v":0},{"$f":"'TGM Langdrehen '!D31","v":0},{"$f":"'TGM Langdrehen '!E31","v":0},{"$f":"'TGM Langdrehen '!F31","v":0},{"$f":"'TGM Langdrehen '!G31","v":0},{"$f":"'TGM Langdrehen '!H31","v":0},null,null,null,null,0,0,0,0,0,0,0,0]
[null,null,null,{"$f":"'TGM Langdrehen '!A32","v":0},{"$f":"'TGM Langdrehen '!B32","v":0},{"$f":"'TGM Langdrehen '!C32","v":0},{"$f":"'TGM Langdrehen '!D32","v":0},{"$f":"'TGM Langdrehen '!E32","v":0},{"$f":"'TGM Langdrehen '!F32","v":0},{"$f":"'TGM Langdrehen '!G32","v":0},{"$f":"'TGM Langdrehen '!H32","v":0},null,null,null,null,0,0,0,0,0,0,0,0]
[null,null,null,{"$f":"'TGM Langdrehen '!A33","v":0},{"$f":"'TGM Langdrehen '!B33","v":0},{"$f":"'TGM Langdrehen '!C33","v":0},{"$f":"'TGM Langdrehen '!D33","v":0},{"$f":"'TGM Langdrehen '!E33","v":0},{"$f":"'TGM Langdrehen '!F33","v":0},{"$f":"'TGM Langdrehen '!G33","v":0},{"$f":"'TGM Langdrehen '!H33","v":0},null,null,null,null,0,0,0,0,0,0,0,0]
[null,null,null,{"$f":"'TGM Langdrehen '!A34","v":0},{"$f":"'TGM Langdrehen '!B34","v":0},{"$f":"'TGM Langdrehen '!C34","v":0},{"$f":"'TGM Langdrehen '!D34","v":0},{"$f":"'TGM Langdrehen '!E34","v":0},{"$f":"'TGM Langdrehen '!F34","v":0},{"$f":"'TGM Langdrehen '!G34","v":0},{"$f":"'TGM Langdrehen '!H34","v":0},null,null,null,null,0,0,0,0,0,0,0,0]
[null,null,null,{"$f":"'TGM Langdrehen '!A35","v":0},{"$f":"'TGM Langdrehen '!B35","v":0},{"$f":"'TGM Langdrehen '!C35","v":0},{"$f":"'TGM Langdrehen '!D35","v":0},{"$f":"'TGM Langdrehen '!E35","v":0},{"$f":"'TGM Langdrehen '!F35","v":0},{"$f":"'TGM Langdrehen '!G35","v":0},{"$f":"'TGM Langdrehen '!H35","v":0},null,null,null,null,0,0,0,0,0,0,0,0]
[null,null,null,{"$f":"'TGM Langdrehen '!A36","v":0},{"$f":"'TGM Langdrehen '!B36","v":0},{"$f":"'TGM Langdrehen '!C36","v":0},{"$f":"'TGM Langdrehen '!D36","v":0},{"$f":"'TGM Langdrehen '!E36","v":0},{"$f":"'TGM Langdrehen '!F36","v":0},{"$f":"'TGM Langdrehen '!G36","v":0},{"$f":"'TGM Langdrehen '!H36","v":0},null,null,null,null,0,0,0,0,0,0,0,0]
[null,null,null,{"$f":"'TGM Langdrehen '!A37","v":0},{"$f":"'TGM Langdrehen '!B37","v":0},{"$f":"'TGM Langdrehen '!C37","v":0},{"$f":"'TGM Langdrehen '!D37","v":0},{"$f":"'TGM Langdrehen '!E37","v":0},{"$f":"'TGM Langdrehen '!F37","v":0},{"$f":"'TGM Langdrehen '!G37","v":0},{"$f":"'TGM Langdrehen '!H37","v":0},null,null,null,null,0,0,0,0,0,0,0,0]
[null,null,null,{"$f":"'TGM Langdrehen '!A38","v":0},{"$f":"'TGM Langdrehen '!B38","v":0},{"$f":"'TGM Langdrehen '!C38","v":0},{"$f":"'TGM Langdrehen '!D38","v":0},{"$f":"'TGM Langdrehen '!E38","v":0},{"$f":"'TGM Langdrehen '!F38","v":0},{"$f":"'TGM Langdrehen '!G38","v":0},{"$f":"'TGM Langdrehen '!H38","v":0},null,null,null,null,0,0,0,0,0,0,0,0]
[null,null,null,{"$f":"'TGM Langdrehen '!A39","v":0},{"$f":"'TGM Langdrehen '!B39","v":0},{"$f":"'TGM Langdrehen '!C39","v":0},{"$f":"'TGM Langdrehen '!D39","v":0},{"$f":"'TGM Langdrehen '!E39","v":0},{"$f":"'TGM Langdrehen '!F39","v":0},{"$f":"'TGM Langdrehen '!G39","v":0},{"$f":"'TGM Langdrehen '!H39","v":0},null,null,null,null,0,0,0,0,0,0,0,0]
[null,null,null,{"$f":"'TGM Langdrehen '!A40","v":0},{"$f":"'TGM Langdrehen '!B40","v":0},{"$f":"'TGM Langdrehen '!C40","v":0},{"$f":"'TGM Langdrehen '!D40","v":0},{"$f":"'TGM Langdrehen '!E40","v":0},{"$f":"'TGM Langdrehen '!F40","v":0},{"$f":"'TGM Langdrehen '!G40","v":0},{"$f":"'TGM Langdrehen '!H40","v":0},null,null,null,null,0,0,0,0,0,0,0,0]
[null,null,null,{"$f":"'TGM Langdrehen '!A41","v":0},{"$f":"'TGM Langdrehen '!B41","v":0},{"$f":"'TGM Langdrehen '!C41","v":0},{"$f":"'TGM Langdrehen '!D41","v":0},{"$f":"'TGM Langdrehen '!E41","v":0},{"$f":"'TGM Langdrehen '!F41","v":0},{"$f":"'TGM Langdrehen '!G41","v":0},{"$f":"'TGM Langdrehen '!H41","v":0},null,null,null,null,0,0,0,0,0,0,0,0]
[null,null,null,{"$f":"'TGM Langdrehen '!A42","v":0},{"$f":"'TGM Langdrehen '!B42","v":0},{"$f":"'TGM Langdrehen '!C42","v":0},{"$f":"'TGM Langdrehen '!D42","v":0},{"$f":"'TGM Langdrehen '!E42","v":0},{"$f":"'TGM Langdrehen '!F42","v":0},{"$f":"'TGM Langdrehen '!G42","v":0},{"$f":"'TGM Langdrehen '!H42","v":0},null,null,null,null,0,0,0,0,0,0,0,0]
[null,null,null,{"$f":"'TGM Langdrehen '!A43","v":0},{"$f":"'TGM Langdrehen '!B43","v":0},{"$f":"'TGM Langdrehen '!C43","v":0},{"$f":"'TGM Langdrehen '!D43","v":0},{"$f":"'TGM Langdrehen '!E43","v":0},{"$f":"'TGM Langdrehen '!F43","v":0},{"$f":"'TGM Langdrehen '!G43","v":0},{"$f":"'TGM Langdrehen '!H43","v":0},null,null,null,null,0,0,0,0,0,0,0,0]
[null,null,null,{"$f":"'TGM Langdrehen '!A44","v":0},{"$f":"'TGM Langdrehen '!B44","v":0},{"$f":"'TGM Langdrehen '!C44","v":0},{"$f":"'TGM Langdrehen '!D44","v":0},{"$f":"'TGM Langdrehen '!E44","v":0},{"$f":"'TGM Langdrehen '!F44","v":0},{"$f":"'TGM Langdrehen '!G44","v":0},{"$f":"'TGM Langdrehen '!H44","v":0},null,null,null,null,0,0,0,0,0,0,0,0]
[null,null,null,{"$f":"'TGM Langdrehen '!A45","v":0},{"$f":"'TGM Langdrehen '!B45","v":0},{"$f":"'TGM Langdrehen '!C45","v":0},{"$f":"'TGM Langdrehen '!D45","v":0},{"$f":"'TGM Langdrehen '!E45","v":0},{"$f":"'TGM Langdrehen '!F45","v":0},{"$f":"'TGM Langdrehen '!G45","v":0},{"$f":"'TGM Langdrehen '!H45","v":0},null,null,null,null,0,0,0,0,0,0,0,0]
[null,null,null,{"$f":"'TGM Langdrehen '!A46","v":0},{"$f":"'TGM Langdrehen '!B46","v":0},{"$f":"'TGM Langdrehen '!C46","v":0},{"$f":"'TGM Langdrehen '!D46","v":0},{"$f":"'TGM Langdrehen '!E46","v":0},{"$f":"'TGM Langdrehen '!F46","v":0},{"$f":"'TGM Langdrehen '!G46","v":0},{"$f":"'TGM Langdrehen '!H46","v":0},null,null,null,null,0,0,0,0,0,0,0,0]
[null,null,null,{"$f":"'TGM Langdrehen '!A47","v":0},{"$f":"'TGM Langdrehen '!B47","v":0},{"$f":"'TGM Langdrehen '!C47","v":0},{"$f":"'TGM Langdrehen '!D47","v":0},{"$f":"'TGM Langdrehen '!E47","v":0},{"$f":"'TGM Langdrehen '!F47","v":0},{"$f":"'TGM Langdrehen '!G47","v":0},{"$f":"'TGM Langdrehen '!H47","v":0},null,null,null,null,0,0,0,0,0,0,0,0]
[null,null,null,{"$f":"'TGM Langdrehen '!A48","v":0},{"$f":"'TGM Langdrehen '!B48","v":0},{"$f":"'TGM Langdrehen '!C48","v":0},{"$f":"'TGM Langdrehen '!D48","v":0},{"$f":"'TGM Langdrehen '!E48","v":0},{"$f":"'TGM Langdrehen '!F48","v":0},{"$f":"'TGM Langdrehen '!G48","v":0},{"$f":"'TGM Langdrehen '!H48","v":0},null,null,null,null,0,0,0,0,0,0,0,0]
[null,null,null,{"$f":"'TGM Langdrehen '!A49","v":0},{"$f":"'TGM Langdrehen '!B49","v":0},{"$f":"'TGM Langdrehen '!C49","v":0},{"$f":"'TGM Langdrehen '!D49","v":0},{"$f":"'TGM Langdrehen '!E49","v":0},{"$f":"'TGM Langdrehen '!F49","v":0},{"$f":"'TGM Langdrehen '!G49","v":0},{"$f":"'TGM Langdrehen '!H49","v":0},null,null,null,null,0,0,0,0,0,0,0,0]
[null,null,null,{"$f":"'TGM Langdrehen '!A50","v":0},{"$f":"'TGM Langdrehen '!B50","v":0},{"$f":"'TGM Langdrehen '!C50","v":0},{"$f":"'TGM Langdrehen '!D50","v":0},{"$f":"'TGM Langdrehen '!E50","v":0},{"$f":"'TGM Langdrehen '!F50","v":0},{"$f":"'TGM Langdrehen '!G50","v":0},{"$f":"'TGM Langdrehen '!H50","v":0},null,null,null,null,0,0,0,0,0,0,0,0]
[null,null,null,{"$f":"'TGM Langdrehen '!A51","v":0},{"$f":"'TGM Langdrehen '!B51","v":0},{"$f":"'TGM Langdrehen '!C51","v":0},{"$f":"'TGM Langdrehen '!D51","v":0},{"$f":"'TGM Langdrehen '!E51","v":0},{"$f":"'TGM Langdrehen '!F51","v":0},{"$f":"'TGM Langdrehen '!G51","v":0},{"$f":"'TGM Langdrehen '!H51","v":0},null,null,null,null,0,0,0,0,0,0,0,0]
[null,null,null,{"$f":"'TGM Langdrehen '!A52","v":0},{"$f":"'TGM Langdrehen '!B52","v":0},{"$f":"'TGM Langdrehen '!C52","v":0},{"$f":"'TGM Langdrehen '!D52","v":0},{"$f":"'TGM Langdrehen '!E52","v":0},{"$f":"'TGM Langdrehen '!F52","v":0},{"$f":"'TGM Langdrehen '!G52","v":0},{"$f":"'TGM Langdrehen '!H52","v":0},null,null,null,null,0,0,0,0,0,0,0,0]
[null,null,null,{"$f":"'TGM Langdrehen '!A53","v":0},{"$f":"'TGM Langdrehen '!B53","v":0},{"$f":"'TGM Langdrehen '!C53","v":0},{"$f":"'TGM Langdrehen '!D53","v":0},{"$f":"'TGM Langdrehen '!E53","v":0},{"$f":"'TGM Langdrehen '!F53","v":0},{"$f":"'TGM Langdrehen '!G53","v":0},{"$f":"'TGM Langdrehen '!H53","v":0},null,null,null,null,0,0,0,0,0,0,0,0]
[null,null,null,{"$f":"'TGM Langdrehen '!A54","v":0},{"$f":"'TGM Langdrehen '!B54","v":0},{"$f":"'TGM Langdrehen '!C54","v":0},{"$f":"'TGM Langdrehen '!D54","v":0},{"$f":"'TGM Langdrehen '!E54","v":0},{"$f":"'TGM Langdrehen '!F54","v":0},{"$f":"'TGM Langdrehen '!G54","v":0},{"$f":"'TGM Langdrehen '!H54","v":0},null,null,null,null,0,0,0,0,0,0,0,0]
[null,null,null,{"$f":"'TGM Langdrehen '!A55","v":0},{"$f":"'TGM Langdrehen '!B55","v":0},{"$f":"'TGM Langdrehen '!C55","v":0},{"$f":"'TGM Langdrehen '!D55","v":0},{"$f":"'TGM Langdrehen '!E55","v":0},{"$f":"'TGM Langdrehen '!F55","v":0},{"$f":"'TGM Langdrehen '!G55","v":0},{"$f":"'TGM Langdrehen '!H55","v":0},null,null,null,null,0,0,0,0,0,0,0,0]
[null,null,null,{"$f":"'TGM Langdrehen '!A56","v":0},{"$f":"'TGM Langdrehen '!B56","v":0},{"$f":"'TGM Langdrehen '!C56","v":0},{"$f":"'TGM Langdrehen '!D56","v":0},{"$f":"'TGM Langdrehen '!E56","v":0},{"$f":"'TGM Langdrehen '!F56","v":0},{"$f":"'TGM Langdrehen '!G56","v":0},{"$f":"'TGM Langdrehen '!H56","v":0},null,null,null,null,0,0,0,0,0,0,0,0]
[null,null,null,{"$f":"'TGM Langdrehen '!A57","v":0},{"$f":"'TGM Langdrehen '!B57","v":0},{"$f":"'TGM Langdrehen '!C57","v":0},{"$f":"'TGM Langdrehen '!D57","v":0},{"$f":"'TGM Langdrehen '!E57","v":0},{"$f":"'TGM Langdrehen '!F57","v":0},{"$f":"'TGM Langdrehen '!G57","v":0},{"$f":"'TGM Langdrehen '!H57","v":0},null,null,null,null,0,0,0,0,0,0,0,0]
[null,null,null,{"$f":"'TGM Langdrehen '!A58","v":0},{"$f":"'TGM Langdrehen '!B58","v":0},{"$f":"'TGM Langdrehen '!C58","v":0},{"$f":"'TGM Langdrehen '!D58","v":0},{"$f":"'TGM Langdrehen '!E58","v":0},{"$f":"'TGM Langdrehen '!F58","v":0},{"$f":"'TGM Langdrehen '!G58","v":0},{"$f":"'TGM Langdrehen '!H58","v":0},null,null,null,null,0,0,0,0,0,0,0,0]
[null,null,null,{"$f":"'TGM Langdrehen '!A59","v":0},{"$f":"'TGM Langdrehen '!B59","v":0},{"$f":"'TGM Langdrehen '!C59","v":0},{"$f":"'TGM Langdrehen '!D59","v":0},{"$f":"'TGM Langdrehen '!E59","v":0},{"$f":"'TGM Langdrehen '!F59","v":0},{"$f":"'TGM Langdrehen '!G59","v":0},{"$f":"'TGM Langdrehen '!H59","v":0},null,null,null,null,0,0,0,0,0,0,0,0]
[null,null,null,{"$f":"'TGM Langdrehen '!A60","v":0},{"$f":"'TGM Langdrehen '!B60","v":0},{"$f":"'TGM Langdrehen '!C60","v":0},{"$f":"'TGM Langdrehen '!D60","v":0},{"$f":"'TGM Langdrehen '!E60","v":0},{"$f":"'TGM Langdrehen '!F60","v":0},{"$f":"'TGM Langdrehen '!G60","v":0},{"$f":"'TGM Langdrehen '!H60","v":0},null,null,null,null,0,0,0,0,0,0,0,0]
[null,null,null,{"$f":"'TGM Langdrehen '!A61","v":0},{"$f":"'TGM Langdrehen '!B61","v":0},{"$f":"'TGM Langdrehen '!C61","v":0},{"$f":"'TGM Langdrehen '!D61","v":0},{"$f":"'TGM Langdrehen '!E61","v":0},{"$f":"'TGM Langdrehen '!F61","v":0},{"$f":"'TGM Langdrehen '!G61","v":0},{"$f":"'TGM Langdrehen '!H61","v":0},null,null,null,null,0,0,0,0,0,0,0,0]
[null,null,null,{"$f":"'TGM Langdrehen '!A62","v":0},{"$f":"'TGM Langdrehen '!B62","v":0},{"$f":"'TGM Langdrehen '!C62","v":0},{"$f":"'TGM Langdrehen '!D62","v":0},{"$f":"'TGM Langdrehen '!E62","v":0},{"$f":"'TGM Langdrehen '!F62","v":0},{"$f":"'TGM Langdrehen '!G62","v":0},{"$f":"'TGM Langdrehen '!H62","v":0},null,null,null,null,0,0,0,0,0,0,0,0]
[null,null,null,{"$f":"'TGM Langdrehen '!A63","v":0},{"$f":"'TGM Langdrehen '!B63","v":0},{"$f":"'TGM Langdrehen '!C63","v":0},{"$f":"'TGM Langdrehen '!D63","v":0},{"$f":"'TGM Langdrehen '!E63","v":0},{"$f":"'TGM Langdrehen '!F63","v":0},{"$f":"'TGM Langdrehen '!G63","v":0},{"$f":"'TGM Langdrehen '!H63","v":0},null,null,null,null,0,0,0,0,0,0,0,0]
[null,null,null,{"$f":"'TGM Langdrehen '!A64","v":0},{"$f":"'TGM Langdrehen '!B64","v":0},{"$f":"'TGM Langdrehen '!C64","v":0},{"$f":"'TGM Langdrehen '!D64","v":0},{"$f":"'TGM Langdrehen '!E64","v":0},{"$f":"'TGM Langdrehen '!F64","v":0},{"$f":"'TGM Langdrehen '!G64","v":0},{"$f":"'TGM Langdrehen '!H64","v":0},null,null,null,null,0,0,0,0,0,0,0,0]
[null,null,null,{"$f":"'TGM Langdrehen '!A65","v":0},{"$f":"'TGM Langdrehen '!B65","v":0},{"$f":"'TGM Langdrehen '!C65","v":0},{"$f":"'TGM Langdrehen '!D65","v":0},{"$f":"'TGM Langdrehen '!E65","v":0},{"$f":"'TGM Langdrehen '!F65","v":0},{"$f":"'TGM Langdrehen '!G65","v":0},{"$f":"'TGM Langdrehen '!H65","v":0},null,null,null,null,0,0,0,0,0,0,0,0]
[null,null,null,{"$f":"'TGM Langdrehen '!A66","v":0},{"$f":"'TGM Langdrehen '!B66","v":0},{"$f":"'TGM Langdrehen '!C66","v":0},{"$f":"'TGM Langdrehen '!D66","v":0},{"$f":"'TGM Langdrehen '!E66","v":0},{"$f":"'TGM Langdrehen '!F66","v":0},{"$f":"'TGM Langdrehen '!G66","v":0},{"$f":"'TGM Langdrehen '!H66","v":0},null,null,null,null,0,0,0,0,0,0,0,0]
[null,null,null,{"$f":"'TGM Langdrehen '!A67","v":0},{"$f":"'TGM Langdrehen '!B67","v":0},{"$f":"'TGM Langdrehen '!C67","v":0},{"$f":"'TGM Langdrehen '!D67","v":0},{"$f":"'TGM Langdrehen '!E67","v":0},{"$f":"'TGM Langdrehen '!F67","v":0},{"$f":"'TGM Langdrehen '!G67","v":0},{"$f":"'TGM Langdrehen '!H67","v":0},null,null,null,null,0,0,0,0,0,0,0,0]
[null,null,null,{"$f":"'TGM Langdrehen '!A68","v":0},{"$f":"'TGM Langdrehen '!B68","v":0},{"$f":"'TGM Langdrehen '!C68","v":0},{"$f":"'TGM Langdrehen '!D68","v":0},{"$f":"'TGM Langdrehen '!E68","v":0},{"$f":"'TGM Langdrehen '!F68","v":0},{"$f":"'TGM Langdrehen '!G68","v":0},{"$f":"'TGM Langdrehen '!H68","v":0},null,null,null,null,0,0,0,0,0,0,0,0]
[null,null,null,{"$f":"'TGM Langdrehen '!A69","v":0},{"$f":"'TGM Langdrehen '!B69","v":0},{"$f":"'TGM Langdrehen '!C69","v":0},{"$f":"'TGM Langdrehen '!D69","v":0},{"$f":"'TGM Langdrehen '!E69","v":0},{"$f":"'TGM Langdrehen '!F69","v":0},{"$f":"'TGM Langdrehen '!G69","v":0},{"$f":"'TGM Langdrehen '!H69","v":0},null,null,null,null,0,0,0,0,0,0,0,0]
[null,null,null,{"$f":"'TGM Langdrehen '!A70","v":0},{"$f":"'TGM Langdrehen '!B70","v":0},{"$f":"'TGM Langdrehen '!C70","v":0},{"$f":"'TGM Langdrehen '!D70","v":0},{"$f":"'TGM Langdrehen '!E70","v":0},{"$f":"'TGM Langdrehen '!F70","v":0},{"$f":"'TGM Langdrehen '!G70","v":0},{"$f":"'TGM Langdrehen '!H70","v":0},null,null,null,null,0,0,0,0,0,0,0,0]
[null,null,null,{"$f":"'TGM Langdrehen '!A71","v":0},{"$f":"'TGM Langdrehen '!B71","v":0},{"$f":"'TGM Langdrehen '!C71","v":0},{"$f":"'TGM Langdrehen '!D71","v":0},{"$f":"'TGM Langdrehen '!E71","v":0},{"$f":"'TGM Langdrehen '!F71","v":0},{"$f":"'TGM Langdrehen '!G71","v":0},{"$f":"'TGM Langdrehen '!H71","v":0},null,null,null,null,0,0,0,0,0,0,0,0]
[null,null,null,{"$f":"'TGM Langdrehen '!A72","v":0},{"$f":"'TGM Langdrehen '!B72","v":0},{"$f":"'TGM Langdrehen '!C72","v":0},{"$f":"'TGM Langdrehen '!D72","v":0},{"$f":"'TGM Langdrehen '!E72","v":0},{"$f":"'TGM Langdrehen '!F72","v":0},{"$f":"'TGM Langdrehen '!G72","v":0},{"$f":"'TGM Langdrehen '!H72","v":0},null,null,null,null,0,0,0,0,0,0,0,0]
[null,null,null,{"$f":"'TGM Langdrehen '!A73","v":0},{"$f":"'TGM Langdrehen '!B73","v":0},{"$f":"'TGM Langdrehen '!C73","v":0},{"$f":"'TGM Langdrehen '!D73","v":0},{"$f":"'TGM Langdrehen '!E73","v":0},{"$f":"'TGM Langdrehen '!F73","v":0},{"$f":"'TGM Langdrehen '!G73","v":0},{"$f":"'TGM Langdrehen '!H73","v":0},null,null,null,null,0,0,0,0,0,0,0,0]
[null,null,null,{"$f":"'TGM Langdrehen '!A74","v":0},{"$f":"'TGM Langdrehen '!B74","v":0},{"$f":"'TGM Langdrehen '!C74","v":0},{"$f":"'TGM Langdrehen '!D74","v":0},{"$f":"'TGM Langdrehen '!E74","v":0},{"$f":"'TGM Langdrehen '!F74","v":0},{"$f":"'TGM Langdrehen '!G74","v":0},{"$f":"'TGM Langdrehen '!H74","v":0},null,null,null,null,0,0,0,0,0,0,0,0]
[null,null,null,{"$f":"'TGM Langdrehen '!A75","v":0},{"$f":"'TGM Langdrehen '!B75","v":0},{"$f":"'TGM Langdrehen '!C75","v":0},{"$f":"'TGM Langdrehen '!D75","v":0},{"$f":"'TGM Langdrehen '!E75","v":0},{"$f":"'TGM Langdrehen '!F75","v":0},{"$f":"'TGM Langdrehen '!G75","v":0},{"$f":"'TGM Langdrehen '!H75","v":0},null,null,null,null,0,0,0,0,0,0,0,0]
[null,null,null,{"$f":"'TGM Langdrehen '!A76","v":0},{"$f":"'TGM Langdrehen '!B76","v":0},{"$f":"'TGM Langdrehen '!C76","v":0},{"$f":"'TGM Langdrehen '!D76","v":0},{"$f":"'TGM Langdrehen '!E76","v":0},{"$f":"'TGM Langdrehen '!F76","v":0},{"$f":"'TGM Langdrehen '!G76","v":0},{"$f":"'TGM Langdrehen '!H76","v":0},null,null,null,null,0,0,0,0,0,0,0,0]
[null,null,null,{"$f":"'TGM Langdrehen '!A77","v":0},{"$f":"'TGM Langdrehen '!B77","v":0},{"$f":"'TGM Langdrehen '!C77","v":0},{"$f":"'TGM Langdrehen '!D77","v":0},{"$f":"'TGM Langdrehen '!E77","v":0},{"$f":"'TGM Langdrehen '!F77","v":0},{"$f":"'TGM Langdrehen '!G77","v":0},{"$f":"'TGM Langdrehen '!H77","v":0},null,null,null,null,0,0,0,0,0,0,0,0]
[null,null,null,{"$f":"'TGM Langdrehen '!A78","v":0},{"$f":"'TGM Langdrehen '!B78","v":0},{"$f":"'TGM Langdrehen '!C78","v":0},{"$f":"'TGM Langdrehen '!D78","v":0},{"$f":"'TGM Langdrehen '!E78","v":0},{"$f":"'TGM Langdrehen '!F78","v":0},{"$f":"'TGM Langdrehen '!G78","v":0},{"$f":"'TGM Langdrehen '!H78","v":0},null,null,null,null,0,0,0,0,0,0,0,0]
[null,null,null,{"$f":"'TGM Langdrehen '!A79","v":0},{"$f":"'TGM Langdrehen '!B79","v":0},{"$f":"'TGM Langdrehen '!C79","v":0},{"$f":"'TGM Langdrehen '!D79","v":0},{"$f":"'TGM Langdrehen '!E79","v":0},{"$f":"'TGM Langdrehen '!F79","v":0},{"$f":"'TGM Langdrehen '!G79","v":0},{"$f":"'TGM Langdrehen '!H79","v":0},null,null,null,null,0,0,0,0,0,0,0,0]
[null,null,null,{"$f":"'TGM Langdrehen '!A80","v":0},{"$f":"'TGM Langdrehen '!B80","v":0},{"$f":"'TGM Langdrehen '!C80","v":0},{"$f":"'TGM Langdrehen '!D80","v":0},{"$f":"'TGM Langdrehen '!E80","v":0},{"$f":"'TGM Langdrehen '!F80","v":0},{"$f":"'TGM Langdrehen '!G80","v":0},{"$f":"'TGM Langdrehen '!H80","v":0},null,null,null,null,0,0,0,0,0,0,0,0]
[null,null,null,{"$f":"'TGM Langdrehen '!A81","v":0},{"$f":"'TGM Langdrehen '!B81","v":0},{"$f":"'TGM Langdrehen '!C81","v":0},{"$f":"'TGM Langdrehen '!D81","v":0},{"$f":"'TGM Langdrehen '!E81","v":0},{"$f":"'TGM Langdrehen '!F81","v":0},{"$f":"'TGM Langdrehen '!G81","v":0},{"$f":"'TGM Langdrehen '!H81","v":0},null,null,null,null,0,0,0,0,0,0,0,0]
[null,null,null,{"$f":"'TGM Langdrehen '!A82","v":0},{"$f":"'TGM Langdrehen '!B82","v":0},{"$f":"'TGM Langdrehen '!C82","v":0},{"$f":"'TGM Langdrehen '!D82","v":0},{"$f":"'TGM Langdrehen '!E82","v":0},{"$f":"'TGM Langdrehen '!F82","v":0},{"$f":"'TGM Langdrehen '!G82","v":0},{"$f":"'TGM Langdrehen '!H82","v":0},null,null,null,null,0,0,0,0,0,0,0,0]
[null,null,null,{"$f":"'TGM Langdrehen '!A83","v":0},{"$f":"'TGM Langdrehen '!B83","v":0},{"$f":"'TGM Langdrehen '!C83","v":0},{"$f":"'TGM Langdrehen '!D83","v":0},{"$f":"'TGM Langdrehen '!E83","v":0},{"$f":"'TGM Langdrehen '!F83","v":0},{"$f":"'TGM Langdrehen '!G83","v":0},{"$f":"'TGM Langdrehen '!H83","v":0},null,null,null,null,0,0,0,0,0,0,0,0]
[null,null,null,{"$f":"'TGM Langdrehen '!A84","v":0},{"$f":"'TGM Langdrehen '!B84","v":0},{"$f":"'TGM Langdrehen '!C84","v":0},{"$f":"'TGM Langdrehen '!D84","v":0},{"$f":"'TGM Langdrehen '!E84","v":0},{"$f":"'TGM Langdrehen '!F84","v":0},{"$f":"'TGM Langdrehen '!G84","v":0},{"$f":"'TGM Langdrehen '!H84","v":0},null,null,null,null,0,0,0,0,0,0,0,0]
[null,null,null,{"$f":"'TGM Langdrehen '!A85","v":0},{"$f":"'TGM Langdrehen '!B85","v":0},{"$f":"'TGM Langdrehen '!C85","v":0},{"$f":"'TGM Langdrehen '!D85","v":0},{"$f":"'TGM Langdrehen '!E85","v":0},{"$f":"'TGM Langdrehen '!F85","v":0},{"$f":"'TGM Langdrehen '!G85","v":0},{"$f":"'TGM Langdrehen '!H85","v":0},null,null,null,null,0,0,0,0,0,0,0,0]
[null,null,null,{"$f":"'TGM Langdrehen '!A86","v":0},{"$f":"'TGM Langdrehen '!B86","v":0},{"$f":"'TGM Langdrehen '!C86","v":0},{"$f":"'TGM Langdrehen '!D86","v":0},{"$f":"'TGM Langdrehen '!E86","v":0},{"$f":"'TGM Langdrehen '!F86","v":0},{"$f":"'TGM Langdrehen '!G86","v":0},{"$f":"'TGM Langdrehen '!H86","v":0},null,null,null,null,0,0,0,0,0,0,0,0]
[null,null,null,{"$f":"'TGM Langdrehen '!A87","v":0},{"$f":"'TGM Langdrehen '!B87","v":0},{"$f":"'TGM Langdrehen '!C87","v":0},{"$f":"'TGM Langdrehen '!D87","v":0},{"$f":"'TGM Langdrehen '!E87","v":0},{"$f":"'TGM Langdrehen '!F87","v":0},{"$f":"'TGM Langdrehen '!G87","v":0},{"$f":"'TGM Langdrehen '!H87","v":0},null,null,null,null,0,0,0,0,0,0,0,0]
[null,null,null,{"$f":"'TGM Langdrehen '!A88","v":0},{"$f":"'TGM Langdrehen '!B88","v":0},{"$f":"'TGM Langdrehen '!C88","v":0},{"$f":"'TGM Langdrehen '!D88","v":0},{"$f":"'TGM Langdrehen '!E88","v":0},{"$f":"'TGM Langdrehen '!F88","v":0},{"$f":"'TGM Langdrehen '!G88","v":0},{"$f":"'TGM Langdrehen '!H88","v":0},null,null,null,null,0,0,0,0,0,0,0,0]
[null,null,null,{"$f":"'TGM Langdrehen '!A89","v":0},{"$f":"'TGM Langdrehen '!B89","v":0},{"$f":"'TGM Langdrehen '!C89","v":0},{"$f":"'TGM Langdrehen '!D89","v":0},{"$f":"'TGM Langdrehen '!E89","v":0},{"$f":"'TGM Langdrehen '!F89","v":0},{"$f":"'TGM Langdrehen '!G89","v":0},{"$f":"'TGM Langdrehen '!H89","v":0},null,null,null,null,0,0,0,0,0,0,0,0]
[null,null,null,{"$f":"'TGM Langdrehen '!A90","v":0},{"$f":"'TGM Langdrehen '!B90","v":0},{"$f":"'TGM Langdrehen '!C90","v":0},{"$f":"'TGM Langdrehen '!D90","v":0},{"$f":"'TGM Langdrehen '!E90","v":0},{"$f":"'TGM Langdrehen '!F90","v":0},{"$f":"'TGM Langdrehen '!G90","v":0},{"$f":"'TGM Langdrehen '!H90","v":0},null,null,null,null,0,0,0,0,0,0,0,0]
[null,null,null,{"$f":"'TGM Langdrehen '!A91","v":0},{"$f":"'TGM Langdrehen '!B91","v":0},{"$f":"'TGM Langdrehen '!C91","v":0},{"$f":"'TGM Langdrehen '!D91","v":0},{"$f":"'TGM Langdrehen '!E91","v":0},{"$f":"'TGM Langdrehen '!F91","v":0},{"$f":"'TGM Langdrehen '!G91","v":0},{"$f":"'TGM Langdrehen '!H91","v":0},null,null,null,null,0,0,0,0,0,0,0,0]
[null,null,null,{"$f":"'TGM Langdrehen '!A92","v":0},{"$f":"'TGM Langdrehen '!B92","v":0},{"$f":"'TGM Langdrehen '!C92","v":0},{"$f":"'TGM Langdrehen '!D92","v":0},{"$f":"'TGM Langdrehen '!E92","v":0},{"$f":"'TGM Langdrehen '!F92","v":0},{"$f":"'TGM Langdrehen '!G92","v":0},{"$f":"'TGM Langdrehen '!H92","v":0},null,null,null,null,0,0,0,0,0,0,0,0]
[null,null,null,{"$f":"'TGM Langdrehen '!A93","v":0},{"$f":"'TGM Langdrehen '!B93","v":0},{"$f":"'TGM Langdrehen '!C93","v":0},{"$f":"'TGM Langdrehen '!D93","v":0},{"$f":"'TGM Langdrehen '!E93","v":0},{"$f":"'TGM Langdrehen '!F93","v":0},{"$f":"'TGM Langdrehen '!G93","v":0},{"$f":"'TGM Langdrehen '!H93","v":0},null,null,null,null,0,0,0,0,0,0,0,0]
[null,null,null,{"$f":"'TGM Langdrehen '!A94","v":0},{"$f":"'TGM Langdrehen '!B94","v":0},{"$f":"'TGM Langdrehen '!C94","v":0},{"$f":"'TGM Langdrehen '!D94","v":0},{"$f":"'TGM Langdrehen '!E94","v":0},{"$f":"'TGM Langdrehen '!F94","v":0},{"$f":"'TGM Langdrehen '!G94","v":0},{"$f":"'TGM Langdrehen '!H94","v":0},null,null,null,null,0,0,0,0,0,0,0,0]
[null,null,null,{"$f":"'TGM Langdrehen '!A95","v":0},{"$f":"'TGM Langdrehen '!B95","v":0},{"$f":"'TGM Langdrehen '!C95","v":0},{"$f":"'TGM Langdrehen '!D95","v":0},{"$f":"'TGM Langdrehen '!E95","v":0},{"$f":"'TGM Langdrehen '!F95","v":0},{"$f":"'TGM Langdrehen '!G95","v":0},{"$f":"'TGM Langdrehen '!H95","v":0},null,null,null,null,0,0,0,0,0,0,0,0]
[null,null,null,{"$f":"'TGM Langdrehen '!A96","v":0},{"$f":"'TGM Langdrehen '!B96","v":0},{"$f":"'TGM Langdrehen '!C96","v":0},{"$f":"'TGM Langdrehen '!D96","v":0},{"$f":"'TGM Langdrehen '!E96","v":0},{"$f":"'TGM Langdrehen '!F96","v":0},{"$f":"'TGM Langdrehen '!G96","v":0},{"$f":"'TGM Langdrehen '!H96","v":0},null,null,null,null,0,0,0,0,0,0,0,0]
[null,null,null,{"$f":"'TGM Langdrehen '!A97","v":0},{"$f":"'TGM Langdrehen '!B97","v":0},{"$f":"'TGM Langdrehen '!C97","v":0},{"$f":"'TGM Langdrehen '!D97","v":0},{"$f":"'TGM Langdrehen '!E97","v":0},{"$f":"'TGM Langdrehen '!F97","v":0},{"$f":"'TGM Langdrehen '!G97","v":0},{"$f":"'TGM Langdrehen '!H97","v":0},null,null,null,null,0,0,0,0,0,0,0,0]
[null,null,null,{"$f":"'TGM Langdrehen '!A98","v":0},{"$f":"'TGM Langdrehen '!B98","v":0},{"$f":"'TGM Langdrehen '!C98","v":0},{"$f":"'TGM Langdrehen '!D98","v":0},{"$f":"'TGM Langdrehen '!E98","v":0},{"$f":"'TGM Langdrehen '!F98","v":0},{"$f":"'TGM Langdrehen '!G98","v":0},{"$f":"'TGM Langdrehen '!H98","v":0},null,null,null,null,0,0,0,0,0,0,0,0]
[null,null,null,{"$f":"'TGM Langdrehen '!A99","v":0},{"$f":"'TGM Langdrehen '!B99","v":0},{"$f":"'TGM Langdrehen '!C99","v":0},{"$f":"'TGM Langdrehen '!D99","v":0},{"$f":"'TGM Langdrehen '!E99","v":0},{"$f":"'TGM Langdrehen '!F99","v":0},{"$f":"'TGM Langdrehen '!G99","v":0},{"$f":"'TGM Langdrehen '!H99","v":0},null,null,null,null,0,0,0,0,0,0,0,0]
[null,null,null,{"$f":"'TGM Langdrehen '!A100","v":0},{"$f":"'TGM Langdrehen '!B100","v":0},{"$f":"'TGM Langdrehen '!C100","v":0},{"$f":"'TGM Langdrehen '!D100","v":0},{"$f":"'TGM Langdrehen '!E100","v":0},{"$f":"'TGM Langdrehen '!F100","v":0},{"$f":"'TGM Langdrehen '!G100","v":0},{"$f":"'TGM Langdrehen '!H100","v":0},null,null,null,null,0,0,0,0,0,0,0,0]
[null,null,null,{"$f":"'TGM Langdrehen '!A101","v":0},{"$f":"'TGM Langdrehen '!B101","v":0},{"$f":"'TGM Langdrehen '!C101","v":0},{"$f":"'TGM Langdrehen '!D101","v":0},{"$f":"'TGM Langdrehen '!E101","v":0},{"$f":"'TGM Langdrehen '!F101","v":0},{"$f":"'TGM Langdrehen '!G101","v":0},{"$f":"'TGM Langdrehen '!H101","v":0},null,null,null,null,0,0,0,0,0,0,0,0]
[null,null,null,{"$f":"'TGM Langdrehen '!A102","v":0},{"$f":"'TGM Langdrehen '!B102","v":0},{"$f":"'TGM Langdrehen '!C102","v":0},{"$f":"'TGM Langdrehen '!D102","v":0},{"$f":"'TGM Langdrehen '!E102","v":0},{"$f":"'TGM Langdrehen '!F102","v":0},{"$f":"'TGM Langdrehen '!G102","v":0},{"$f":"'TGM Langdrehen '!H102","v":0},null,null,null,null,0,0,0,0,0,0,0,0]
[null,null,null,{"$f":"'TGM Langdrehen '!A103","v":0},{"$f":"'TGM Langdrehen '!B103","v":0},{"$f":"'TGM Langdrehen '!C103","v":0},{"$f":"'TGM Langdrehen '!D103","v":0},{"$f":"'TGM Langdrehen '!E103","v":0},{"$f":"'TGM Langdrehen '!F103","v":0},{"$f":"'TGM Langdrehen '!G103","v":0},{"$f":"'TGM Langdrehen '!H103","v":0},null,null,null,null,0,0,0,0,0,0,0,0]
[null,null,null,{"$f":"'TGM Langdrehen '!A104","v":0},{"$f":"'TGM Langdrehen '!B104","v":0},{"$f":"'TGM Langdrehen '!C104","v":0},{"$f":"'TGM Langdrehen '!D104","v":0},{"$f":"'TGM Langdrehen '!E104","v":0},{"$f":"'TGM Langdrehen '!F104","v":0},{"$f":"'TGM Langdrehen '!G104","v":0},{"$f":"'TGM Langdrehen '!H104","v":0},null,null,null,null,0,0,0,0,0,0,0,0]
[null,null,null,{"$f":"'TGM Langdrehen '!A105","v":0},{"$f":"'TGM Langdrehen '!B105","v":0},{"$f":"'TGM Langdrehen '!C105","v":0},{"$f":"'TGM Langdrehen '!D105","v":0},{"$f":"'TGM Langdrehen '!E105","v":0},{"$f":"'TGM Langdrehen '!F105","v":0},{"$f":"'TGM Langdrehen '!G105","v":0},{"$f":"'TGM Langdrehen '!H105","v":0},null,null,null,null,0,0,0,0,0,0,0,0]
[null,null,null,{"$f":"'TGM Langdrehen '!A106","v":0},{"$f":"'TGM Langdrehen '!B106","v":0},{"$f":"'TGM Langdrehen '!C106","v":0},{"$f":"'TGM Langdrehen '!D106","v":0},{"$f":"'TGM Langdrehen '!E106","v":0},{"$f":"'TGM Langdrehen '!F106","v":0},{"$f":"'TGM Langdrehen '!G106","v":0},{"$f":"'TGM Langdrehen '!H106","v":0},null,null,null,null,0,0,0,0,0,0,0,0]
[null,null,null,{"$f":"'TGM Langdrehen '!A107","v":0},{"$f":"'TGM Langdrehen '!B107","v":0},{"$f":"'TGM Langdrehen '!C107","v":0},{"$f":"'TGM Langdrehen '!D107","v":0},{"$f":"'TGM Langdrehen '!E107","v":0},{"$f":"'TGM Langdrehen '!F107","v":0},{"$f":"'TGM Langdrehen '!G107","v":0},{"$f":"'TGM Langdrehen '!H107","v":0},null,null,null,null,0,0,0,0,0,0,0,0]
[null,null,null,{"$f":"'TGM Langdrehen '!A108","v":0},{"$f":"'TGM Langdrehen '!B108","v":0},{"$f":"'TGM Langdrehen '!C108","v":0},{"$f":"'TGM Langdrehen '!D108","v":0},{"$f":"'TGM Langdrehen '!E108","v":0},{"$f":"'TGM Langdrehen '!F108","v":0},{"$f":"'TGM Langdrehen '!G108","v":0},{"$f":"'TGM Langdrehen '!H108","v":0},null,null,null,null,0,0,0,0,0,0,0,0]
[null,null,null,{"$f":"'TGM Langdrehen '!A109","v":0},{"$f":"'TGM Langdrehen '!B109","v":0},{"$f":"'TGM Langdrehen '!C109","v":0},{"$f":"'TGM Langdrehen '!D109","v":0},{"$f":"'TGM Langdrehen '!E109","v":0},{"$f":"'TGM Langdrehen '!F109","v":0},{"$f":"'TGM Langdrehen '!G109","v":0},{"$f":"'TGM Langdrehen '!H109","v":0},null,null,null,null,0,0,0,0,0,0,0,0]
[null,null,null,{"$f":"'TGM Langdrehen '!A110","v":0},{"$f":"'TGM Langdrehen '!B110","v":0},{"$f":"'TGM Langdrehen '!C110","v":0},{"$f":"'TGM Langdrehen '!D110","v":0},{"$f":"'TGM Langdrehen '!E110","v":0},{"$f":"'TGM Langdrehen '!F110","v":0},{"$f":"'TGM Langdrehen '!G110","v":0},{"$f":"'TGM Langdrehen '!H110","v":0},null,null,null,null,0,0,0,0,0,0,0,0]
[null,null,null,{"$f":"'TGM Langdrehen '!A111","v":0},{"$f":"'TGM Langdrehen '!B111","v":0},{"$f":"'TGM Langdrehen '!C111","v":0},{"$f":"'TGM Langdrehen '!D111","v":0},{"$f":"'TGM Langdrehen '!E111","v":0},{"$f":"'TGM Langdrehen '!F111","v":0},{"$f":"'TGM Langdrehen '!G111","v":0},{"$f":"'TGM Langdrehen '!H111","v":0},null,null,null,null,0,0,0,0,0,0,0,0]
[null,null,null,{"$f":"'TGM Langdrehen '!A112","v":0},{"$f":"'TGM Langdrehen '!B112","v":0},{"$f":"'TGM Langdrehen '!C112","v":0},{"$f":"'TGM Langdrehen '!D112","v":0},{"$f":"'TGM Langdrehen '!E112","v":0},{"$f":"'TGM Langdrehen '!F112","v":0},{"$f":"'TGM Langdrehen '!G112","v":0},{"$f":"'TGM Langdrehen '!H112","v":0},null,null,null,null,0,0,0,0,0,0,0,0]
[null,null,null,{"$f":"'TGM Langdrehen '!A113","v":0},{"$f":"'TGM Langdrehen '!B113","v":0},{"$f":"'TGM Langdrehen '!C113","v":0},{"$f":"'TGM Langdrehen '!D113","v":0},{"$f":"'TGM Langdrehen '!E113","v":0},{"$f":"'TGM Langdrehen '!F113","v":0},{"$f":"'TGM Langdrehen '!G113","v":0},{"$f":"'TGM Langdrehen '!H113","v":0},null,null,null,null,0,0,0,0,0,0,0,0]
[null,null,null,{"$f":"'TGM Langdrehen '!A114","v":0},{"$f":"'TGM Langdrehen '!B114","v":0},{"$f":"'TGM Langdrehen '!C114","v":0},{"$f":"'TGM Langdrehen '!D114","v":0},{"$f":"'TGM Langdrehen '!E114","v":0},{"$f":"'TGM Langdrehen '!F114","v":0},{"$f":"'TGM Langdrehen '!G114","v":0},{"$f":"'TGM Langdrehen '!H114","v":0},null,null,null,null,0,0,0,0,0,0,0,0]
[null,null,null,{"$f":"'TGM Langdrehen '!A115","v":0},{"$f":"'TGM Langdrehen '!B115","v":0},{"$f":"'TGM Langdrehen '!C115","v":0},{"$f":"'TGM Langdrehen '!D115","v":0},{"$f":"'TGM Langdrehen '!E115","v":0},{"$f":"'TGM Langdrehen '!F115","v":0},{"$f":"'TGM Langdrehen '!G115","v":0},{"$f":"'TGM Langdrehen '!H115","v":0},null,null,null,null,0,0,0,0,0,0,0,0]
[null,null,null,{"$f":"'TGM Langdrehen '!A116","v":0},{"$f":"'TGM Langdrehen '!B116","v":0},{"$f":"'TGM Langdrehen '!C116","v":0},{"$f":"'TGM Langdrehen '!D116","v":0},{"$f":"'TGM Langdrehen '!E116","v":0},{"$f":"'TGM Langdrehen '!F116","v":0},{"$f":"'TGM Langdrehen '!G116","v":0},{"$f":"'TGM Langdrehen '!H116","v":0},null,null,null,null,0,0,0,0,0,0,0,0]
[]
[]
[null,null,null,"TGM Fräsen F pro Zahn",null,null,null,null,null,null,null,null,null,null,null,"TGM Fräsen F pro Zahn"]
[]
[null,null,null,{"$f":"'TGM Fräsen_F pro Zahn'!A6","v":0},{"$f":"'TGM Fräsen_F pro Zahn'!B6","v":0},{"$f":"'TGM Fräsen_F pro Zahn'!C6","v":0},{"$f":"'TGM Fräsen_F pro Zahn'!D6","v":0},{"$f":"'TGM Fräsen_F pro Zahn'!E6","v":0},{"$f":"'TGM Fräsen_F pro Zahn'!F6","v":0},null,null,null,null,null,null,0,0,0,0,0,0]
[null,null,null,{"$f":"'TGM Fräsen_F pro Zahn'!A7","v":0},{"$f":"'TGM Fräsen_F pro Zahn'!B7","v":0},{"$f":"'TGM Fräsen_F pro Zahn'!C7","v":0},{"$f":"'TGM Fräsen_F pro Zahn'!D7","v":0},{"$f":"'TGM Fräsen_F pro Zahn'!E7","v":0},{"$f":"'TGM Fräsen_F pro Zahn'!F7","v":0},null,null,null,null,null,null,0,0,0,0,0,0]
[null,null,null,{"$f":"'TGM Fräsen_F pro Zahn'!A8","v":0},{"$f":"'TGM Fräsen_F pro Zahn'!B8","v":0},{"$f":"'TGM Fräsen_F pro Zahn'!C8","v":0},{"$f":"'TGM Fräsen_F pro Zahn'!D8","v":0},{"$f":"'TGM Fräsen_F pro Zahn'!E8","v":0},{"$f":"'TGM Fräsen_F pro Zahn'!F8","v":0},null,null,null,null,null,null,0,0,0,0,0,0]
[null,null,null,{"$f":"'TGM Fräsen_F pro Zahn'!A9","v":0},{"$f":"'TGM Fräsen_F pro Zahn'!B9","v":0},{"$f":"'TGM Fräsen_F pro Zahn'!C9","v":0},{"$f":"'TGM Fräsen_F pro Zahn'!D9","v":0},{"$f":"'TGM Fräsen_F pro Zahn'!E9","v":0},{"$f":"'TGM Fräsen_F pro Zahn'!F9","v":0},null,null,null,null,null,null,0,0,0,0,0,0]
[null,null,null,{"$f":"'TGM Fräsen_F pro Zahn'!A10","v":0},{"$f":"'TGM Fräsen_F pro Zahn'!B10","v":0},{"$f":"'TGM Fräsen_F pro Zahn'!C10","v":0},{"$f":"'TGM Fräsen_F pro Zahn'!D10","v":0},{"$f":"'TGM Fräsen_F pro Zahn'!E10","v":0},{"$f":"'TGM Fräsen_F pro Zahn'!F10","v":0},null,null,null,null,null,null,0,0,0,0,0,0]
[null,null,null,{"$f":"'TGM Fräsen_F pro Zahn'!A11","v":0},{"$f":"'TGM Fräsen_F pro Zahn'!B11","v":0},{"$f":"'TGM Fräsen_F pro Zahn'!C11","v":0},{"$f":"'TGM Fräsen_F pro Zahn'!D11","v":0},{"$f":"'TGM Fräsen_F pro Zahn'!E11","v":0},{"$f":"'TGM Fräsen_F pro Zahn'!F11","v":0},null,null,null,null,null,null,0,0,0,0,0,0]
[null,null,null,{"$f":"'TGM Fräsen_F pro Zahn'!A12","v":0},{"$f":"'TGM Fräsen_F pro Zahn'!B12","v":0},{"$f":"'TGM Fräsen_F pro Zahn'!C12","v":0},{"$f":"'TGM Fräsen_F pro Zahn'!D12","v":0},{"$f":"'TGM Fräsen_F pro Zahn'!E12","v":0},{"$f":"'TGM Fräsen_F pro Zahn'!F12","v":0},null,null,null,null,null,null,0,0,0,0,0,0]
[null,null,null,{"$f":"'TGM Fräsen_F pro Zahn'!A13","v":0},{"$f":"'TGM Fräsen_F pro Zahn'!B13","v":0},{"$f":"'TGM Fräsen_F pro Zahn'!C13","v":0},{"$f":"'TGM Fräsen_F pro Zahn'!D13","v":0},{"$f":"'TGM Fräsen_F pro Zahn'!E13","v":0},{"$f":"'TGM Fräsen_F pro Zahn'!F13","v":0},null,null,null,null,null,null,0,0,0,0,0,0]
[null,null,null,{"$f":"'TGM Fräsen_F pro Zahn'!A14","v":0},{"$f":"'TGM Fräsen_F pro Zahn'!B14","v":0},{"$f":"'TGM Fräsen_F pro Zahn'!C14","v":0},{"$f":"'TGM Fräsen_F pro Zahn'!D14","v":0},{"$f":"'TGM Fräsen_F pro Zahn'!E14","v":0},{"$f":"'TGM Fräsen_F pro Zahn'!F14","v":0},null,null,null,null,null,null,0,0,0,0,0,0]
[null,null,null,{"$f":"'TGM Fräsen_F pro Zahn'!A15","v":0},{"$f":"'TGM Fräsen_F pro Zahn'!B15","v":0},{"$f":"'TGM Fräsen_F pro Zahn'!C15","v":0},{"$f":"'TGM Fräsen_F pro Zahn'!D15","v":0},{"$f":"'TGM Fräsen_F pro Zahn'!E15","v":0},{"$f":"'TGM Fräsen_F pro Zahn'!F15","v":0},null,null,null,null,null,null,0,0,0,0,0,0]
[null,null,null,{"$f":"'TGM Fräsen_F pro Zahn'!A16","v":0},{"$f":"'TGM Fräsen_F pro Zahn'!B16","v":0},{"$f":"'TGM Fräsen_F pro Zahn'!C16","v":0},{"$f":"'TGM Fräsen_F pro Zahn'!D16","v":0},{"$f":"'TGM Fräsen_F pro Zahn'!E16","v":0},{"$f":"'TGM Fräsen_F pro Zahn'!F16","v":0},null,null,null,null,null,null,0,0,0,0,0,0]
[null,null,null,{"$f":"'TGM Fräsen_F pro Zahn'!A17","v":0},{"$f":"'TGM Fräsen_F pro Zahn'!B17","v":0},{"$f":"'TGM Fräsen_F pro Zahn'!C17","v":0},{"$f":"'TGM Fräsen_F pro Zahn'!D17","v":0},{"$f":"'TGM Fräsen_F pro Zahn'!E17","v":0},{"$f":"'TGM Fräsen_F pro Zahn'!F17","v":0},null,null,null,null,null,null,0,0,0,0,0,0]
[null,null,null,{"$f":"'TGM Fräsen_F pro Zahn'!A18","v":0},{"$f":"'TGM Fräsen_F pro Zahn'!B18","v":0},{"$f":"'TGM Fräsen_F pro Zahn'!C18","v":0},{"$f":"'TGM Fräsen_F pro Zahn'!D18","v":0},{"$f":"'TGM Fräsen_F pro Zahn'!E18","v":0},{"$f":"'TGM Fräsen_F pro Zahn'!F18","v":0},null,null,null,null,null,null,0,0,0,0,0,0]
[null,null,null,{"$f":"'TGM Fräsen_F pro Zahn'!A19","v":0},{"$f":"'TGM Fräsen_F pro Zahn'!B19","v":0},{"$f":"'TGM Fräsen_F pro Zahn'!C19","v":0},{"$f":"'TGM Fräsen_F pro Zahn'!D19","v":0},{"$f":"'TGM Fräsen_F pro Zahn'!E19","v":0},{"$f":"'TGM Fräsen_F pro Zahn'!F19","v":0},null,null,null,null,null,null,0,0,0,0,0,0]
[null,null,null,{"$f":"'TGM Fräsen_F pro Zahn'!A20","v":0},{"$f":"'TGM Fräsen_F pro Zahn'!B20","v":0},{"$f":"'TGM Fräsen_F pro Zahn'!C20","v":0},{"$f":"'TGM Fräsen_F pro Zahn'!D20","v":0},{"$f":"'TGM Fräsen_F pro Zahn'!E20","v":0},{"$f":"'TGM Fräsen_F pro Zahn'!F20","v":0},null,null,null,null,null,null,0,0,0,0,0,0]
[null,null,null,{"$f":"'TGM Fräsen_F pro Zahn'!A21","v":0},{"$f":"'TGM Fräsen_F pro Zahn'!B21","v":0},{"$f":"'TGM Fräsen_F pro Zahn'!C21","v":0},{"$f":"'TGM Fräsen_F pro Zahn'!D21","v":0},{"$f":"'TGM Fräsen_F pro Zahn'!E21","v":0},{"$f":"'TGM Fräsen_F pro Zahn'!F21","v":0},null,null,null,null,null,null,0,0,0,0,0,0]
[null,null,null,{"$f":"'TGM Fräsen_F pro Zahn'!A22","v":0},{"$f":"'TGM Fräsen_F pro Zahn'!B22","v":0},{"$f":"'TGM Fräsen_F pro Zahn'!C22","v":0},{"$f":"'TGM Fräsen_F pro Zahn'!D22","v":0},{"$f":"'TGM Fräsen_F pro Zahn'!E22","v":0},{"$f":"'TGM Fräsen_F pro Zahn'!F22","v":0},null,null,null,null,null,null,0,0,0,0,0,0]
[null,null,null,{"$f":"'TGM Fräsen_F pro Zahn'!A23","v":0},{"$f":"'TGM Fräsen_F pro Zahn'!B23","v":0},{"$f":"'TGM Fräsen_F pro Zahn'!C23","v":0},{"$f":"'TGM Fräsen_F pro Zahn'!D23","v":0},{"$f":"'TGM Fräsen_F pro Zahn'!E23","v":0},{"$f":"'TGM Fräsen_F pro Zahn'!F23","v":0},null,null,null,null,null,null,0,0,0,0,0,0]
[null,null,null,{"$f":"'TGM Fräsen_F pro Zahn'!A24","v":0},{"$f":"'TGM Fräsen_F pro Zahn'!B24","v":0},{"$f":"'TGM Fräsen_F pro Zahn'!C24","v":0},{"$f":"'TGM Fräsen_F pro Zahn'!D24","v":0},{"$f":"'TGM Fräsen_F pro Zahn'!E24","v":0},{"$f":"'TGM Fräsen_F pro Zahn'!F24","v":0},null,null,null,null,null,null,0,0,0,0,0,0]
[null,null,null,{"$f":"'TGM Fräsen_F pro Zahn'!A25","v":0},{"$f":"'TGM Fräsen_F pro Zahn'!B25","v":0},{"$f":"'TGM Fräsen_F pro Zahn'!C25","v":0},{"$f":"'TGM Fräsen_F pro Zahn'!D25","v":0},{"$f":"'TGM Fräsen_F pro Zahn'!E25","v":0},{"$f":"'TGM Fräsen_F pro Zahn'!F25","v":0},null,null,null,null,null,null,0,0,0,0,0,0]
[null,null,null,{"$f":"'TGM Fräsen_F pro Zahn'!A26","v":0},{"$f":"'TGM Fräsen_F pro Zahn'!B26","v":0},{"$f":"'TGM Fräsen_F pro Zahn'!C26","v":0},{"$f":"'TGM Fräsen_F pro Zahn'!D26","v":0},{"$f":"'TGM Fräsen_F pro Zahn'!E26","v":0},{"$f":"'TGM Fräsen_F pro Zahn'!F26","v":0},null,null,null,null,null,null,0,0,0,0,0,0]
[null,null,null,{"$f":"'TGM Fräsen_F pro Zahn'!A27","v":0},{"$f":"'TGM Fräsen_F pro Zahn'!B27","v":0},{"$f":"'TGM Fräsen_F pro Zahn'!C27","v":0},{"$f":"'TGM Fräsen_F pro Zahn'!D27","v":0},{"$f":"'TGM Fräsen_F pro Zahn'!E27","v":0},{"$f":"'TGM Fräsen_F pro Zahn'!F27","v":0},null,null,null,null,null,null,0,0,0,0,0,0]
[null,null,null,{"$f":"'TGM Fräsen_F pro Zahn'!A28","v":0},{"$f":"'TGM Fräsen_F pro Zahn'!B28","v":0},{"$f":"'TGM Fräsen_F pro Zahn'!C28","v":0},{"$f":"'TGM Fräsen_F pro Zahn'!D28","v":0},{"$f":"'TGM Fräsen_F pro Zahn'!E28","v":0},{"$f":"'TGM Fräsen_F pro Zahn'!F28","v":0},null,null,null,null,null,null,0,0,0,0,0,0]
[null,null,null,{"$f":"'TGM Fräsen_F pro Zahn'!A29","v":0},{"$f":"'TGM Fräsen_F pro Zahn'!B29","v":0},{"$f":"'TGM Fräsen_F pro Zahn'!C29","v":0},{"$f":"'TGM Fräsen_F pro Zahn'!D29","v":0},{"$f":"'TGM Fräsen_F pro Zahn'!E29","v":0},{"$f":"'TGM Fräsen_F pro Zahn'!F29","v":0},null,null,null,null,null,null,0,0,0,0,0,0]
[null,null,null,{"$f":"'TGM Fräsen_F pro Zahn'!A30","v":0},{"$f":"'TGM Fräsen_F pro Zahn'!B30","v":0},{"$f":"'TGM Fräsen_F pro Zahn'!C30","v":0},{"$f":"'TGM Fräsen_F pro Zahn'!D30","v":0},{"$f":"'TGM Fräsen_F pro Zahn'!E30","v":0},{"$f":"'TGM Fräsen_F pro Zahn'!F30","v":0},null,null,null,null,null,null,0,0,0,0,0,0]
[null,null,null,{"$f":"'TGM Fräsen_F pro Zahn'!A31","v":0},{"$f":"'TGM Fräsen_F pro Zahn'!B31","v":0},{"$f":"'TGM Fräsen_F pro Zahn'!C31","v":0},{"$f":"'TGM Fräsen_F pro Zahn'!D31","v":0},{"$f":"'TGM Fräsen_F pro Zahn'!E31","v":0},{"$f":"'TGM Fräsen_F pro Zahn'!F31","v":0},null,null,null,null,null,null,0,0,0,0,0,0]
[null,null,null,{"$f":"'TGM Fräsen_F pro Zahn'!A32","v":0},{"$f":"'TGM Fräsen_F pro Zahn'!B32","v":0},{"$f":"'TGM Fräsen_F pro Zahn'!C32","v":0},{"$f":"'TGM Fräsen_F pro Zahn'!D32","v":0},{"$f":"'TGM Fräsen_F pro Zahn'!E32","v":0},{"$f":"'TGM Fräsen_F pro Zahn'!F32","v":0},null,null,null,null,null,null,0,0,0,0,0,0]
[null,null,null,{"$f":"'TGM Fräsen_F pro Zahn'!A33","v":0},{"$f":"'TGM Fräsen_F pro Zahn'!B33","v":0},{"$f":"'TGM Fräsen_F pro Zahn'!C33","v":0},{"$f":"'TGM Fräsen_F pro Zahn'!D33","v":0},{"$f":"'TGM Fräsen_F pro Zahn'!E33","v":0},{"$f":"'TGM Fräsen_F pro Zahn'!F33","v":0},null,null,null,null,null,null,0,0,0,0,0,0]
[null,null,null,{"$f":"'TGM Fräsen_F pro Zahn'!A34","v":0},{"$f":"'TGM Fräsen_F pro Zahn'!B34","v":0},{"$f":"'TGM Fräsen_F pro Zahn'!C34","v":0},{"$f":"'TGM Fräsen_F pro Zahn'!D34","v":0},{"$f":"'TGM Fräsen_F pro Zahn'!E34","v":0},{"$f":"'TGM Fräsen_F pro Zahn'!F34","v":0},null,null,null,null,null,null,0,0,0,0,0,0]
[null,null,null,{"$f":"'TGM Fräsen_F pro Zahn'!A35","v":0},{"$f":"'TGM Fräsen_F pro Zahn'!B35","v":0},{"$f":"'TGM Fräsen_F pro Zahn'!C35","v":0},{"$f":"'TGM Fräsen_F pro Zahn'!D35","v":0},{"$f":"'TGM Fräsen_F pro Zahn'!E35","v":0},{"$f":"'TGM Fräsen_F pro Zahn'!F35","v":0},null,null,null,null,null,null,0,0,0,0,0,0]
[null,null,null,{"$f":"'TGM Fräsen_F pro Zahn'!A36","v":0},{"$f":"'TGM Fräsen_F pro Zahn'!B36","v":0},{"$f":"'TGM Fräsen_F pro Zahn'!C36","v":0},{"$f":"'TGM Fräsen_F pro Zahn'!D36","v":0},{"$f":"'TGM Fräsen_F pro Zahn'!E36","v":0},{"$f":"'TGM Fräsen_F pro Zahn'!F36","v":0},null,null,null,null,null,null,0,0,0,0,0,0]
[null,null,null,{"$f":"'TGM Fräsen_F pro Zahn'!A37","v":0},{"$f":"'TGM Fräsen_F pro Zahn'!B37","v":0},{"$f":"'TGM Fräsen_F pro Zahn'!C37","v":0},{"$f":"'TGM Fräsen_F pro Zahn'!D37","v":0},{"$f":"'TGM Fräsen_F pro Zahn'!E37","v":0},{"$f":"'TGM Fräsen_F pro Zahn'!F37","v":0},null,null,null,null,null,null,0,0,0,0,0,0]
[null,null,null,{"$f":"'TGM Fräsen_F pro Zahn'!A38","v":0},{"$f":"'TGM Fräsen_F pro Zahn'!B38","v":0},{"$f":"'TGM Fräsen_F pro Zahn'!C38","v":0},{"$f":"'TGM Fräsen_F pro Zahn'!D38","v":0},{"$f":"'TGM Fräsen_F pro Zahn'!E38","v":0},{"$f":"'TGM Fräsen_F pro Zahn'!F38","v":0},null,null,null,null,null,null,0,0,0,0,0,0]
[null,null,null,{"$f":"'TGM Fräsen_F pro Zahn'!A39","v":0},{"$f":"'TGM Fräsen_F pro Zahn'!B39","v":0},{"$f":"'TGM Fräsen_F pro Zahn'!C39","v":0},{"$f":"'TGM Fräsen_F pro Zahn'!D39","v":0},{"$f":"'TGM Fräsen_F pro Zahn'!E39","v":0},{"$f":"'TGM Fräsen_F pro Zahn'!F39","v":0},null,null,null,null,null,null,0,0,0,0,0,0]
[null,null,null,{"$f":"'TGM Fräsen_F pro Zahn'!A40","v":0},{"$f":"'TGM Fräsen_F pro Zahn'!B40","v":0},{"$f":"'TGM Fräsen_F pro Zahn'!C40","v":0},{"$f":"'TGM Fräsen_F pro Zahn'!D40","v":0},{"$f":"'TGM Fräsen_F pro Zahn'!E40","v":0},{"$f":"'TGM Fräsen_F pro Zahn'!F40","v":0},null,null,null,null,null,null,0,0,0,0,0,0]
[null,null,null,{"$f":"'TGM Fräsen_F pro Zahn'!A41","v":0},{"$f":"'TGM Fräsen_F pro Zahn'!B41","v":0},{"$f":"'TGM Fräsen_F pro Zahn'!C41","v":0},{"$f":"'TGM Fräsen_F pro Zahn'!D41","v":0},{"$f":"'TGM Fräsen_F pro Zahn'!E41","v":0},{"$f":"'TGM Fräsen_F pro Zahn'!F41","v":0},null,null,null,null,null,null,0,0,0,0,0,0]
[null,null,null,{"$f":"'TGM Fräsen_F pro Zahn'!A42","v":0},{"$f":"'TGM Fräsen_F pro Zahn'!B42","v":0},{"$f":"'TGM Fräsen_F pro Zahn'!C42","v":0},{"$f":"'TGM Fräsen_F pro Zahn'!D42","v":0},{"$f":"'TGM Fräsen_F pro Zahn'!E42","v":0},{"$f":"'TGM Fräsen_F pro Zahn'!F42","v":0},null,null,null,null,null,null,0,0,0,0,0,0]
[null,null,null,{"$f":"'TGM Fräsen_F pro Zahn'!A43","v":0},{"$f":"'TGM Fräsen_F pro Zahn'!B43","v":0},{"$f":"'TGM Fräsen_F pro Zahn'!C43","v":0},{"$f":"'TGM Fräsen_F pro Zahn'!D43","v":0},{"$f":"'TGM Fräsen_F pro Zahn'!E43","v":0},{"$f":"'TGM Fräsen_F pro Zahn'!F43","v":0},null,null,null,null,null,null,0,0,0,0,0,0]
[null,null,null,{"$f":"'TGM Fräsen_F pro Zahn'!A44","v":0},{"$f":"'TGM Fräsen_F pro Zahn'!B44","v":0},{"$f":"'TGM Fräsen_F pro Zahn'!C44","v":0},{"$f":"'TGM Fräsen_F pro Zahn'!D44","v":0},{"$f":"'TGM Fräsen_F pro Zahn'!E44","v":0},{"$f":"'TGM Fräsen_F pro Zahn'!F44","v":0},null,null,null,null,null,null,0,0,0,0,0,0]
[null,null,null,{"$f":"'TGM Fräsen_F pro Zahn'!A45","v":0},{"$f":"'TGM Fräsen_F pro Zahn'!B45","v":0},{"$f":"'TGM Fräsen_F pro Zahn'!C45","v":0},{"$f":"'TGM Fräsen_F pro Zahn'!D45","v":0},{"$f":"'TGM Fräsen_F pro Zahn'!E45","v":0},{"$f":"'TGM Fräsen_F pro Zahn'!F45","v":0},null,null,null,null,null,null,0,0,0,0,0,0]
[null,null,null,{"$f":"'TGM Fräsen_F pro Zahn'!A46","v":0},{"$f":"'TGM Fräsen_F pro Zahn'!B46","v":0},{"$f":"'TGM Fräsen_F pro Zahn'!C46","v":0},{"$f":"'TGM Fräsen_F pro Zahn'!D46","v":0},{"$f":"'TGM Fräsen_F pro Zahn'!E46","v":0},{"$f":"'TGM Fräsen_F pro Zahn'!F46","v":0},null,null,null,null,null,null,0,0,0,0,0,0]
[null,null,null,{"$f":"'TGM Fräsen_F pro Zahn'!A47","v":0},{"$f":"'TGM Fräsen_F pro Zahn'!B47","v":0},{"$f":"'TGM Fräsen_F pro Zahn'!C47","v":0},{"$f":"'TGM Fräsen_F pro Zahn'!D47","v":0},{"$f":"'TGM Fräsen_F pro Zahn'!E47","v":0},{"$f":"'TGM Fräsen_F pro Zahn'!F47","v":0},null,null,null,null,null,null,0,0,0,0,0,0]
[null,null,null,{"$f":"'TGM Fräsen_F pro Zahn'!A48","v":0},{"$f":"'TGM Fräsen_F pro Zahn'!B48","v":0},{"$f":"'TGM Fräsen_F pro Zahn'!C48","v":0},{"$f":"'TGM Fräsen_F pro Zahn'!D48","v":0},{"$f":"'TGM Fräsen_F pro Zahn'!E48","v":0},{"$f":"'TGM Fräsen_F pro Zahn'!F48","v":0},null,null,null,null,null,null,0,0,0,0,0,0]
[null,null,null,{"$f":"'TGM Fräsen_F pro Zahn'!A49","v":0},{"$f":"'TGM Fräsen_F pro Zahn'!B49","v":0},{"$f":"'TGM Fräsen_F pro Zahn'!C49","v":0},{"$f":"'TGM Fräsen_F pro Zahn'!D49","v":0},{"$f":"'TGM Fräsen_F pro Zahn'!E49","v":0},{"$f":"'TGM Fräsen_F pro Zahn'!F49","v":0},null,null,null,null,null,null,0,0,0,0,0,0]
[null,null,null,{"$f":"'TGM Fräsen_F pro Zahn'!A50","v":0},{"$f":"'TGM Fräsen_F pro Zahn'!B50","v":0},{"$f":"'TGM Fräsen_F pro Zahn'!C50","v":0},{"$f":"'TGM Fräsen_F pro Zahn'!D50","v":0},{"$f":"'TGM Fräsen_F pro Zahn'!E50","v":0},{"$f":"'TGM Fräsen_F pro Zahn'!F50","v":0},null,null,null,null,null,null,0,0,0,0,0,0]
[null,null,null,{"$f":"'TGM Fräsen_F pro Zahn'!A51","v":0},{"$f":"'TGM Fräsen_F pro Zahn'!B51","v":0},{"$f":"'TGM Fräsen_F pro Zahn'!C51","v":0},{"$f":"'TGM Fräsen_F pro Zahn'!D51","v":0},{"$f":"'TGM Fräsen_F pro Zahn'!E51","v":0},{"$f":"'TGM Fräsen_F pro Zahn'!F51","v":0},null,null,null,null,null,null,0,0,0,0,0,0]
[null,null,null,{"$f":"'TGM Fräsen_F pro Zahn'!A52","v":0},{"$f":"'TGM Fräsen_F pro Zahn'!B52","v":0},{"$f":"'TGM Fräsen_F pro Zahn'!C52","v":0},{"$f":"'TGM Fräsen_F pro Zahn'!D52","v":0},{"$f":"'TGM Fräsen_F pro Zahn'!E52","v":0},{"$f":"'TGM Fräsen_F pro Zahn'!F52","v":0},null,null,null,null,null,null,0,0,0,0,0,0]
[null,null,null,{"$f":"'TGM Fräsen_F pro Zahn'!A53","v":0},{"$f":"'TGM Fräsen_F pro Zahn'!B53","v":0},{"$f":"'TGM Fräsen_F pro Zahn'!C53","v":0},{"$f":"'TGM Fräsen_F pro Zahn'!D53","v":0},{"$f":"'TGM Fräsen_F pro Zahn'!E53","v":0},{"$f":"'TGM Fräsen_F pro Zahn'!F53","v":0},null,null,null,null,null,null,0,0,0,0,0,0]
[null,null,null,{"$f":"'TGM Fräsen_F pro Zahn'!A54","v":0},{"$f":"'TGM Fräsen_F pro Zahn'!B54","v":0},{"$f":"'TGM Fräsen_F pro Zahn'!C54","v":0},{"$f":"'TGM Fräsen_F pro Zahn'!D54","v":0},{"$f":"'TGM Fräsen_F pro Zahn'!E54","v":0},{"$f":"'TGM Fräsen_F pro Zahn'!F54","v":0},null,null,null,null,null,null,0,0,0,0,0,0]
[null,null,null,{"$f":"'TGM Fräsen_F pro Zahn'!A55","v":0},{"$f":"'TGM Fräsen_F pro Zahn'!B55","v":0},{"$f":"'TGM Fräsen_F pro Zahn'!C55","v":0},{"$f":"'TGM Fräsen_F pro Zahn'!D55","v":0},{"$f":"'TGM Fräsen_F pro Zahn'!E55","v":0},{"$f":"'TGM Fräsen_F pro Zahn'!F55","v":0},null,null,null,null,null,null,0,0,0,0,0,0]
[null,null,null,{"$f":"'TGM Fräsen_F pro Zahn'!A56","v":0},{"$f":"'TGM Fräsen_F pro Zahn'!B56","v":0},{"$f":"'TGM Fräsen_F pro Zahn'!C56","v":0},{"$f":"'TGM Fräsen_F pro Zahn'!D56","v":0},{"$f":"'TGM Fräsen_F pro Zahn'!E56","v":0},{"$f":"'TGM Fräsen_F pro Zahn'!F56","v":0},null,null,null,null,null,null,0,0,0,0,0,0]
[null,null,null,{"$f":"'TGM Fräsen_F pro Zahn'!A57","v":0},{"$f":"'TGM Fräsen_F pro Zahn'!B57","v":0},{"$f":"'TGM Fräsen_F pro Zahn'!C57","v":0},{"$f":"'TGM Fräsen_F pro Zahn'!D57","v":0},{"$f":"'TGM Fräsen_F pro Zahn'!E57","v":0},{"$f":"'TGM Fräsen_F pro Zahn'!F57","v":0},null,null,null,null,null,null,0,0,0,0,0,0]
[null,null,null,{"$f":"'TGM Fräsen_F pro Zahn'!A58","v":0},{"$f":"'TGM Fräsen_F pro Zahn'!B58","v":0},{"$f":"'TGM Fräsen_F pro Zahn'!C58","v":0},{"$f":"'TGM Fräsen_F pro Zahn'!D58","v":0},{"$f":"'TGM Fräsen_F pro Zahn'!E58","v":0},{"$f":"'TGM Fräsen_F pro Zahn'!F58","v":0},null,null,null,null,null,null,0,0,0,0,0,0]
[null,null,null,{"$f":"'TGM Fräsen_F pro Zahn'!A59","v":0},{"$f":"'TGM Fräsen_F pro Zahn'!B59","v":0},{"$f":"'TGM Fräsen_F pro Zahn'!C59","v":0},{"$f":"'TGM Fräsen_F pro Zahn'!D59","v":0},{"$f":"'TGM Fräsen_F pro Zahn'!E59","v":0},{"$f":"'TGM Fräsen_F pro Zahn'!F59","v":0},null,null,null,null,null,null,0,0,0,0,0,0]
[null,null,null,{"$f":"'TGM Fräsen_F pro Zahn'!A60","v":0},{"$f":"'TGM Fräsen_F pro Zahn'!B60","v":0},{"$f":"'TGM Fräsen_F pro Zahn'!C60","v":0},{"$f":"'TGM Fräsen_F pro Zahn'!D60","v":0},{"$f":"'TGM Fräsen_F pro Zahn'!E60","v":0},{"$f":"'TGM Fräsen_F pro Zahn'!F60","v":0},null,null,null,null,null,null,0,0,0,0,0,0]
[null,null,null,{"$f":"'TGM Fräsen_F pro Zahn'!A61","v":0},{"$f":"'TGM Fräsen_F pro Zahn'!B61","v":0},{"$f":"'TGM Fräsen_F pro Zahn'!C61","v":0},{"$f":"'TGM Fräsen_F pro Zahn'!D61","v":0},{"$f":"'TGM Fräsen_F pro Zahn'!E61","v":0},{"$f":"'TGM Fräsen_F pro Zahn'!F61","v":0},null,null,null,null,null,null,0,0,0,0,0,0]
[null,null,null,{"$f":"'TGM Fräsen_F pro Zahn'!A62","v":0},{"$f":"'TGM Fräsen_F pro Zahn'!B62","v":0},{"$f":"'TGM Fräsen_F pro Zahn'!C62","v":0},{"$f":"'TGM Fräsen_F pro Zahn'!D62","v":0},{"$f":"'TGM Fräsen_F pro Zahn'!E62","v":0},{"$f":"'TGM Fräsen_F pro Zahn'!F62","v":0},null,null,null,null,null,null,0,0,0,0,0,0]
[null,null,null,{"$f":"'TGM Fräsen_F pro Zahn'!A63","v":0},{"$f":"'TGM Fräsen_F pro Zahn'!B63","v":0},{"$f":"'TGM Fräsen_F pro Zahn'!C63","v":0},{"$f":"'TGM Fräsen_F pro Zahn'!D63","v":0},{"$f":"'TGM Fräsen_F pro Zahn'!E63","v":0},{"$f":"'TGM Fräsen_F pro Zahn'!F63","v":0},null,null,null,null,null,null,0,0,0,0,0,0]
[null,null,null,{"$f":"'TGM Fräsen_F pro Zahn'!A64","v":0},{"$f":"'TGM Fräsen_F pro Zahn'!B64","v":0},{"$f":"'TGM Fräsen_F pro Zahn'!C64","v":0},{"$f":"'TGM Fräsen_F pro Zahn'!D64","v":0},{"$f":"'TGM Fräsen_F pro Zahn'!E64","v":0},{"$f":"'TGM Fräsen_F pro Zahn'!F64","v":0},null,null,null,null,null,null,0,0,0,0,0,0]
[null,null,null,{"$f":"'TGM Fräsen_F pro Zahn'!A65","v":0},{"$f":"'TGM Fräsen_F pro Zahn'!B65","v":0},{"$f":"'TGM Fräsen_F pro Zahn'!C65","v":0},{"$f":"'TGM Fräsen_F pro Zahn'!D65","v":0},{"$f":"'TGM Fräsen_F pro Zahn'!E65","v":0},{"$f":"'TGM Fräsen_F pro Zahn'!F65","v":0},null,null,null,null,null,null,0,0,0,0,0,0]
[null,null,null,{"$f":"'TGM Fräsen_F pro Zahn'!A66","v":0},{"$f":"'TGM Fräsen_F pro Zahn'!B66","v":0},{"$f":"'TGM Fräsen_F pro Zahn'!C66","v":0},{"$f":"'TGM Fräsen_F pro Zahn'!D66","v":0},{"$f":"'TGM Fräsen_F pro Zahn'!E66","v":0},{"$f":"'TGM Fräsen_F pro Zahn'!F66","v":0},null,null,null,null,null,null,0,0,0,0,0,0]
[null,null,null,{"$f":"'TGM Fräsen_F pro Zahn'!A67","v":0},{"$f":"'TGM Fräsen_F pro Zahn'!B67","v":0},{"$f":"'TGM Fräsen_F pro Zahn'!C67","v":0},{"$f":"'TGM Fräsen_F pro Zahn'!D67","v":0},{"$f":"'TGM Fräsen_F pro Zahn'!E67","v":0},{"$f":"'TGM Fräsen_F pro Zahn'!F67","v":0},null,null,null,null,null,null,0,0,0,0,0,0]
[null,null,null,{"$f":"'TGM Fräsen_F pro Zahn'!A68","v":0},{"$f":"'TGM Fräsen_F pro Zahn'!B68","v":0},{"$f":"'TGM Fräsen_F pro Zahn'!C68","v":0},{"$f":"'TGM Fräsen_F pro Zahn'!D68","v":0},{"$f":"'TGM Fräsen_F pro Zahn'!E68","v":0},{"$f":"'TGM Fräsen_F pro Zahn'!F68","v":0},null,null,null,null,null,null,0,0,0,0,0,0]
[null,null,null,{"$f":"'TGM Fräsen_F pro Zahn'!A69","v":0},{"$f":"'TGM Fräsen_F pro Zahn'!B69","v":0},{"$f":"'TGM Fräsen_F pro Zahn'!C69","v":0},{"$f":"'TGM Fräsen_F pro Zahn'!D69","v":0},{"$f":"'TGM Fräsen_F pro Zahn'!E69","v":0},{"$f":"'TGM Fräsen_F pro Zahn'!F69","v":0},null,null,null,null,null,null,0,0,0,0,0,0]
[null,null,null,{"$f":"'TGM Fräsen_F pro Zahn'!A70","v":0},{"$f":"'TGM Fräsen_F pro Zahn'!B70","v":0},{"$f":"'TGM Fräsen_F pro Zahn'!C70","v":0},{"$f":"'TGM Fräsen_F pro Zahn'!D70","v":0},{"$f":"'TGM Fräsen_F pro Zahn'!E70","v":0},{"$f":"'TGM Fräsen_F pro Zahn'!F70","v":0},null,null,null,null,null,null,0,0,0,0,0,0]
[null,null,null,{"$f":"'TGM Fräsen_F pro Zahn'!A71","v":0},{"$f":"'TGM Fräsen_F pro Zahn'!B71","v":0},{"$f":"'TGM Fräsen_F pro Zahn'!C71","v":0},{"$f":"'TGM Fräsen_F pro Zahn'!D71","v":0},{"$f":"'TGM Fräsen_F pro Zahn'!E71","v":0},{"$f":"'TGM Fräsen_F pro Zahn'!F71","v":0},null,null,null,null,null,null,0,0,0,0,0,0]
[null,null,null,{"$f":"'TGM Fräsen_F pro Zahn'!A72","v":0},{"$f":"'TGM Fräsen_F pro Zahn'!B72","v":0},{"$f":"'TGM Fräsen_F pro Zahn'!C72","v":0},{"$f":"'TGM Fräsen_F pro Zahn'!D72","v":0},{"$f":"'TGM Fräsen_F pro Zahn'!E72","v":0},{"$f":"'TGM Fräsen_F pro Zahn'!F72","v":0},null,null,null,null,null,null,0,0,0,0,0,0]
[null,null,null,{"$f":"'TGM Fräsen_F pro Zahn'!A73","v":0},{"$f":"'TGM Fräsen_F pro Zahn'!B73","v":0},{"$f":"'TGM Fräsen_F pro Zahn'!C73","v":0},{"$f":"'TGM Fräsen_F pro Zahn'!D73","v":0},{"$f":"'TGM Fräsen_F pro Zahn'!E73","v":0},{"$f":"'TGM Fräsen_F pro Zahn'!F73","v":0},null,null,null,null,null,null,0,0,0,0,0,0]
[null,null,null,{"$f":"'TGM Fräsen_F pro Zahn'!A74","v":0},{"$f":"'TGM Fräsen_F pro Zahn'!B74","v":0},{"$f":"'TGM Fräsen_F pro Zahn'!C74","v":0},{"$f":"'TGM Fräsen_F pro Zahn'!D74","v":0},{"$f":"'TGM Fräsen_F pro Zahn'!E74","v":0},{"$f":"'TGM Fräsen_F pro Zahn'!F74","v":0},null,null,null,null,null,null,0,0,0,0,0,0]
[null,null,null,{"$f":"'TGM Fräsen_F pro Zahn'!A75","v":0},{"$f":"'TGM Fräsen_F pro Zahn'!B75","v":0},{"$f":"'TGM Fräsen_F pro Zahn'!C75","v":0},{"$f":"'TGM Fräsen_F pro Zahn'!D75","v":0},{"$f":"'TGM Fräsen_F pro Zahn'!E75","v":0},{"$f":"'TGM Fräsen_F pro Zahn'!F75","v":0},null,null,null,null,null,null,0,0,0,0,0,0]
[null,null,null,{"$f":"'TGM Fräsen_F pro Zahn'!A76","v":0},{"$f":"'TGM Fräsen_F pro Zahn'!B76","v":0},{"$f":"'TGM Fräsen_F pro Zahn'!C76","v":0},{"$f":"'TGM Fräsen_F pro Zahn'!D76","v":0},{"$f":"'TGM Fräsen_F pro Zahn'!E76","v":0},{"$f":"'TGM Fräsen_F pro Zahn'!F76","v":0},null,null,null,null,null,null,0,0,0,0,0,0]
[null,null,null,{"$f":"'TGM Fräsen_F pro Zahn'!A77","v":0},{"$f":"'TGM Fräsen_F pro Zahn'!B77","v":0},{"$f":"'TGM Fräsen_F pro Zahn'!C77","v":0},{"$f":"'TGM Fräsen_F pro Zahn'!D77","v":0},{"$f":"'TGM Fräsen_F pro Zahn'!E77","v":0},{"$f":"'TGM Fräsen_F pro Zahn'!F77","v":0},null,null,null,null,null,null,0,0,0,0,0,0]
[null,null,null,{"$f":"'TGM Fräsen_F pro Zahn'!A78","v":0},{"$f":"'TGM Fräsen_F pro Zahn'!B78","v":0},{"$f":"'TGM Fräsen_F pro Zahn'!C78","v":0},{"$f":"'TGM Fräsen_F pro Zahn'!D78","v":0},{"$f":"'TGM Fräsen_F pro Zahn'!E78","v":0},{"$f":"'TGM Fräsen_F pro Zahn'!F78","v":0},null,null,null,null,null,null,0,0,0,0,0,0]
[null,null,null,{"$f":"'TGM Fräsen_F pro Zahn'!A79","v":0},{"$f":"'TGM Fräsen_F pro Zahn'!B79","v":0},{"$f":"'TGM Fräsen_F pro Zahn'!C79","v":0},{"$f":"'TGM Fräsen_F pro Zahn'!D79","v":0},{"$f":"'TGM Fräsen_F pro Zahn'!E79","v":0},{"$f":"'TGM Fräsen_F pro Zahn'!F79","v":0},null,null,null,null,null,null,0,0,0,0,0,0]
[null,null,null,{"$f":"'TGM Fräsen_F pro Zahn'!A80","v":0},{"$f":"'TGM Fräsen_F pro Zahn'!B80","v":0},{"$f":"'TGM Fräsen_F pro Zahn'!C80","v":0},{"$f":"'TGM Fräsen_F pro Zahn'!D80","v":0},{"$f":"'TGM Fräsen_F pro Zahn'!E80","v":0},{"$f":"'TGM Fräsen_F pro Zahn'!F80","v":0},null,null,null,null,null,null,0,0,0,0,0,0]
[null,null,null,{"$f":"'TGM Fräsen_F pro Zahn'!A81","v":0},{"$f":"'TGM Fräsen_F pro Zahn'!B81","v":0},{"$f":"'TGM Fräsen_F pro Zahn'!C81","v":0},{"$f":"'TGM Fräsen_F pro Zahn'!D81","v":0},{"$f":"'TGM Fräsen_F pro Zahn'!E81","v":0},{"$f":"'TGM Fräsen_F pro Zahn'!F81","v":0},null,null,null,null,null,null,0,0,0,0,0,0]
[null,null,null,{"$f":"'TGM Fräsen_F pro Zahn'!A82","v":0},{"$f":"'TGM Fräsen_F pro Zahn'!B82","v":0},{"$f":"'TGM Fräsen_F pro Zahn'!C82","v":0},{"$f":"'TGM Fräsen_F pro Zahn'!D82","v":0},{"$f":"'TGM Fräsen_F pro Zahn'!E82","v":0},{"$f":"'TGM Fräsen_F pro Zahn'!F82","v":0},null,null,null,null,null,null,0,0,0,0,0,0]
[null,null,null,{"$f":"'TGM Fräsen_F pro Zahn'!A83","v":0},{"$f":"'TGM Fräsen_F pro Zahn'!B83","v":0},{"$f":"'TGM Fräsen_F pro Zahn'!C83","v":0},{"$f":"'TGM Fräsen_F pro Zahn'!D83","v":0},{"$f":"'TGM Fräsen_F pro Zahn'!E83","v":0},{"$f":"'TGM Fräsen_F pro Zahn'!F83","v":0},null,null,null,null,null,null,0,0,0,0,0,0]
[null,null,null,{"$f":"'TGM Fräsen_F pro Zahn'!A84","v":0},{"$f":"'TGM Fräsen_F pro Zahn'!B84","v":0},{"$f":"'TGM Fräsen_F pro Zahn'!C84","v":0},{"$f":"'TGM Fräsen_F pro Zahn'!D84","v":0},{"$f":"'TGM Fräsen_F pro Zahn'!E84","v":0},{"$f":"'TGM Fräsen_F pro Zahn'!F84","v":0},null,null,null,null,null,null,0,0,0,0,0,0]
[null,null,null,{"$f":"'TGM Fräsen_F pro Zahn'!A85","v":0},{"$f":"'TGM Fräsen_F pro Zahn'!B85","v":0},{"$f":"'TGM Fräsen_F pro Zahn'!C85","v":0},{"$f":"'TGM Fräsen_F pro Zahn'!D85","v":0},{"$f":"'TGM Fräsen_F pro Zahn'!E85","v":0},{"$f":"'TGM Fräsen_F pro Zahn'!F85","v":0},null,null,null,null,null,null,0,0,0,0,0,0]
[null,null,null,{"$f":"'TGM Fräsen_F pro Zahn'!A86","v":0},{"$f":"'TGM Fräsen_F pro Zahn'!B86","v":0},{"$f":"'TGM Fräsen_F pro Zahn'!C86","v":0},{"$f":"'TGM Fräsen_F pro Zahn'!D86","v":0},{"$f":"'TGM Fräsen_F pro Zahn'!E86","v":0},{"$f":"'TGM Fräsen_F pro Zahn'!F86","v":0},null,null,null,null,null,null,0,0,0,0,0,0]
[null,null,null,{"$f":"'TGM Fräsen_F pro Zahn'!A87","v":0},{"$f":"'TGM Fräsen_F pro Zahn'!B87","v":0},{"$f":"'TGM Fräsen_F pro Zahn'!C87","v":0},{"$f":"'TGM Fräsen_F pro Zahn'!D87","v":0},{"$f":"'TGM Fräsen_F pro Zahn'!E87","v":0},{"$f":"'TGM Fräsen_F pro Zahn'!F87","v":0},null,null,null,null,null,null,0,0,0,0,0,0]
[null,null,null,{"$f":"'TGM Fräsen_F pro Zahn'!A88","v":0},{"$f":"'TGM Fräsen_F pro Zahn'!B88","v":0},{"$f":"'TGM Fräsen_F pro Zahn'!C88","v":0},{"$f":"'TGM Fräsen_F pro Zahn'!D88","v":0},{"$f":"'TGM Fräsen_F pro Zahn'!E88","v":0},{"$f":"'TGM Fräsen_F pro Zahn'!F88","v":0},null,null,null,null,null,null,0,0,0,0,0,0]
[null,null,null,{"$f":"'TGM Fräsen_F pro Zahn'!A89","v":0},{"$f":"'TGM Fräsen_F pro Zahn'!B89","v":0},{"$f":"'TGM Fräsen_F pro Zahn'!C89","v":0},{"$f":"'TGM Fräsen_F pro Zahn'!D89","v":0},{"$f":"'TGM Fräsen_F pro Zahn'!E89","v":0},{"$f":"'TGM Fräsen_F pro Zahn'!F89","v":0},null,null,null,null,null,null,0,0,0,0,0,0]
[null,null,null,{"$f":"'TGM Fräsen_F pro Zahn'!A90","v":0},{"$f":"'TGM Fräsen_F pro Zahn'!B90","v":0},{"$f":"'TGM Fräsen_F pro Zahn'!C90","v":0},{"$f":"'TGM Fräsen_F pro Zahn'!D90","v":0},{"$f":"'TGM Fräsen_F pro Zahn'!E90","v":0},{"$f":"'TGM Fräsen_F pro Zahn'!F90","v":0},null,null,null,null,null,null,0,0,0,0,0,0]
[null,null,null,{"$f":"'TGM Fräsen_F pro Zahn'!A91","v":0},{"$f":"'TGM Fräsen_F pro Zahn'!B91","v":0},{"$f":"'TGM Fräsen_F pro Zahn'!C91","v":0},{"$f":"'TGM Fräsen_F pro Zahn'!D91","v":0},{"$f":"'TGM Fräsen_F pro Zahn'!E91","v":0},{"$f":"'TGM Fräsen_F pro Zahn'!F91","v":0},null,null,null,null,null,null,0,0,0,0,0,0]
[null,null,null,{"$f":"'TGM Fräsen_F pro Zahn'!A92","v":0},{"$f":"'TGM Fräsen_F pro Zahn'!B92","v":0},{"$f":"'TGM Fräsen_F pro Zahn'!C92","v":0},{"$f":"'TGM Fräsen_F pro Zahn'!D92","v":0},{"$f":"'TGM Fräsen_F pro Zahn'!E92","v":0},{"$f":"'TGM Fräsen_F pro Zahn'!F92","v":0},null,null,null,null,null,null,0,0,0,0,0,0]
[null,null,null,{"$f":"'TGM Fräsen_F pro Zahn'!A93","v":0},{"$f":"'TGM Fräsen_F pro Zahn'!B93","v":0},{"$f":"'TGM Fräsen_F pro Zahn'!C93","v":0},{"$f":"'TGM Fräsen_F pro Zahn'!D93","v":0},{"$f":"'TGM Fräsen_F pro Zahn'!E93","v":0},{"$f":"'TGM Fräsen_F pro Zahn'!F93","v":0},null,null,null,null,null,null,0,0,0,0,0,0]
[null,null,null,{"$f":"'TGM Fräsen_F pro Zahn'!A94","v":0},{"$f":"'TGM Fräsen_F pro Zahn'!B94","v":0},{"$f":"'TGM Fräsen_F pro Zahn'!C94","v":0},{"$f":"'TGM Fräsen_F pro Zahn'!D94","v":0},{"$f":"'TGM Fräsen_F pro Zahn'!E94","v":0},{"$f":"'TGM Fräsen_F pro Zahn'!F94","v":0},null,null,null,null,null,null,0,0,0,0,0,0]
[null,null,null,{"$f":"'TGM Fräsen_F pro Zahn'!A95","v":0},{"$f":"'TGM Fräsen_F pro Zahn'!B95","v":0},{"$f":"'TGM Fräsen_F pro Zahn'!C95","v":0},{"$f":"'TGM Fräsen_F pro Zahn'!D95","v":0},{"$f":"'TGM Fräsen_F pro Zahn'!E95","v":0},{"$f":"'TGM Fräsen_F pro Zahn'!F95","v":0},null,null,null,null,null,null,0,0,0,0,0,0]
[null,null,null,{"$f":"'TGM Fräsen_F pro Zahn'!A96","v":0},{"$f":"'TGM Fräsen_F pro Zahn'!B96","v":0},{"$f":"'TGM Fräsen_F pro Zahn'!C96","v":0},{"$f":"'TGM Fräsen_F pro Zahn'!D96","v":0},{"$f":"'TGM Fräsen_F pro Zahn'!E96","v":0},{"$f":"'TGM Fräsen_F pro Zahn'!F96","v":0},null,null,null,null,null,null,0,0,0,0,0,0]
[null,null,null,{"$f":"'TGM Fräsen_F pro Zahn'!A97","v":0},{"$f":"'TGM Fräsen_F pro Zahn'!B97","v":0},{"$f":"'TGM Fräsen_F pro Zahn'!C97","v":0},{"$f":"'TGM Fräsen_F pro Zahn'!D97","v":0},{"$f":"'TGM Fräsen_F pro Zahn'!E97","v":0},{"$f":"'TGM Fräsen_F pro Zahn'!F97","v":0},null,null,null,null,null,null,0,0,0,0,0,0]
[null,null,null,{"$f":"'TGM Fräsen_F pro Zahn'!A98","v":0},{"$f":"'TGM Fräsen_F pro Zahn'!B98","v":0},{"$f":"'TGM Fräsen_F pro Zahn'!C98","v":0},{"$f":"'TGM Fräsen_F pro Zahn'!D98","v":0},{"$f":"'TGM Fräsen_F pro Zahn'!E98","v":0},{"$f":"'TGM Fräsen_F pro Zahn'!F98","v":0},null,null,null,null,null,null,0,0,0,0,0,0]
[null,null,null,{"$f":"'TGM Fräsen_F pro Zahn'!A99","v":0},{"$f":"'TGM Fräsen_F pro Zahn'!B99","v":0},{"$f":"'TGM Fräsen_F pro Zahn'!C99","v":0},{"$f":"'TGM Fräsen_F pro Zahn'!D99","v":0},{"$f":"'TGM Fräsen_F pro Zahn'!E99","v":0},{"$f":"'TGM Fräsen_F pro Zahn'!F99","v":0},null,null,null,null,null,null,0,0,0,0,0,0]
[null,null,null,{"$f":"'TGM Fräsen_F pro Zahn'!A100","v":0},{"$f":"'TGM Fräsen_F pro Zahn'!B100","v":0},{"$f":"'TGM Fräsen_F pro Zahn'!C100","v":0},{"$f":"'TGM Fräsen_F pro Zahn'!D100","v":0},{"$f":"'TGM Fräsen_F pro Zahn'!E100","v":0},{"$f":"'TGM Fräsen_F pro Zahn'!F100","v":0},null,null,null,null,null,null,0,0,0,0,0,0]
[null,null,null,{"$f":"'TGM Fräsen_F pro Zahn'!A101","v":0},{"$f":"'TGM Fräsen_F pro Zahn'!B101","v":0},{"$f":"'TGM Fräsen_F pro Zahn'!C101","v":0},{"$f":"'TGM Fräsen_F pro Zahn'!D101","v":0},{"$f":"'TGM Fräsen_F pro Zahn'!E101","v":0},{"$f":"'TGM Fräsen_F pro Zahn'!F101","v":0},null,null,null,null,null,null,0,0,0,0,0,0]
[null,null,null,{"$f":"'TGM Fräsen_F pro Zahn'!A102","v":0},{"$f":"'TGM Fräsen_F pro Zahn'!B102","v":0},{"$f":"'TGM Fräsen_F pro Zahn'!C102","v":0},{"$f":"'TGM Fräsen_F pro Zahn'!D102","v":0},{"$f":"'TGM Fräsen_F pro Zahn'!E102","v":0},{"$f":"'TGM Fräsen_F pro Zahn'!F102","v":0},null,null,null,null,null,null,0,0,0,0,0,0]
[null,null,null,{"$f":"'TGM Fräsen_F pro Zahn'!A103","v":0},{"$f":"'TGM Fräsen_F pro Zahn'!B103","v":0},{"$f":"'TGM Fräsen_F pro Zahn'!C103","v":0},{"$f":"'TGM Fräsen_F pro Zahn'!D103","v":0},{"$f":"'TGM Fräsen_F pro Zahn'!E103","v":0},{"$f":"'TGM Fräsen_F pro Zahn'!F103","v":0},null,null,null,null,null,null,0,0,0,0,0,0]
[null,null,null,{"$f":"'TGM Fräsen_F pro Zahn'!A104","v":0},{"$f":"'TGM Fräsen_F pro Zahn'!B104","v":0},{"$f":"'TGM Fräsen_F pro Zahn'!C104","v":0},{"$f":"'TGM Fräsen_F pro Zahn'!D104","v":0},{"$f":"'TGM Fräsen_F pro Zahn'!E104","v":0},{"$f":"'TGM Fräsen_F pro Zahn'!F104","v":0},null,null,null,null,null,null,0,0,0,0,0,0]
[null,null,null,{"$f":"'TGM Fräsen_F pro Zahn'!A105","v":0},{"$f":"'TGM Fräsen_F pro Zahn'!B105","v":0},{"$f":"'TGM Fräsen_F pro Zahn'!C105","v":0},{"$f":"'TGM Fräsen_F pro Zahn'!D105","v":0},{"$f":"'TGM Fräsen_F pro Zahn'!E105","v":0},{"$f":"'TGM Fräsen_F pro Zahn'!F105","v":0},null,null,null,null,null,null,0,0,0,0,0,0]
[]
[]
[null,null,null,"TGM Fräsen F pro Minute",null,null,null,null,null,null,null,null,null,null,null,"TGM Fräsen F pro Minute"]
[]
[null,null,null,{"$f":"'TGM Fräsen _F pro Min.'!A6","v":0},{"$f":"'TGM Fräsen _F pro Min.'!B6","v":0},{"$f":"'TGM Fräsen _F pro Min.'!C6","v":0},{"$f":"'TGM Fräsen _F pro Min.'!D6","v":0},null,null,null,null,null,null,null,null,0,0,0,0]
[null,null,null,{"$f":"'TGM Fräsen _F pro Min.'!A7","v":0},{"$f":"'TGM Fräsen _F pro Min.'!B7","v":0},{"$f":"'TGM Fräsen _F pro Min.'!C7","v":0},{"$f":"'TGM Fräsen _F pro Min.'!D7","v":0},null,null,null,null,null,null,null,null,0,0,0,0]
[null,null,null,{"$f":"'TGM Fräsen _F pro Min.'!A8","v":0},{"$f":"'TGM Fräsen _F pro Min.'!B8","v":0},{"$f":"'TGM Fräsen _F pro Min.'!C8","v":0},{"$f":"'TGM Fräsen _F pro Min.'!D8","v":0},null,null,null,null,null,null,null,null,0,0,0,0]
[null,null,null,{"$f":"'TGM Fräsen _F pro Min.'!A9","v":0},{"$f":"'TGM Fräsen _F pro Min.'!B9","v":0},{"$f":"'TGM Fräsen _F pro Min.'!C9","v":0},{"$f":"'TGM Fräsen _F pro Min.'!D9","v":0},null,null,null,null,null,null,null,null,0,0,0,0]
[null,null,null,{"$f":"'TGM Fräsen _F pro Min.'!A10","v":0},{"$f":"'TGM Fräsen _F pro Min.'!B10","v":0},{"$f":"'TGM Fräsen _F pro Min.'!C10","v":0},{"$f":"'TGM Fräsen _F pro Min.'!D10","v":0},null,null,null,null,null,null,null,null,0,0,0,0]
[null,null,null,{"$f":"'TGM Fräsen _F pro Min.'!A11","v":0},{"$f":"'TGM Fräsen _F pro Min.'!B11","v":0},{"$f":"'TGM Fräsen _F pro Min.'!C11","v":0},{"$f":"'TGM Fräsen _F pro Min.'!D11","v":0},null,null,null,null,null,null,null,null,0,0,0,0]
[null,null,null,{"$f":"'TGM Fräsen _F pro Min.'!A12","v":0},{"$f":"'TGM Fräsen _F pro Min.'!B12","v":0},{"$f":"'TGM Fräsen _F pro Min.'!C12","v":0},{"$f":"'TGM Fräsen _F pro Min.'!D12","v":0},null,null,null,null,null,null,null,null,0,0,0,0]
[null,null,null,{"$f":"'TGM Fräsen _F pro Min.'!A13","v":0},{"$f":"'TGM Fräsen _F pro Min.'!B13","v":0},{"$f":"'TGM Fräsen _F pro Min.'!C13","v":0},{"$f":"'TGM Fräsen _F pro Min.'!D13","v":0},null,null,null,null,null,null,null,null,0,0,0,0]
[null,null,null,{"$f":"'TGM Fräsen _F pro Min.'!A14","v":0},{"$f":"'TGM Fräsen _F pro Min.'!B14","v":0},{"$f":"'TGM Fräsen _F pro Min.'!C14","v":0},{"$f":"'TGM Fräsen _F pro Min.'!D14","v":0},null,null,null,null,null,null,null,null,0,0,0,0]
[null,null,null,{"$f":"'TGM Fräsen _F pro Min.'!A15","v":0},{"$f":"'TGM Fräsen _F pro Min.'!B15","v":0},{"$f":"'TGM Fräsen _F pro Min.'!C15","v":0},{"$f":"'TGM Fräsen _F pro Min.'!D15","v":0},null,null,null,null,null,null,null,null,0,0,0,0]
[null,null,null,{"$f":"'TGM Fräsen _F pro Min.'!A16","v":0},{"$f":"'TGM Fräsen _F pro Min.'!B16","v":0},{"$f":"'TGM Fräsen _F pro Min.'!C16","v":0},{"$f":"'TGM Fräsen _F pro Min.'!D16","v":0},null,null,null,null,null,null,null,null,0,0,0,0]
[null,null,null,{"$f":"'TGM Fräsen _F pro Min.'!A17","v":0},{"$f":"'TGM Fräsen _F pro Min.'!B17","v":0},{"$f":"'TGM Fräsen _F pro Min.'!C17","v":0},{"$f":"'TGM Fräsen _F pro Min.'!D17","v":0},null,null,null,null,null,null,null,null,0,0,0,0]
[null,null,null,{"$f":"'TGM Fräsen _F pro Min.'!A18","v":0},{"$f":"'TGM Fräsen _F pro Min.'!B18","v":0},{"$f":"'TGM Fräsen _F pro Min.'!C18","v":0},{"$f":"'TGM Fräsen _F pro Min.'!D18","v":0},null,null,null,null,null,null,null,null,0,0,0,0]
[null,null,null,{"$f":"'TGM Fräsen _F pro Min.'!A19","v":0},{"$f":"'TGM Fräsen _F pro Min.'!B19","v":0},{"$f":"'TGM Fräsen _F pro Min.'!C19","v":0},{"$f":"'TGM Fräsen _F pro Min.'!D19","v":0},null,null,null,null,null,null,null,null,0,0,0,0]
[null,null,null,{"$f":"'TGM Fräsen _F pro Min.'!A20","v":0},{"$f":"'TGM Fräsen _F pro Min.'!B20","v":0},{"$f":"'TGM Fräsen _F pro Min.'!C20","v":0},{"$f":"'TGM Fräsen _F pro Min.'!D20","v":0},null,null,null,null,null,null,null,null,0,0,0,0]
[null,null,null,{"$f":"'TGM Fräsen _F pro Min.'!A21","v":0},{"$f":"'TGM Fräsen _F pro Min.'!B21","v":0},{"$f":"'TGM Fräsen _F pro Min.'!C21","v":0},{"$f":"'TGM Fräsen _F pro Min.'!D21","v":0},null,null,null,null,null,null,null,null,0,0,0,0]
[null,null,null,{"$f":"'TGM Fräsen _F pro Min.'!A22","v":0},{"$f":"'TGM Fräsen _F pro Min.'!B22","v":0},{"$f":"'TGM Fräsen _F pro Min.'!C22","v":0},{"$f":"'TGM Fräsen _F pro Min.'!D22","v":0},null,null,null,null,null,null,null,null,0,0,0,0]
[null,null,null,{"$f":"'TGM Fräsen _F pro Min.'!A23","v":0},{"$f":"'TGM Fräsen _F pro Min.'!B23","v":0},{"$f":"'TGM Fräsen _F pro Min.'!C23","v":0},{"$f":"'TGM Fräsen _F pro Min.'!D23","v":0},null,null,null,null,null,null,null,null,0,0,0,0]
[null,null,null,{"$f":"'TGM Fräsen _F pro Min.'!A24","v":0},{"$f":"'TGM Fräsen _F pro Min.'!B24","v":0},{"$f":"'TGM Fräsen _F pro Min.'!C24","v":0},{"$f":"'TGM Fräsen _F pro Min.'!D24","v":0},null,null,null,null,null,null,null,null,0,0,0,0]
[null,null,null,{"$f":"'TGM Fräsen _F pro Min.'!A25","v":0},{"$f":"'TGM Fräsen _F pro Min.'!B25","v":0},{"$f":"'TGM Fräsen _F pro Min.'!C25","v":0},{"$f":"'TGM Fräsen _F pro Min.'!D25","v":0},null,null,null,null,null,null,null,null,0,0,0,0]
[null,null,null,{"$f":"'TGM Fräsen _F pro Min.'!A26","v":0},{"$f":"'TGM Fräsen _F pro Min.'!B26","v":0},{"$f":"'TGM Fräsen _F pro Min.'!C26","v":0},{"$f":"'TGM Fräsen _F pro Min.'!D26","v":0},null,null,null,null,null,null,null,null,0,0,0,0]
[null,null,null,{"$f":"'TGM Fräsen _F pro Min.'!A27","v":0},{"$f":"'TGM Fräsen _F pro Min.'!B27","v":0},{"$f":"'TGM Fräsen _F pro Min.'!C27","v":0},{"$f":"'TGM Fräsen _F pro Min.'!D27","v":0},null,null,null,null,null,null,null,null,0,0,0,0]
[null,null,null,{"$f":"'TGM Fräsen _F pro Min.'!A28","v":0},{"$f":"'TGM Fräsen _F pro Min.'!B28","v":0},{"$f":"'TGM Fräsen _F pro Min.'!C28","v":0},{"$f":"'TGM Fräsen _F pro Min.'!D28","v":0},null,null,null,null,null,null,null,null,0,0,0,0]
[null,null,null,{"$f":"'TGM Fräsen _F pro Min.'!A29","v":0},{"$f":"'TGM Fräsen _F pro Min.'!B29","v":0},{"$f":"'TGM Fräsen _F pro Min.'!C29","v":0},{"$f":"'TGM Fräsen _F pro Min.'!D29","v":0},null,null,null,null,null,null,null,null,0,0,0,0]
[null,null,null,{"$f":"'TGM Fräsen _F pro Min.'!A30","v":0},{"$f":"'TGM Fräsen _F pro Min.'!B30","v":0},{"$f":"'TGM Fräsen _F pro Min.'!C30","v":0},{"$f":"'TGM Fräsen _F pro Min.'!D30","v":0},null,null,null,null,null,null,null,null,0,0,0,0]
[null,null,null,{"$f":"'TGM Fräsen _F pro Min.'!A31","v":0},{"$f":"'TGM Fräsen _F pro Min.'!B31","v":0},{"$f":"'TGM Fräsen _F pro Min.'!C31","v":0},{"$f":"'TGM Fräsen _F pro Min.'!D31","v":0},null,null,null,null,null,null,null,null,0,0,0,0]
[null,null,null,{"$f":"'TGM Fräsen _F pro Min.'!A32","v":0},{"$f":"'TGM Fräsen _F pro Min.'!B32","v":0},{"$f":"'TGM Fräsen _F pro Min.'!C32","v":0},{"$f":"'TGM Fräsen _F pro Min.'!D32","v":0},null,null,null,null,null,null,null,null,0,0,0,0]
[null,null,null,{"$f":"'TGM Fräsen _F pro Min.'!A33","v":0},{"$f":"'TGM Fräsen _F pro Min.'!B33","v":0},{"$f":"'TGM Fräsen _F pro Min.'!C33","v":0},{"$f":"'TGM Fräsen _F pro Min.'!D33","v":0},null,null,null,null,null,null,null,null,0,0,0,0]
[null,null,null,{"$f":"'TGM Fräsen _F pro Min.'!A34","v":0},{"$f":"'TGM Fräsen _F pro Min.'!B34","v":0},{"$f":"'TGM Fräsen _F pro Min.'!C34","v":0},{"$f":"'TGM Fräsen _F pro Min.'!D34","v":0},null,null,null,null,null,null,null,null,0,0,0,0]
[null,null,null,{"$f":"'TGM Fräsen _F pro Min.'!A35","v":0},{"$f":"'TGM Fräsen _F pro Min.'!B35","v":0},{"$f":"'TGM Fräsen _F pro Min.'!C35","v":0},{"$f":"'TGM Fräsen _F pro Min.'!D35","v":0},null,null,null,null,null,null,null,null,0,0,0,0]
[null,null,null,{"$f":"'TGM Fräsen _F pro Min.'!A36","v":0},{"$f":"'TGM Fräsen _F pro Min.'!B36","v":0},{"$f":"'TGM Fräsen _F pro Min.'!C36","v":0},{"$f":"'TGM Fräsen _F pro Min.'!D36","v":0},null,null,null,null,null,null,null,null,0,0,0,0]
[null,null,null,{"$f":"'TGM Fräsen _F pro Min.'!A37","v":0},{"$f":"'TGM Fräsen _F pro Min.'!B37","v":0},{"$f":"'TGM Fräsen _F pro Min.'!C37","v":0},{"$f":"'TGM Fräsen _F pro Min.'!D37","v":0},null,null,null,null,null,null,null,null,0,0,0,0]
[null,null,null,{"$f":"'TGM Fräsen _F pro Min.'!A38","v":0},{"$f":"'TGM Fräsen _F pro Min.'!B38","v":0},{"$f":"'TGM Fräsen _F pro Min.'!C38","v":0},{"$f":"'TGM Fräsen _F pro Min.'!D38","v":0},null,null,null,null,null,null,null,null,0,0,0,0]
[null,null,null,{"$f":"'TGM Fräsen _F pro Min.'!A39","v":0},{"$f":"'TGM Fräsen _F pro Min.'!B39","v":0},{"$f":"'TGM Fräsen _F pro Min.'!C39","v":0},{"$f":"'TGM Fräsen _F pro Min.'!D39","v":0},null,null,null,null,null,null,null,null,0,0,0,0]
[null,null,null,{"$f":"'TGM Fräsen _F pro Min.'!A40","v":0},{"$f":"'TGM Fräsen _F pro Min.'!B40","v":0},{"$f":"'TGM Fräsen _F pro Min.'!C40","v":0},{"$f":"'TGM Fräsen _F pro Min.'!D40","v":0},null,null,null,null,null,null,null,null,0,0,0,0]
[null,null,null,{"$f":"'TGM Fräsen _F pro Min.'!A41","v":0},{"$f":"'TGM Fräsen _F pro Min.'!B41","v":0},{"$f":"'TGM Fräsen _F pro Min.'!C41","v":0},{"$f":"'TGM Fräsen _F pro Min.'!D41","v":0},null,null,null,null,null,null,null,null,0,0,0,0]
[null,null,null,{"$f":"'TGM Fräsen _F pro Min.'!A42","v":0},{"$f":"'TGM Fräsen _F pro Min.'!B42","v":0},{"$f":"'TGM Fräsen _F pro Min.'!C42","v":0},{"$f":"'TGM Fräsen _F pro Min.'!D42","v":0},null,null,null,null,null,null,null,null,0,0,0,0]
[null,null,null,{"$f":"'TGM Fräsen _F pro Min.'!A43","v":0},{"$f":"'TGM Fräsen _F pro Min.'!B43","v":0},{"$f":"'TGM Fräsen _F pro Min.'!C43","v":0},{"$f":"'TGM Fräsen _F pro Min.'!D43","v":0},null,null,null,null,null,null,null,null,0,0,0,0]
[null,null,null,{"$f":"'TGM Fräsen _F pro Min.'!A44","v":0},{"$f":"'TGM Fräsen _F pro Min.'!B44","v":0},{"$f":"'TGM Fräsen _F pro Min.'!C44","v":0},{"$f":"'TGM Fräsen _F pro Min.'!D44","v":0},null,null,null,null,null,null,null,null,0,0,0,0]
[null,null,null,{"$f":"'TGM Fräsen _F pro Min.'!A45","v":0},{"$f":"'TGM Fräsen _F pro Min.'!B45","v":0},{"$f":"'TGM Fräsen _F pro Min.'!C45","v":0},{"$f":"'TGM Fräsen _F pro Min.'!D45","v":0},null,null,null,null,null,null,null,null,0,0,0,0]
[null,null,null,{"$f":"'TGM Fräsen _F pro Min.'!A46","v":0},{"$f":"'TGM Fräsen _F pro Min.'!B46","v":0},{"$f":"'TGM Fräsen _F pro Min.'!C46","v":0},{"$f":"'TGM Fräsen _F pro Min.'!D46","v":0},null,null,null,null,null,null,null,null,0,0,0,0]
[null,null,null,{"$f":"'TGM Fräsen _F pro Min.'!A47","v":0},{"$f":"'TGM Fräsen _F pro Min.'!B47","v":0},{"$f":"'TGM Fräsen _F pro Min.'!C47","v":0},{"$f":"'TGM Fräsen _F pro Min.'!D47","v":0},null,null,null,null,null,null,null,null,0,0,0,0]
[null,null,null,{"$f":"'TGM Fräsen _F pro Min.'!A48","v":0},{"$f":"'TGM Fräsen _F pro Min.'!B48","v":0},{"$f":"'TGM Fräsen _F pro Min.'!C48","v":0},{"$f":"'TGM Fräsen _F pro Min.'!D48","v":0},null,null,null,null,null,null,null,null,0,0,0,0]
[null,null,null,{"$f":"'TGM Fräsen _F pro Min.'!A49","v":0},{"$f":"'TGM Fräsen _F pro Min.'!B49","v":0},{"$f":"'TGM Fräsen _F pro Min.'!C49","v":0},{"$f":"'TGM Fräsen _F pro Min.'!D49","v":0},null,null,null,null,null,null,null,null,0,0,0,0]
[null,null,null,{"$f":"'TGM Fräsen _F pro Min.'!A50","v":0},{"$f":"'TGM Fräsen _F pro Min.'!B50","v":0},{"$f":"'TGM Fräsen _F pro Min.'!C50","v":0},{"$f":"'TGM Fräsen _F pro Min.'!D50","v":0},null,null,null,null,null,null,null,null,0,0,0,0]
[null,null,null,{"$f":"'TGM Fräsen _F pro Min.'!A51","v":0},{"$f":"'TGM Fräsen _F pro Min.'!B51","v":0},{"$f":"'TGM Fräsen _F pro Min.'!C51","v":0},{"$f":"'TGM Fräsen _F pro Min.'!D51","v":0},null,null,null,null,null,null,null,null,0,0,0,0]
[null,null,null,{"$f":"'TGM Fräsen _F pro Min.'!A52","v":0},{"$f":"'TGM Fräsen _F pro Min.'!B52","v":0},{"$f":"'TGM Fräsen _F pro Min.'!C52","v":0},{"$f":"'TGM Fräsen _F pro Min.'!D52","v":0},null,null,null,null,null,null,null,null,0,0,0,0]
[null,null,null,{"$f":"'TGM Fräsen _F pro Min.'!A53","v":0},{"$f":"'TGM Fräsen _F pro Min.'!B53","v":0},{"$f":"'TGM Fräsen _F pro Min.'!C53","v":0},{"$f":"'TGM Fräsen _F pro Min.'!D53","v":0},null,null,null,null,null,null,null,null,0,0,0,0]
[null,null,null,{"$f":"'TGM Fräsen _F pro Min.'!A54","v":0},{"$f":"'TGM Fräsen _F pro Min.'!B54","v":0},{"$f":"'TGM Fräsen _F pro Min.'!C54","v":0},{"$f":"'TGM Fräsen _F pro Min.'!D54","v":0},null,null,null,null,null,null,null,null,0,0,0,0]
[null,null,null,{"$f":"'TGM Fräsen _F pro Min.'!A55","v":0},{"$f":"'TGM Fräsen _F pro Min.'!B55","v":0},{"$f":"'TGM Fräsen _F pro Min.'!C55","v":0},{"$f":"'TGM Fräsen _F pro Min.'!D55","v":0},null,null,null,null,null,null,null,null,0,0,0,0]
[null,null,null,{"$f":"'TGM Fräsen _F pro Min.'!A56","v":0},{"$f":"'TGM Fräsen _F pro Min.'!B56","v":0},{"$f":"'TGM Fräsen _F pro Min.'!C56","v":0},{"$f":"'TGM Fräsen _F pro Min.'!D56","v":0},null,null,null,null,null,null,null,null,0,0,0,0]
[null,null,null,{"$f":"'TGM Fräsen _F pro Min.'!A57","v":0},{"$f":"'TGM Fräsen _F pro Min.'!B57","v":0},{"$f":"'TGM Fräsen _F pro Min.'!C57","v":0},{"$f":"'TGM Fräsen _F pro Min.'!D57","v":0},null,null,null,null,null,null,null,null,0,0,0,0]
[null,null,null,{"$f":"'TGM Fräsen _F pro Min.'!A58","v":0},{"$f":"'TGM Fräsen _F pro Min.'!B58","v":0},{"$f":"'TGM Fräsen _F pro Min.'!C58","v":0},{"$f":"'TGM Fräsen _F pro Min.'!D58","v":0},null,null,null,null,null,null,null,null,0,0,0,0]
[null,null,null,{"$f":"'TGM Fräsen _F pro Min.'!A59","v":0},{"$f":"'TGM Fräsen _F pro Min.'!B59","v":0},{"$f":"'TGM Fräsen _F pro Min.'!C59","v":0},{"$f":"'TGM Fräsen _F pro Min.'!D59","v":0},null,null,null,null,null,null,null,null,0,0,0,0]
[null,null,null,{"$f":"'TGM Fräsen _F pro Min.'!A60","v":0},{"$f":"'TGM Fräsen _F pro Min.'!B60","v":0},{"$f":"'TGM Fräsen _F pro Min.'!C60","v":0},{"$f":"'TGM Fräsen _F pro Min.'!D60","v":0},null,null,null,null,null,null,null,null,0,0,0,0]
[null,null,null,{"$f":"'TGM Fräsen _F pro Min.'!A61","v":0},{"$f":"'TGM Fräsen _F pro Min.'!B61","v":0},{"$f":"'TGM Fräsen _F pro Min.'!C61","v":0},{"$f":"'TGM Fräsen _F pro Min.'!D61","v":0},null,null,null,null,null,null,null,null,0,0,0,0]
[null,null,null,{"$f":"'TGM Fräsen _F pro Min.'!A62","v":0},{"$f":"'TGM Fräsen _F pro Min.'!B62","v":0},{"$f":"'TGM Fräsen _F pro Min.'!C62","v":0},{"$f":"'TGM Fräsen _F pro Min.'!D62","v":0},null,null,null,null,null,null,null,null,0,0,0,0]
[null,null,null,{"$f":"'TGM Fräsen _F pro Min.'!A63","v":0},{"$f":"'TGM Fräsen _F pro Min.'!B63","v":0},{"$f":"'TGM Fräsen _F pro Min.'!C63","v":0},{"$f":"'TGM Fräsen _F pro Min.'!D63","v":0},null,null,null,null,null,null,null,null,0,0,0,0]
[null,null,null,{"$f":"'TGM Fräsen _F pro Min.'!A64","v":0},{"$f":"'TGM Fräsen _F pro Min.'!B64","v":0},{"$f":"'TGM Fräsen _F pro Min.'!C64","v":0},{"$f":"'TGM Fräsen _F pro Min.'!D64","v":0},null,null,null,null,null,null,null,null,0,0,0,0]
[null,null,null,{"$f":"'TGM Fräsen _F pro Min.'!A65","v":0},{"$f":"'TGM Fräsen _F pro Min.'!B65","v":0},{"$f":"'TGM Fräsen _F pro Min.'!C65","v":0},{"$f":"'TGM Fräsen _F pro Min.'!D65","v":0},null,null,null,null,null,null,null,null,0,0,0,0]
[null,null,null,{"$f":"'TGM Fräsen _F pro Min.'!A66","v":0},{"$f":"'TGM Fräsen _F pro Min.'!B66","v":0},{"$f":"'TGM Fräsen _F pro Min.'!C66","v":0},{"$f":"'TGM Fräsen _F pro Min.'!D66","v":0},null,null,null,null,null,null,null,null,0,0,0,0]
[null,null,null,{"$f":"'TGM Fräsen _F pro Min.'!A67","v":0},{"$f":"'TGM Fräsen _F pro Min.'!B67","v":0},{"$f":"'TGM Fräsen _F pro Min.'!C67","v":0},{"$f":"'TGM Fräsen _F pro Min.'!D67","v":0},null,null,null,null,null,null,null,null,0,0,0,0]
[null,null,null,{"$f":"'TGM Fräsen _F pro Min.'!A68","v":0},{"$f":"'TGM Fräsen _F pro Min.'!B68","v":0},{"$f":"'TGM Fräsen _F pro Min.'!C68","v":0},{"$f":"'TGM Fräsen _F pro Min.'!D68","v":0},null,null,null,null,null,null,null,null,0,0,0,0]
[null,null,null,{"$f":"'TGM Fräsen _F pro Min.'!A69","v":0},{"$f":"'TGM Fräsen _F pro Min.'!B69","v":0},{"$f":"'TGM Fräsen _F pro Min.'!C69","v":0},{"$f":"'TGM Fräsen _F pro Min.'!D69","v":0},null,null,null,null,null,null,null,null,0,0,0,0]
[null,null,null,{"$f":"'TGM Fräsen _F pro Min.'!A70","v":0},{"$f":"'TGM Fräsen _F pro Min.'!B70","v":0},{"$f":"'TGM Fräsen _F pro Min.'!C70","v":0},{"$f":"'TGM Fräsen _F pro Min.'!D70","v":0},null,null,null,null,null,null,null,null,0,0,0,0]
[null,null,null,{"$f":"'TGM Fräsen _F pro Min.'!A71","v":0},{"$f":"'TGM Fräsen _F pro Min.'!B71","v":0},{"$f":"'TGM Fräsen _F pro Min.'!C71","v":0},{"$f":"'TGM Fräsen _F pro Min.'!D71","v":0},null,null,null,null,null,null,null,null,0,0,0,0]
[null,null,null,{"$f":"'TGM Fräsen _F pro Min.'!A72","v":0},{"$f":"'TGM Fräsen _F pro Min.'!B72","v":0},{"$f":"'TGM Fräsen _F pro Min.'!C72","v":0},{"$f":"'TGM Fräsen _F pro Min.'!D72","v":0},null,null,null,null,null,null,null,null,0,0,0,0]
[null,null,null,{"$f":"'TGM Fräsen _F pro Min.'!A73","v":0},{"$f":"'TGM Fräsen _F pro Min.'!B73","v":0},{"$f":"'TGM Fräsen _F pro Min.'!C73","v":0},{"$f":"'TGM Fräsen _F pro Min.'!D73","v":0},null,null,null,null,null,null,null,null,0,0,0,0]
[null,null,null,{"$f":"'TGM Fräsen _F pro Min.'!A74","v":0},{"$f":"'TGM Fräsen _F pro Min.'!B74","v":0},{"$f":"'TGM Fräsen _F pro Min.'!C74","v":0},{"$f":"'TGM Fräsen _F pro Min.'!D74","v":0},null,null,null,null,null,null,null,null,0,0,0,0]
[null,null,null,{"$f":"'TGM Fräsen _F pro Min.'!A75","v":0},{"$f":"'TGM Fräsen _F pro Min.'!B75","v":0},{"$f":"'TGM Fräsen _F pro Min.'!C75","v":0},{"$f":"'TGM Fräsen _F pro Min.'!D75","v":0},null,null,null,null,null,null,null,null,0,0,0,0]
[null,null,null,{"$f":"'TGM Fräsen _F pro Min.'!A76","v":0},{"$f":"'TGM Fräsen _F pro Min.'!B76","v":0},{"$f":"'TGM Fräsen _F pro Min.'!C76","v":0},{"$f":"'TGM Fräsen _F pro Min.'!D76","v":0},null,null,null,null,null,null,null,null,0,0,0,0]
[null,null,null,{"$f":"'TGM Fräsen _F pro Min.'!A77","v":0},{"$f":"'TGM Fräsen _F pro Min.'!B77","v":0},{"$f":"'TGM Fräsen _F pro Min.'!C77","v":0},{"$f":"'TGM Fräsen _F pro Min.'!D77","v":0},null,null,null,null,null,null,null,null,0,0,0,0]
[null,null,null,{"$f":"'TGM Fräsen _F pro Min.'!A78","v":0},{"$f":"'TGM Fräsen _F pro Min.'!B78","v":0},{"$f":"'TGM Fräsen _F pro Min.'!C78","v":0},{"$f":"'TGM Fräsen _F pro Min.'!D78","v":0},null,null,null,null,null,null,null,null,0,0,0,0]
[null,null,null,{"$f":"'TGM Fräsen _F pro Min.'!A79","v":0},{"$f":"'TGM Fräsen _F pro Min.'!B79","v":0},{"$f":"'TGM Fräsen _F pro Min.'!C79","v":0},{"$f":"'TGM Fräsen _F pro Min.'!D79","v":0},null,null,null,null,null,null,null,null,0,0,0,0]
[null,null,null,{"$f":"'TGM Fräsen _F pro Min.'!A80","v":0},{"$f":"'TGM Fräsen _F pro Min.'!B80","v":0},{"$f":"'TGM Fräsen _F pro Min.'!C80","v":0},{"$f":"'TGM Fräsen _F pro Min.'!D80","v":0},null,null,null,null,null,null,null,null,0,0,0,0]
[null,null,null,{"$f":"'TGM Fräsen _F pro Min.'!A81","v":0},{"$f":"'TGM Fräsen _F pro Min.'!B81","v":0},{"$f":"'TGM Fräsen _F pro Min.'!C81","v":0},{"$f":"'TGM Fräsen _F pro Min.'!D81","v":0},null,null,null,null,null,null,null,null,0,0,0,0]
[null,null,null,{"$f":"'TGM Fräsen _F pro Min.'!A82","v":0},{"$f":"'TGM Fräsen _F pro Min.'!B82","v":0},{"$f":"'TGM Fräsen _F pro Min.'!C82","v":0},{"$f":"'TGM Fräsen _F pro Min.'!D82","v":0},null,null,null,null,null,null,null,null,0,0,0,0]
[null,null,null,{"$f":"'TGM Fräsen _F pro Min.'!A83","v":0},{"$f":"'TGM Fräsen _F pro Min.'!B83","v":0},{"$f":"'TGM Fräsen _F pro Min.'!C83","v":0},{"$f":"'TGM Fräsen _F pro Min.'!D83","v":0},null,null,null,null,null,null,null,null,0,0,0,0]
[null,null,null,{"$f":"'TGM Fräsen _F pro Min.'!A84","v":0},{"$f":"'TGM Fräsen _F pro Min.'!B84","v":0},{"$f":"'TGM Fräsen _F pro Min.'!C84","v":0},{"$f":"'TGM Fräsen _F pro Min.'!D84","v":0},null,null,null,null,null,null,null,null,0,0,0,0]
[null,null,null,{"$f":"'TGM Fräsen _F pro Min.'!A85","v":0},{"$f":"'TGM Fräsen _F pro Min.'!B85","v":0},{"$f":"'TGM Fräsen _F pro Min.'!C85","v":0},{"$f":"'TGM Fräsen _F pro Min.'!D85","v":0},null,null,null,null,null,null,null,null,0,0,0,0]
[null,null,null,{"$f":"'TGM Fräsen _F pro Min.'!A86","v":0},{"$f":"'TGM Fräsen _F pro Min.'!B86","v":0},{"$f":"'TGM Fräsen _F pro Min.'!C86","v":0},{"$f":"'TGM Fräsen _F pro Min.'!D86","v":0},null,null,null,null,null,null,null,null,0,0,0,0]
[null,null,null,{"$f":"'TGM Fräsen _F pro Min.'!A87","v":0},{"$f":"'TGM Fräsen _F pro Min.'!B87","v":0},{"$f":"'TGM Fräsen _F pro Min.'!C87","v":0},{"$f":"'TGM Fräsen _F pro Min.'!D87","v":0},null,null,null,null,null,null,null,null,0,0,0,0]
[null,null,null,{"$f":"'TGM Fräsen _F pro Min.'!A88","v":0},{"$f":"'TGM Fräsen _F pro Min.'!B88","v":0},{"$f":"'TGM Fräsen _F pro Min.'!C88","v":0},{"$f":"'TGM Fräsen _F pro Min.'!D88","v":0},null,null,null,null,null,null,null,null,0,0,0,0]
[null,null,null,{"$f":"'TGM Fräsen _F pro Min.'!A89","v":0},{"$f":"'TGM Fräsen _F pro Min.'!B89","v":0},{"$f":"'TGM Fräsen _F pro Min.'!C89","v":0},{"$f":"'TGM Fräsen _F pro Min.'!D89","v":0},null,null,null,null,null,null,null,null,0,0,0,0]
[null,null,null,{"$f":"'TGM Fräsen _F pro Min.'!A90","v":0},{"$f":"'TGM Fräsen _F pro Min.'!B90","v":0},{"$f":"'TGM Fräsen _F pro Min.'!C90","v":0},{"$f":"'TGM Fräsen _F pro Min.'!D90","v":0},null,null,null,null,null,null,null,null,0,0,0,0]
[null,null,null,{"$f":"'TGM Fräsen _F pro Min.'!A91","v":0},{"$f":"'TGM Fräsen _F pro Min.'!B91","v":0},{"$f":"'TGM Fräsen _F pro Min.'!C91","v":0},{"$f":"'TGM Fräsen _F pro Min.'!D91","v":0},null,null,null,null,null,null,null,null,0,0,0,0]
[null,null,null,{"$f":"'TGM Fräsen _F pro Min.'!A92","v":0},{"$f":"'TGM Fräsen _F pro Min.'!B92","v":0},{"$f":"'TGM Fräsen _F pro Min.'!C92","v":0},{"$f":"'TGM Fräsen _F pro Min.'!D92","v":0},null,null,null,null,null,null,null,null,0,0,0,0]
[null,null,null,{"$f":"'TGM Fräsen _F pro Min.'!A93","v":0},{"$f":"'TGM Fräsen _F pro Min.'!B93","v":0},{"$f":"'TGM Fräsen _F pro Min.'!C93","v":0},{"$f":"'TGM Fräsen _F pro Min.'!D93","v":0},null,null,null,null,null,null,null,null,0,0,0,0]
[null,null,null,{"$f":"'TGM Fräsen _F pro Min.'!A94","v":0},{"$f":"'TGM Fräsen _F pro Min.'!B94","v":0},{"$f":"'TGM Fräsen _F pro Min.'!C94","v":0},{"$f":"'TGM Fräsen _F pro Min.'!D94","v":0},null,null,null,null,null,null,null,null,0,0,0,0]
[null,null,null,{"$f":"'TGM Fräsen _F pro Min.'!A95","v":0},{"$f":"'TGM Fräsen _F pro Min.'!B95","v":0},{"$f":"'TGM Fräsen _F pro Min.'!C95","v":0},{"$f":"'TGM Fräsen _F pro Min.'!D95","v":0},null,null,null,null,null,null,null,null,0,0,0,0]
[null,null,null,{"$f":"'TGM Fräsen _F pro Min.'!A96","v":0},{"$f":"'TGM Fräsen _F pro Min.'!B96","v":0},{"$f":"'TGM Fräsen _F pro Min.'!C96","v":0},{"$f":"'TGM Fräsen _F pro Min.'!D96","v":0},null,null,null,null,null,null,null,null,0,0,0,0]
[null,null,null,{"$f":"'TGM Fräsen _F pro Min.'!A97","v":0},{"$f":"'TGM Fräsen _F pro Min.'!B97","v":0},{"$f":"'TGM Fräsen _F pro Min.'!C97","v":0},{"$f":"'TGM Fräsen _F pro Min.'!D97","v":0},null,null,null,null,null,null,null,null,0,0,0,0]
[null,null,null,{"$f":"'TGM Fräsen _F pro Min.'!A98","v":0},{"$f":"'TGM Fräsen _F pro Min.'!B98","v":0},{"$f":"'TGM Fräsen _F pro Min.'!C98","v":0},{"$f":"'TGM Fräsen _F pro Min.'!D98","v":0},null,null,null,null,null,null,null,null,0,0,0,0]
[null,null,null,{"$f":"'TGM Fräsen _F pro Min.'!A99","v":0},{"$f":"'TGM Fräsen _F pro Min.'!B99","v":0},{"$f":"'TGM Fräsen _F pro Min.'!C99","v":0},{"$f":"'TGM Fräsen _F pro Min.'!D99","v":0},null,null,null,null,null,null,null,null,0,0,0,0]
[null,null,null,{"$f":"'TGM Fräsen _F pro Min.'!A100","v":0},{"$f":"'TGM Fräsen _F pro Min.'!B100","v":0},{"$f":"'TGM Fräsen _F pro Min.'!C100","v":0},{"$f":"'TGM Fräsen _F pro Min.'!D100","v":0},null,null,null,null,null,null,null,null,0,0,0,0]
[null,null,null,{"$f":"'TGM Fräsen _F pro Min.'!A101","v":0},{"$f":"'TGM Fräsen _F pro Min.'!B101","v":0},{"$f":"'TGM Fräsen _F pro Min.'!C101","v":0},{"$f":"'TGM Fräsen _F pro Min.'!D101","v":0},null,null,null,null,null,null,null,null,0,0,0,0]
[null,null,null,{"$f":"'TGM Fräsen _F pro Min.'!A102","v":0},{"$f":"'TGM Fräsen _F pro Min.'!B102","v":0},{"$f":"'TGM Fräsen _F pro Min.'!C102","v":0},{"$f":"'TGM Fräsen _F pro Min.'!D102","v":0},null,null,null,null,null,null,null,null,0,0,0,0]
[null,null,null,{"$f":"'TGM Fräsen _F pro Min.'!A103","v":0},{"$f":"'TGM Fräsen _F pro Min.'!B103","v":0},{"$f":"'TGM Fräsen _F pro Min.'!C103","v":0},{"$f":"'TGM Fräsen _F pro Min.'!D103","v":0},null,null,null,null,null,null,null,null,0,0,0,0]
[null,null,null,{"$f":"'TGM Fräsen _F pro Min.'!A104","v":0},{"$f":"'TGM Fräsen _F pro Min.'!B104","v":0},{"$f":"'TGM Fräsen _F pro Min.'!C104","v":0},{"$f":"'TGM Fräsen _F pro Min.'!D104","v":0},null,null,null,null,null,null,null,null,0,0,0,0]
[null,null,null,{"$f":"'TGM Fräsen _F pro Min.'!A105","v":0},{"$f":"'TGM Fräsen _F pro Min.'!B105","v":0},{"$f":"'TGM Fräsen _F pro Min.'!C105","v":0},{"$f":"'TGM Fräsen _F pro Min.'!D105","v":0},null,null,null,null,null,null,null,null,0,0,0,0]
[]
[]
[null,null,null,"ZSV",null,null,null,null,null,null,null,null,null,null,null,"ZSV"]
[]
[null,null,null,{"$f":"ZSV!B4","v":"(1) Zeitspanungsvolumen Drehen"},{"$f":"ZSV!C4","v":0},{"$f":"ZSV!D4","v":0},null,null,null,null,null,null,null,null,null,"(1) Zeitspanungsvolumen Drehen",0,0]
[null,null,null,{"$f":"ZSV!B5","v":"Hier Volumen (F1) für Drehbearbeitung eintragen"},{"$f":"ZSV!C5","v":0},{"$f":"ZSV!D5","v":0},null,null,null,null,null,null,null,null,null,"Hier Volumen (F1) für Drehbearbeitung eintragen",0,58.27]
[null,null,null,{"$f":"ZSV!B6","v":"Schnittgeschwindigkeit in m/min"},{"$f":"ZSV!C6","v":0},{"$f":"ZSV!D6","v":100},null,null,null,null,null,null,null,null,null,"Schnittgeschwindigkeit in m/min",0,120]
[null,null,null,{"$f":"ZSV!B7","v":"Schnitttiefe (ap) in mm"},{"$f":"ZSV!C7","v":0},{"$f":"ZSV!D7","v":0},null,null,null,null,null,null,null,null,null,"Schnitttiefe (ap) in mm",0,4]
[null,null,null,{"$f":"ZSV!B8","v":"Vorschub (f) in mm pro Umdrehung"},{"$f":"ZSV!C8","v":0},{"$f":"ZSV!D8","v":0},null,null,null,null,null,null,null,null,null,"Vorschub (f) in mm pro Umdrehung",0,0.3]
[null,null,null,{"$f":"ZSV!B9","v":"Bearbeitungsdauer in Minuten"},{"$f":"ZSV!C9","v":0},{"$f":"ZSV!D9","v":0},null,null,null,null,null,null,null,null,null,"Bearbeitungsdauer in Minuten",0,404.65277777777783]
[null,null,null,{"$f":"ZSV!B10","v":"Zuschlagsatz in %"},{"$f":"ZSV!C10","v":0},{"$f":"ZSV!D10","v":0},null,null,null,null,null,null,null,null,null,"Zuschlagsatz in %",0,10]
[null,null,null,{"$f":"ZSV!B11","v":"Bearbeitungsdauer in Minuten + Zuschlagsatz in %"},{"$f":"ZSV!C11","v":0},{"$f":"ZSV!D11","v":0},null,null,null,null,null,null,null,null,null,"Bearbeitungsdauer in Minuten + Zuschlagsatz in %",0,445.1180555555556]
[null,null,null,{"$f":"ZSV!B12","v":0},{"$f":"ZSV!C12","v":0},{"$f":"ZSV!D12","v":0},null,null,null,null,null,null,null,null,null,"AG1 Außen drehen",0,0]
[null,null,null,{"$f":"ZSV!B13","v":"(2) Zeitspanungsvolumen Drehen"},{"$f":"ZSV!C13","v":0},{"$f":"ZSV!D13","v":0},null,null,null,null,null,null,null,null,null,"(2) Zeitspanungsvolumen Drehen",0,0]
[null,null,null,{"$f":"ZSV!B14","v":"Hier Volumen (F1) für Drehbearbeitung eintragen"},{"$f":"ZSV!C14","v":0},{"$f":"ZSV!D14","v":0},null,null,null,null,null,null,null,null,null,"Hier Volumen (F1) für Drehbearbeitung eintragen",0,10.83]
[null,null,null,{"$f":"ZSV!B15","v":"Schnittgeschwindigkeit in m/min"},{"$f":"ZSV!C15","v":0},{"$f":"ZSV!D15","v":0},null,null,null,null,null,null,null,null,null,"Schnittgeschwindigkeit in m/min",0,100]
[null,null,null,{"$f":"ZSV!B16","v":"Schnitttiefe (ap) in mm"},{"$f":"ZSV!C16","v":0},{"$f":"ZSV!D16","v":0},null,null,null,null,null,null,null,null,null,"Schnitttiefe (ap) in mm",0,3]
[null,null,null,{"$f":"ZSV!B17","v":"Vorschub (f) in mm pro Umdrehung"},{"$f":"ZSV!C17","v":0},{"$f":"ZSV!D17","v":0},null,null,null,null,null,null,null,null,null,"Vorschub (f) in mm pro Umdrehung",0,0.3]
[null,null,null,{"$f":"ZSV!B18","v":"Bearbeitungsdauer in Minuten"},{"$f":"ZSV!C18","v":0},{"$f":"ZSV!D18","v":0},null,null,null,null,null,null,null,null,null,"Bearbeitungsdauer in Minuten",0,120.33333333333334]
[null,null,null,{"$f":"ZSV!B19","v":"Zuschlagsatz in %"},{"$f":"ZSV!C19","v":0},{"$f":"ZSV!D19","v":0},null,null,null,null,null,null,null,null,null,"Zuschlagsatz in %",0,10]
[null,null,null,{"$f":"ZSV!B20","v":"Bearbeitungsdauer in Minuten + Zuschlagsatz in %"},{"$f":"ZSV!C20","v":0},{"$f":"ZSV!D20","v":0},null,null,null,null,null,null,null,null,null,"Bearbeitungsdauer in Minuten + Zuschlagsatz in %",0,132.36666666666667]
[null,null,null,{"$f":"ZSV!B21","v":0},{"$f":"ZSV!C21","v":0},{"$f":"ZSV!D21","v":0},null,null,null,null,null,null,null,null,null,"AG1 Kugel vordrehen",0,0]
[null,null,null,{"$f":"ZSV!B22","v":"(3) Zeitspanungsvolumen Drehen"},{"$f":"ZSV!C22","v":0},{"$f":"ZSV!D22","v":0},null,null,null,null,null,null,null,null,null,"(3) Zeitspanungsvolumen Drehen",0,0]
[null,null,null,{"$f":"ZSV!B23","v":"Hier Volumen (F1) für Drehbearbeitung eintragen"},{"$f":"ZSV!C23","v":0},{"$f":"ZSV!D23","v":0},null,null,null,null,null,null,null,null,null,"Hier Volumen (F1) für Drehbearbeitung eintragen",0,0]
[null,null,null,{"$f":"ZSV!B24","v":"Schnittgeschwindigkeit in m/min"},{"$f":"ZSV!C24","v":0},{"$f":"ZSV!D24","v":0},null,null,null,null,null,null,null,null,null,"Schnittgeschwindigkeit in m/min",0,0]
[null,null,null,{"$f":"ZSV!B25","v":"Schnitttiefe (ap) in mm"},{"$f":"ZSV!C25","v":0},{"$f":"ZSV!D25","v":0},null,null,null,null,null,null,null,null,null,"Schnitttiefe (ap) in mm",0,0]
[null,null,null,{"$f":"ZSV!B26","v":"Vorschub (f) in mm pro Umdrehung"},{"$f":"ZSV!C26","v":0},{"$f":"ZSV!D26","v":0},null,null,null,null,null,null,null,null,null,"Vorschub (f) in mm pro Umdrehung",0,0]
[null,null,null,{"$f":"ZSV!B27","v":"Bearbeitungsdauer in Minuten"},{"$f":"ZSV!C27","v":0},{"$f":"ZSV!D27","v":0},null,null,null,null,null,null,null,null,null,"Bearbeitungsdauer in Minuten",0,0]
[null,null,null,{"$f":"ZSV!B28","v":"Zuschlagsatz in %"},{"$f":"ZSV!C28","v":0},{"$f":"ZSV!D28","v":0},null,null,null,null,null,null,null,null,null,"Zuschlagsatz in %",0,0]
[null,null,null,{"$f":"ZSV!B29","v":"Bearbeitungsdauer in Minuten + Zuschlagsatz in %"},{"$f":"ZSV!C29","v":0},{"$f":"ZSV!D29","v":0},null,null,null,null,null,null,null,null,null,"Bearbeitungsdauer in Minuten + Zuschlagsatz in %",0,0]
[null,null,null,{"$f":"ZSV!B30","v":0},{"$f":"ZSV!C30","v":0},{"$f":"ZSV!D30","v":0},null,null,null,null,null,null,null,null,null,0,0,0]
[null,null,null,{"$f":"ZSV!B31","v":"(1) Zeitspanungsvolumen Fräsen"},{"$f":"ZSV!C31","v":0},{"$f":"ZSV!D31","v":0},null,null,null,null,null,null,null,null,null,"(1) Zeitspanungsvolumen Fräsen",0,0]
[null,null,null,{"$f":"ZSV!B32","v":"Hier Volumen (F1) für Fräsbearbeitung eintragen"},{"$f":"ZSV!C32","v":0},{"$f":"ZSV!D32","v":0},null,null,null,null,null,null,null,null,null,"Hier Volumen (F1) für Fräsbearbeitung eintragen",0,0]
[null,null,null,{"$f":"ZSV!B33","v":"Schnittbreite (ae) in mm"},{"$f":"ZSV!C33","v":0},{"$f":"ZSV!D33","v":0},null,null,null,null,null,null,null,null,null,"Schnittbreite (ae) in mm",0,0]
[null,null,null,{"$f":"ZSV!B34","v":"Schnitttiefe (ap) in mm"},{"$f":"ZSV!C34","v":0},{"$f":"ZSV!D34","v":5},null,null,null,null,null,null,null,null,null,"Schnitttiefe (ap) in mm",0,0]
[null,null,null,{"$f":"ZSV!B35","v":"Vorschubgeschwindigkeit (Vf) in mm pro Minute"},{"$f":"ZSV!C35","v":0},{"$f":"ZSV!D35","v":0},null,null,null,null,null,null,null,null,null,"Vorschubgeschwindigkeit (Vf) in mm pro Minute",0,0]
[null,null,null,{"$f":"ZSV!B36","v":"Bearbeitungsdauer in Minuten"},{"$f":"ZSV!C36","v":0},{"$f":"ZSV!D36","v":0},null,null,null,null,null,null,null,null,null,"Bearbeitungsdauer in Minuten",0,0]
[null,null,null,{"$f":"ZSV!B37","v":"Zuschlagsatz in %"},{"$f":"ZSV!C37","v":0},{"$f":"ZSV!D37","v":0},null,null,null,null,null,null,null,null,null,"Zuschlagsatz in %",0,0]
[null,null,null,{"$f":"ZSV!B38","v":"Bearbeitungsdauer in Minuten + Zuschlagsatz in %"},{"$f":"ZSV!C38","v":0},{"$f":"ZSV!D38","v":0},null,null,null,null,null,null,null,null,null,"Bearbeitungsdauer in Minuten + Zuschlagsatz in %",0,0]
[null,null,null,{"$f":"ZSV!B39","v":0},{"$f":"ZSV!C39","v":0},{"$f":"ZSV!D39","v":0},null,null,null,null,null,null,null,null,null,0,0,0]
[null,null,null,{"$f":"ZSV!B40","v":"(2) Zeitspanungsvolumen Fräsen"},{"$f":"ZSV!C40","v":0},{"$f":"ZSV!D40","v":0},null,null,null,null,null,null,null,null,null,"(2) Zeitspanungsvolumen Fräsen",0,0]
[null,null,null,{"$f":"ZSV!B41","v":"Hier Volumen (F1) für Fräsbearbeitung eintragen"},{"$f":"ZSV!C41","v":0},{"$f":"ZSV!D41","v":0},null,null,null,null,null,null,null,null,null,"Hier Volumen (F1) für Fräsbearbeitung eintragen",0,0]
[null,null,null,{"$f":"ZSV!B42","v":"Schnittbreite (ae) in mm"},{"$f":"ZSV!C42","v":0},{"$f":"ZSV!D42","v":0},null,null,null,null,null,null,null,null,null,"Schnittbreite (ae) in mm",0,0]
[null,null,null,{"$f":"ZSV!B43","v":"Schnitttiefe (ap) in mm"},{"$f":"ZSV!C43","v":0},{"$f":"ZSV!D43","v":0},null,null,null,null,null,null,null,null,null,"Schnitttiefe (ap) in mm",0,0]
[null,null,null,{"$f":"ZSV!B44","v":"Vorschubgeschwindigkeit (Vf) in mm pro Minute"},{"$f":"ZSV!C44","v":0},{"$f":"ZSV!D44","v":0},null,null,null,null,null,null,null,null,null,"Vorschubgeschwindigkeit (Vf) in mm pro Minute",0,0]
[null,null,null,{"$f":"ZSV!B45","v":"Bearbeitungsdauer in Minuten"},{"$f":"ZSV!C45","v":0},{"$f":"ZSV!D45","v":0},null,null,null,null,null,null,null,null,null,"Bearbeitungsdauer in Minuten",0,0]
[null,null,null,{"$f":"ZSV!B46","v":"Zuschlagsatz in %"},{"$f":"ZSV!C46","v":0},{"$f":"ZSV!D46","v":0},null,null,null,null,null,null,null,null,null,"Zuschlagsatz in %",0,0]
[null,null,null,{"$f":"ZSV!B47","v":"Bearbeitungsdauer in Minuten + Zuschlagsatz in %"},{"$f":"ZSV!C47","v":0},{"$f":"ZSV!D47","v":0},null,null,null,null,null,null,null,null,null,"Bearbeitungsdauer in Minuten + Zuschlagsatz in %",0,0]
[null,null,null,{"$f":"ZSV!B48","v":0},{"$f":"ZSV!C48","v":0},{"$f":"ZSV!D48","v":0},null,null,null,null,null,null,null,null,null,0,0,0]
[null,null,null,{"$f":"ZSV!B49","v":"(3) Zeitspanungsvolumen Fräsen"},{"$f":"ZSV!C49","v":0},{"$f":"ZSV!D49","v":0},null,null,null,null,null,null,null,null,null,"(3) Zeitspanungsvolumen Fräsen",0,0]
[null,null,null,{"$f":"ZSV!B50","v":"Hier Volumen (F1) für Fräsbearbeitung eintragen"},{"$f":"ZSV!C50","v":0},{"$f":"ZSV!D50","v":0},null,null,null,null,null,null,null,null,null,"Hier Volumen (F1) für Fräsbearbeitung eintragen",0,0]
[null,null,null,{"$f":"ZSV!B51","v":"Schnittbreite (ae) in mm"},{"$f":"ZSV!C51","v":0},{"$f":"ZSV!D51","v":0},null,null,null,null,null,null,null,null,null,"Schnittbreite (ae) in mm",0,0]
[null,null,null,{"$f":"ZSV!B52","v":"Schnitttiefe (ap) in mm"},{"$f":"ZSV!C52","v":0},{"$f":"ZSV!D52","v":0},null,null,null,null,null,null,null,null,null,"Schnitttiefe (ap) in mm",0,0]
[null,null,null,{"$f":"ZSV!B53","v":"Vorschubgeschwindigkeit (Vf) in mm pro Minute"},{"$f":"ZSV!C53","v":0},{"$f":"ZSV!D53","v":0},null,null,null,null,null,null,null,null,null,"Vorschubgeschwindigkeit (Vf) in mm pro Minute",0,0]
[null,null,null,{"$f":"ZSV!B54","v":"Bearbeitungsdauer in Minuten"},{"$f":"ZSV!C54","v":0},{"$f":"ZSV!D54","v":0},null,null,null,null,null,null,null,null,null,"Bearbeitungsdauer in Minuten",0,0]
[null,null,null,{"$f":"ZSV!B55","v":"Zuschlagsatz in %"},{"$f":"ZSV!C55","v":0},{"$f":"ZSV!D55","v":0},null,null,null,null,null,null,null,null,null,"Zuschlagsatz in %",0,0]
[null,null,null,{"$f":"ZSV!B56","v":"Bearbeitungsdauer in Minuten + Zuschlagsatz in %"},{"$f":"ZSV!C56","v":0},{"$f":"ZSV!D56","v":0},null,null,null,null,null,null,null,null,null,"Bearbeitungsdauer in Minuten + Zuschlagsatz in %",0,0]
[null,null,null,{"$f":"ZSV!B57","v":0},{"$f":"ZSV!C57","v":0},{"$f":"ZSV!D57","v":0},null,null,null,null,null,null,null,null,null,0,0,0]
[]
[]
[null,null,null,"Aufmaß Zeitspanvolumen Drehen",null,null,null,null,null,null,null,null,null,null,null,"Aufmaß Zeitspanvolumen Drehen"]
[null,null,null,{"$f":"'Aufmaß Zeitspanvolumen Drehen'!A8","v":0},{"$f":"'Aufmaß Zeitspanvolumen Drehen'!B8","v":0},{"$f":"'Aufmaß Zeitspanvolumen Drehen'!C8","v":0},{"$f":"'Aufmaß Zeitspanvolumen Drehen'!D8","v":0},{"$f":"'Aufmaß Zeitspanvolumen Drehen'!E8","v":0},{"$f":"'Aufmaß Zeitspanvolumen Drehen'!F8","v":0},{"$f":"'Aufmaß Zeitspanvolumen Drehen'!G8","v":0},{"$f":"'Aufmaß Zeitspanvolumen Drehen'!H8","v":0},{"$f":"'Aufmaß Zeitspanvolumen Drehen'!I8","v":0},null,null,null,0,0,0,0,0,0,0,0,0]
[null,null,null,{"$f":"'Aufmaß Zeitspanvolumen Drehen'!A9","v":0},{"$f":"'Aufmaß Zeitspanvolumen Drehen'!B9","v":0},{"$f":"'Aufmaß Zeitspanvolumen Drehen'!C9","v":0},{"$f":"'Aufmaß Zeitspanvolumen Drehen'!D9","v":0},{"$f":"'Aufmaß Zeitspanvolumen Drehen'!E9","v":0},{"$f":"'Aufmaß Zeitspanvolumen Drehen'!F9","v":0},{"$f":"'Aufmaß Zeitspanvolumen Drehen'!G9","v":0},{"$f":"'Aufmaß Zeitspanvolumen Drehen'!H9","v":0},{"$f":"'Aufmaß Zeitspanvolumen Drehen'!I9","v":0},null,null,null,0,0,0,0,0,0,0,0,0]
[null,null,null,{"$f":"'Aufmaß Zeitspanvolumen Drehen'!A10","v":0},{"$f":"'Aufmaß Zeitspanvolumen Drehen'!B10","v":0},{"$f":"'Aufmaß Zeitspanvolumen Drehen'!C10","v":0},{"$f":"'Aufmaß Zeitspanvolumen Drehen'!D10","v":0},{"$f":"'Aufmaß Zeitspanvolumen Drehen'!E10","v":0},{"$f":"'Aufmaß Zeitspanvolumen Drehen'!F10","v":0},{"$f":"'Aufmaß Zeitspanvolumen Drehen'!G10","v":0},{"$f":"'Aufmaß Zeitspanvolumen Drehen'!H10","v":0},{"$f":"'Aufmaß Zeitspanvolumen Drehen'!I10","v":0},null,null,null,0,0,0,0,0,0,0,0,0]
[null,null,null,{"$f":"'Aufmaß Zeitspanvolumen Drehen'!A11","v":0},{"$f":"'Aufmaß Zeitspanvolumen Drehen'!B11","v":0},{"$f":"'Aufmaß Zeitspanvolumen Drehen'!C11","v":0},{"$f":"'Aufmaß Zeitspanvolumen Drehen'!D11","v":0},{"$f":"'Aufmaß Zeitspanvolumen Drehen'!E11","v":0},{"$f":"'Aufmaß Zeitspanvolumen Drehen'!F11","v":0},{"$f":"'Aufmaß Zeitspanvolumen Drehen'!G11","v":0},{"$f":"'Aufmaß Zeitspanvolumen Drehen'!H11","v":0},{"$f":"'Aufmaß Zeitspanvolumen Drehen'!I11","v":0},null,null,null,0,0,0,0,0,0,0,0,0]
[null,null,null,{"$f":"'Aufmaß Zeitspanvolumen Drehen'!A12","v":0},{"$f":"'Aufmaß Zeitspanvolumen Drehen'!B12","v":0},{"$f":"'Aufmaß Zeitspanvolumen Drehen'!C12","v":0},{"$f":"'Aufmaß Zeitspanvolumen Drehen'!D12","v":0},{"$f":"'Aufmaß Zeitspanvolumen Drehen'!E12","v":0},{"$f":"'Aufmaß Zeitspanvolumen Drehen'!F12","v":0},{"$f":"'Aufmaß Zeitspanvolumen Drehen'!G12","v":0},{"$f":"'Aufmaß Zeitspanvolumen Drehen'!H12","v":0},{"$f":"'Aufmaß Zeitspanvolumen Drehen'!I12","v":0},null,null,null,0,0,0,0,0,0,0,0,0]
[null,null,null,{"$f":"'Aufmaß Zeitspanvolumen Drehen'!A13","v":0},{"$f":"'Aufmaß Zeitspanvolumen Drehen'!B13","v":0},{"$f":"'Aufmaß Zeitspanvolumen Drehen'!C13","v":0},{"$f":"'Aufmaß Zeitspanvolumen Drehen'!D13","v":0},{"$f":"'Aufmaß Zeitspanvolumen Drehen'!E13","v":0},{"$f":"'Aufmaß Zeitspanvolumen Drehen'!F13","v":0},{"$f":"'Aufmaß Zeitspanvolumen Drehen'!G13","v":0},{"$f":"'Aufmaß Zeitspanvolumen Drehen'!H13","v":0},{"$f":"'Aufmaß Zeitspanvolumen Drehen'!I13","v":0},null,null,null,0,0,0,0,0,0,0,0,0]
[null,null,null,{"$f":"'Aufmaß Zeitspanvolumen Drehen'!A14","v":0},{"$f":"'Aufmaß Zeitspanvolumen Drehen'!B14","v":0},{"$f":"'Aufmaß Zeitspanvolumen Drehen'!C14","v":0},{"$f":"'Aufmaß Zeitspanvolumen Drehen'!D14","v":0},{"$f":"'Aufmaß Zeitspanvolumen Drehen'!E14","v":0},{"$f":"'Aufmaß Zeitspanvolumen Drehen'!F14","v":0},{"$f":"'Aufmaß Zeitspanvolumen Drehen'!G14","v":0},{"$f":"'Aufmaß Zeitspanvolumen Drehen'!H14","v":0},{"$f":"'Aufmaß Zeitspanvolumen Drehen'!I14","v":0},null,null,null,0,0,0,0,0,0,0,0,0]
[null,null,null,{"$f":"'Aufmaß Zeitspanvolumen Drehen'!A15","v":0},{"$f":"'Aufmaß Zeitspanvolumen Drehen'!B15","v":0},{"$f":"'Aufmaß Zeitspanvolumen Drehen'!C15","v":0},{"$f":"'Aufmaß Zeitspanvolumen Drehen'!D15","v":0},{"$f":"'Aufmaß Zeitspanvolumen Drehen'!E15","v":0},{"$f":"'Aufmaß Zeitspanvolumen Drehen'!F15","v":0},{"$f":"'Aufmaß Zeitspanvolumen Drehen'!G15","v":0},{"$f":"'Aufmaß Zeitspanvolumen Drehen'!H15","v":0},{"$f":"'Aufmaß Zeitspanvolumen Drehen'!I15","v":0},null,null,null,0,0,0,0,0,0,0,0,0]
[null,null,null,{"$f":"'Aufmaß Zeitspanvolumen Drehen'!A16","v":0},{"$f":"'Aufmaß Zeitspanvolumen Drehen'!B16","v":0},{"$f":"'Aufmaß Zeitspanvolumen Drehen'!C16","v":0},{"$f":"'Aufmaß Zeitspanvolumen Drehen'!D16","v":0},{"$f":"'Aufmaß Zeitspanvolumen Drehen'!E16","v":0},{"$f":"'Aufmaß Zeitspanvolumen Drehen'!F16","v":0},{"$f":"'Aufmaß Zeitspanvolumen Drehen'!G16","v":0},{"$f":"'Aufmaß Zeitspanvolumen Drehen'!H16","v":0},{"$f":"'Aufmaß Zeitspanvolumen Drehen'!I16","v":0},null,null,null,0,0,0,0,0,0,0,0,0]
[null,null,null,{"$f":"'Aufmaß Zeitspanvolumen Drehen'!A17","v":0},{"$f":"'Aufmaß Zeitspanvolumen Drehen'!B17","v":0},{"$f":"'Aufmaß Zeitspanvolumen Drehen'!C17","v":0},{"$f":"'Aufmaß Zeitspanvolumen Drehen'!D17","v":0},{"$f":"'Aufmaß Zeitspanvolumen Drehen'!E17","v":0},{"$f":"'Aufmaß Zeitspanvolumen Drehen'!F17","v":0},{"$f":"'Aufmaß Zeitspanvolumen Drehen'!G17","v":0},{"$f":"'Aufmaß Zeitspanvolumen Drehen'!H17","v":0},{"$f":"'Aufmaß Zeitspanvolumen Drehen'!I17","v":0},null,null,null,0,0,0,0,0,0,0,0,0]
[null,null,null,{"$f":"'Aufmaß Zeitspanvolumen Drehen'!A18","v":0},{"$f":"'Aufmaß Zeitspanvolumen Drehen'!B18","v":0},{"$f":"'Aufmaß Zeitspanvolumen Drehen'!C18","v":0},{"$f":"'Aufmaß Zeitspanvolumen Drehen'!D18","v":0},{"$f":"'Aufmaß Zeitspanvolumen Drehen'!E18","v":0},{"$f":"'Aufmaß Zeitspanvolumen Drehen'!F18","v":0},{"$f":"'Aufmaß Zeitspanvolumen Drehen'!G18","v":0},{"$f":"'Aufmaß Zeitspanvolumen Drehen'!H18","v":0},{"$f":"'Aufmaß Zeitspanvolumen Drehen'!I18","v":0},null,null,null,0,0,0,0,0,0,0,0,0]
[null,null,null,{"$f":"'Aufmaß Zeitspanvolumen Drehen'!A19","v":0},{"$f":"'Aufmaß Zeitspanvolumen Drehen'!B19","v":0},{"$f":"'Aufmaß Zeitspanvolumen Drehen'!C19","v":0},{"$f":"'Aufmaß Zeitspanvolumen Drehen'!D19","v":0},{"$f":"'Aufmaß Zeitspanvolumen Drehen'!E19","v":0},{"$f":"'Aufmaß Zeitspanvolumen Drehen'!F19","v":0},{"$f":"'Aufmaß Zeitspanvolumen Drehen'!G19","v":0},{"$f":"'Aufmaß Zeitspanvolumen Drehen'!H19","v":0},{"$f":"'Aufmaß Zeitspanvolumen Drehen'!I19","v":0},null,null,null,0,0,0,0,0,0,0,0,0]
[null,null,null,{"$f":"'Aufmaß Zeitspanvolumen Drehen'!A20","v":0},{"$f":"'Aufmaß Zeitspanvolumen Drehen'!B20","v":0},{"$f":"'Aufmaß Zeitspanvolumen Drehen'!C20","v":0},{"$f":"'Aufmaß Zeitspanvolumen Drehen'!D20","v":0},{"$f":"'Aufmaß Zeitspanvolumen Drehen'!E20","v":0},{"$f":"'Aufmaß Zeitspanvolumen Drehen'!F20","v":0},{"$f":"'Aufmaß Zeitspanvolumen Drehen'!G20","v":0},{"$f":"'Aufmaß Zeitspanvolumen Drehen'!H20","v":0},{"$f":"'Aufmaß Zeitspanvolumen Drehen'!I20","v":0},null,null,null,0,0,0,0,0,0,0,0,0]
[null,null,null,{"$f":"'Aufmaß Zeitspanvolumen Drehen'!A21","v":0},{"$f":"'Aufmaß Zeitspanvolumen Drehen'!B21","v":0},{"$f":"'Aufmaß Zeitspanvolumen Drehen'!C21","v":0},{"$f":"'Aufmaß Zeitspanvolumen Drehen'!D21","v":0},{"$f":"'Aufmaß Zeitspanvolumen Drehen'!E21","v":0},{"$f":"'Aufmaß Zeitspanvolumen Drehen'!F21","v":0},{"$f":"'Aufmaß Zeitspanvolumen Drehen'!G21","v":0},{"$f":"'Aufmaß Zeitspanvolumen Drehen'!H21","v":0},{"$f":"'Aufmaß Zeitspanvolumen Drehen'!I21","v":0},null,null,null,0,0,0,0,0,0,0,0,0]
[null,null,null,{"$f":"'Aufmaß Zeitspanvolumen Drehen'!A22","v":0},{"$f":"'Aufmaß Zeitspanvolumen Drehen'!B22","v":0},{"$f":"'Aufmaß Zeitspanvolumen Drehen'!C22","v":0},{"$f":"'Aufmaß Zeitspanvolumen Drehen'!D22","v":0},{"$f":"'Aufmaß Zeitspanvolumen Drehen'!E22","v":0},{"$f":"'Aufmaß Zeitspanvolumen Drehen'!F22","v":0},{"$f":"'Aufmaß Zeitspanvolumen Drehen'!G22","v":0},{"$f":"'Aufmaß Zeitspanvolumen Drehen'!H22","v":0},{"$f":"'Aufmaß Zeitspanvolumen Drehen'!I22","v":0},null,null,null,0,0,0,0,0,0,0,0,0]
[null,null,null,{"$f":"'Aufmaß Zeitspanvolumen Drehen'!A23","v":0},{"$f":"'Aufmaß Zeitspanvolumen Drehen'!B23","v":0},{"$f":"'Aufmaß Zeitspanvolumen Drehen'!C23","v":0},{"$f":"'Aufmaß Zeitspanvolumen Drehen'!D23","v":0},{"$f":"'Aufmaß Zeitspanvolumen Drehen'!E23","v":0},{"$f":"'Aufmaß Zeitspanvolumen Drehen'!F23","v":0},{"$f":"'Aufmaß Zeitspanvolumen Drehen'!G23","v":0},{"$f":"'Aufmaß Zeitspanvolumen Drehen'!H23","v":0},{"$f":"'Aufmaß Zeitspanvolumen Drehen'!I23","v":0},null,null,null,0,0,0,0,0,0,0,0,0]
[null,null,null,{"$f":"'Aufmaß Zeitspanvolumen Drehen'!A24","v":0},{"$f":"'Aufmaß Zeitspanvolumen Drehen'!B24","v":0},{"$f":"'Aufmaß Zeitspanvolumen Drehen'!C24","v":0},{"$f":"'Aufmaß Zeitspanvolumen Drehen'!D24","v":0},{"$f":"'Aufmaß Zeitspanvolumen Drehen'!E24","v":0},{"$f":"'Aufmaß Zeitspanvolumen Drehen'!F24","v":0},{"$f":"'Aufmaß Zeitspanvolumen Drehen'!G24","v":0},{"$f":"'Aufmaß Zeitspanvolumen Drehen'!H24","v":0},{"$f":"'Aufmaß Zeitspanvolumen Drehen'!I24","v":0},null,null,null,0,0,0,0,0,0,0,0,0]
[null,null,null,{"$f":"'Aufmaß Zeitspanvolumen Drehen'!A25","v":0},{"$f":"'Aufmaß Zeitspanvolumen Drehen'!B25","v":0},{"$f":"'Aufmaß Zeitspanvolumen Drehen'!C25","v":0},{"$f":"'Aufmaß Zeitspanvolumen Drehen'!D25","v":0},{"$f":"'Aufmaß Zeitspanvolumen Drehen'!E25","v":0},{"$f":"'Aufmaß Zeitspanvolumen Drehen'!F25","v":0},{"$f":"'Aufmaß Zeitspanvolumen Drehen'!G25","v":0},{"$f":"'Aufmaß Zeitspanvolumen Drehen'!H25","v":0},{"$f":"'Aufmaß Zeitspanvolumen Drehen'!I25","v":0},null,null,null,0,0,0,0,0,0,0,0,0]
[null,null,null,{"$f":"'Aufmaß Zeitspanvolumen Drehen'!A26","v":0},{"$f":"'Aufmaß Zeitspanvolumen Drehen'!B26","v":0},{"$f":"'Aufmaß Zeitspanvolumen Drehen'!C26","v":0},{"$f":"'Aufmaß Zeitspanvolumen Drehen'!D26","v":0},{"$f":"'Aufmaß Zeitspanvolumen Drehen'!E26","v":0},{"$f":"'Aufmaß Zeitspanvolumen Drehen'!F26","v":0},{"$f":"'Aufmaß Zeitspanvolumen Drehen'!G26","v":0},{"$f":"'Aufmaß Zeitspanvolumen Drehen'!H26","v":0},{"$f":"'Aufmaß Zeitspanvolumen Drehen'!I26","v":0},null,null,null,0,0,0,0,0,0,0,0,0]
[null,null,null,{"$f":"'Aufmaß Zeitspanvolumen Drehen'!A27","v":0},{"$f":"'Aufmaß Zeitspanvolumen Drehen'!B27","v":0},{"$f":"'Aufmaß Zeitspanvolumen Drehen'!C27","v":0},{"$f":"'Aufmaß Zeitspanvolumen Drehen'!D27","v":0},{"$f":"'Aufmaß Zeitspanvolumen Drehen'!E27","v":0},{"$f":"'Aufmaß Zeitspanvolumen Drehen'!F27","v":0},{"$f":"'Aufmaß Zeitspanvolumen Drehen'!G27","v":0},{"$f":"'Aufmaß Zeitspanvolumen Drehen'!H27","v":0},{"$f":"'Aufmaß Zeitspanvolumen Drehen'!I27","v":0},null,null,null,0,0,0,0,0,0,0,0,0]
[null,null,null,{"$f":"'Aufmaß Zeitspanvolumen Drehen'!A28","v":0},{"$f":"'Aufmaß Zeitspanvolumen Drehen'!B28","v":0},{"$f":"'Aufmaß Zeitspanvolumen Drehen'!C28","v":0},{"$f":"'Aufmaß Zeitspanvolumen Drehen'!D28","v":0},{"$f":"'Aufmaß Zeitspanvolumen Drehen'!E28","v":0},{"$f":"'Aufmaß Zeitspanvolumen Drehen'!F28","v":0},{"$f":"'Aufmaß Zeitspanvolumen Drehen'!G28","v":0},{"$f":"'Aufmaß Zeitspanvolumen Drehen'!H28","v":0},{"$f":"'Aufmaß Zeitspanvolumen Drehen'!I28","v":0},null,null,null,0,0,0,0,0,0,0,0,0]
[null,null,null,{"$f":"'Aufmaß Zeitspanvolumen Drehen'!A29","v":0},{"$f":"'Aufmaß Zeitspanvolumen Drehen'!B29","v":0},{"$f":"'Aufmaß Zeitspanvolumen Drehen'!C29","v":0},{"$f":"'Aufmaß Zeitspanvolumen Drehen'!D29","v":0},{"$f":"'Aufmaß Zeitspanvolumen Drehen'!E29","v":0},{"$f":"'Aufmaß Zeitspanvolumen Drehen'!F29","v":0},{"$f":"'Aufmaß Zeitspanvolumen Drehen'!G29","v":0},{"$f":"'Aufmaß Zeitspanvolumen Drehen'!H29","v":0},{"$f":"'Aufmaß Zeitspanvolumen Drehen'!I29","v":0},null,null,null,0,0,0,0,0,0,0,0,0]
[null,null,null,{"$f":"'Aufmaß Zeitspanvolumen Drehen'!A30","v":0},{"$f":"'Aufmaß Zeitspanvolumen Drehen'!B30","v":0},{"$f":"'Aufmaß Zeitspanvolumen Drehen'!C30","v":0},{"$f":"'Aufmaß Zeitspanvolumen Drehen'!D30","v":0},{"$f":"'Aufmaß Zeitspanvolumen Drehen'!E30","v":0},{"$f":"'Aufmaß Zeitspanvolumen Drehen'!F30","v":0},{"$f":"'Aufmaß Zeitspanvolumen Drehen'!G30","v":0},{"$f":"'Aufmaß Zeitspanvolumen Drehen'!H30","v":0},{"$f":"'Aufmaß Zeitspanvolumen Drehen'!I30","v":0},null,null,null,0,0,0,0,0,0,0,0,0]
[null,null,null,{"$f":"'Aufmaß Zeitspanvolumen Drehen'!A31","v":0},{"$f":"'Aufmaß Zeitspanvolumen Drehen'!B31","v":0},{"$f":"'Aufmaß Zeitspanvolumen Drehen'!C31","v":0},{"$f":"'Aufmaß Zeitspanvolumen Drehen'!D31","v":0},{"$f":"'Aufmaß Zeitspanvolumen Drehen'!E31","v":0},{"$f":"'Aufmaß Zeitspanvolumen Drehen'!F31","v":0},{"$f":"'Aufmaß Zeitspanvolumen Drehen'!G31","v":0},{"$f":"'Aufmaß Zeitspanvolumen Drehen'!H31","v":0},{"$f":"'Aufmaß Zeitspanvolumen Drehen'!I31","v":0},null,null,null,0,0,0,0,0,0,0,0,0]
[null,null,null,{"$f":"'Aufmaß Zeitspanvolumen Drehen'!A32","v":0},{"$f":"'Aufmaß Zeitspanvolumen Drehen'!B32","v":0},{"$f":"'Aufmaß Zeitspanvolumen Drehen'!C32","v":0},{"$f":"'Aufmaß Zeitspanvolumen Drehen'!D32","v":0},{"$f":"'Aufmaß Zeitspanvolumen Drehen'!E32","v":0},{"$f":"'Aufmaß Zeitspanvolumen Drehen'!F32","v":0},{"$f":"'Aufmaß Zeitspanvolumen Drehen'!G32","v":0},{"$f":"'Aufmaß Zeitspanvolumen Drehen'!H32","v":0},{"$f":"'Aufmaß Zeitspanvolumen Drehen'!I32","v":0},null,null,null,0,0,0,0,0,0,0,0,0]
[null,null,null,{"$f":"'Aufmaß Zeitspanvolumen Drehen'!A33","v":0},{"$f":"'Aufmaß Zeitspanvolumen Drehen'!B33","v":0},{"$f":"'Aufmaß Zeitspanvolumen Drehen'!C33","v":0},{"$f":"'Aufmaß Zeitspanvolumen Drehen'!D33","v":0},{"$f":"'Aufmaß Zeitspanvolumen Drehen'!E33","v":0},{"$f":"'Aufmaß Zeitspanvolumen Drehen'!F33","v":0},{"$f":"'Aufmaß Zeitspanvolumen Drehen'!G33","v":0},{"$f":"'Aufmaß Zeitspanvolumen Drehen'!H33","v":0},{"$f":"'Aufmaß Zeitspanvolumen Drehen'!I33","v":0},null,null,null,0,0,0,0,0,0,0,0,0]
[null,null,null,{"$f":"'Aufmaß Zeitspanvolumen Drehen'!A34","v":0},{"$f":"'Aufmaß Zeitspanvolumen Drehen'!B34","v":0},{"$f":"'Aufmaß Zeitspanvolumen Drehen'!C34","v":0},{"$f":"'Aufmaß Zeitspanvolumen Drehen'!D34","v":0},{"$f":"'Aufmaß Zeitspanvolumen Drehen'!E34","v":0},{"$f":"'Aufmaß Zeitspanvolumen Drehen'!F34","v":0},{"$f":"'Aufmaß Zeitspanvolumen Drehen'!G34","v":0},{"$f":"'Aufmaß Zeitspanvolumen Drehen'!H34","v":0},{"$f":"'Aufmaß Zeitspanvolumen Drehen'!I34","v":0},null,null,null,0,0,0,0,0,0,0,0,0]
[null,null,null,{"$f":"'Aufmaß Zeitspanvolumen Drehen'!A35","v":0},{"$f":"'Aufmaß Zeitspanvolumen Drehen'!B35","v":0},{"$f":"'Aufmaß Zeitspanvolumen Drehen'!C35","v":0},{"$f":"'Aufmaß Zeitspanvolumen Drehen'!D35","v":0},{"$f":"'Aufmaß Zeitspanvolumen Drehen'!E35","v":0},{"$f":"'Aufmaß Zeitspanvolumen Drehen'!F35","v":0},{"$f":"'Aufmaß Zeitspanvolumen Drehen'!G35","v":0},{"$f":"'Aufmaß Zeitspanvolumen Drehen'!H35","v":0},{"$f":"'Aufmaß Zeitspanvolumen Drehen'!I35","v":0},null,null,null,0,0,0,0,0,0,0,0,0]
[null,null,null,{"$f":"'Aufmaß Zeitspanvolumen Drehen'!A36","v":0},{"$f":"'Aufmaß Zeitspanvolumen Drehen'!B36","v":0},{"$f":"'Aufmaß Zeitspanvolumen Drehen'!C36","v":0},{"$f":"'Aufmaß Zeitspanvolumen Drehen'!D36","v":0},{"$f":"'Aufmaß Zeitspanvolumen Drehen'!E36","v":0},{"$f":"'Aufmaß Zeitspanvolumen Drehen'!F36","v":0},{"$f":"'Aufmaß Zeitspanvolumen Drehen'!G36","v":0},{"$f":"'Aufmaß Zeitspanvolumen Drehen'!H36","v":0},{"$f":"'Aufmaß Zeitspanvolumen Drehen'!I36","v":0},null,null,null,0,0,0,0,0,0,0,0,0]
[null,null,null,{"$f":"'Aufmaß Zeitspanvolumen Drehen'!A37","v":0},{"$f":"'Aufmaß Zeitspanvolumen Drehen'!B37","v":0},{"$f":"'Aufmaß Zeitspanvolumen Drehen'!C37","v":0},{"$f":"'Aufmaß Zeitspanvolumen Drehen'!D37","v":0},{"$f":"'Aufmaß Zeitspanvolumen Drehen'!E37","v":0},{"$f":"'Aufmaß Zeitspanvolumen Drehen'!F37","v":0},{"$f":"'Aufmaß Zeitspanvolumen Drehen'!G37","v":0},{"$f":"'Aufmaß Zeitspanvolumen Drehen'!H37","v":0},{"$f":"'Aufmaß Zeitspanvolumen Drehen'!I37","v":0},null,null,null,0,0,0,0,0,0,0,0,0]
[null,null,null,{"$f":"'Aufmaß Zeitspanvolumen Drehen'!A38","v":0},{"$f":"'Aufmaß Zeitspanvolumen Drehen'!B38","v":0},{"$f":"'Aufmaß Zeitspanvolumen Drehen'!C38","v":0},{"$f":"'Aufmaß Zeitspanvolumen Drehen'!D38","v":0},{"$f":"'Aufmaß Zeitspanvolumen Drehen'!E38","v":0},{"$f":"'Aufmaß Zeitspanvolumen Drehen'!F38","v":0},{"$f":"'Aufmaß Zeitspanvolumen Drehen'!G38","v":0},{"$f":"'Aufmaß Zeitspanvolumen Drehen'!H38","v":0},{"$f":"'Aufmaß Zeitspanvolumen Drehen'!I38","v":0},null,null,null,0,0,0,0,0,0,0,0,0]
[null,null,null,{"$f":"'Aufmaß Zeitspanvolumen Drehen'!A39","v":0},{"$f":"'Aufmaß Zeitspanvolumen Drehen'!B39","v":0},{"$f":"'Aufmaß Zeitspanvolumen Drehen'!C39","v":0},{"$f":"'Aufmaß Zeitspanvolumen Drehen'!D39","v":0},{"$f":"'Aufmaß Zeitspanvolumen Drehen'!E39","v":0},{"$f":"'Aufmaß Zeitspanvolumen Drehen'!F39","v":0},{"$f":"'Aufmaß Zeitspanvolumen Drehen'!G39","v":0},{"$f":"'Aufmaß Zeitspanvolumen Drehen'!H39","v":0},{"$f":"'Aufmaß Zeitspanvolumen Drehen'!I39","v":0},null,null,null,0,0,0,0,0,0,0,0,0]
[null,null,null,{"$f":"'Aufmaß Zeitspanvolumen Drehen'!A40","v":0},{"$f":"'Aufmaß Zeitspanvolumen Drehen'!B40","v":0},{"$f":"'Aufmaß Zeitspanvolumen Drehen'!C40","v":0},{"$f":"'Aufmaß Zeitspanvolumen Drehen'!D40","v":0},{"$f":"'Aufmaß Zeitspanvolumen Drehen'!E40","v":0},{"$f":"'Aufmaß Zeitspanvolumen Drehen'!F40","v":0},{"$f":"'Aufmaß Zeitspanvolumen Drehen'!G40","v":0},{"$f":"'Aufmaß Zeitspanvolumen Drehen'!H40","v":0},{"$f":"'Aufmaß Zeitspanvolumen Drehen'!I40","v":0},null,null,null,0,0,0,0,0,0,0,0,0]
[null,null,null,{"$f":"'Aufmaß Zeitspanvolumen Drehen'!A41","v":0},{"$f":"'Aufmaß Zeitspanvolumen Drehen'!B41","v":0},{"$f":"'Aufmaß Zeitspanvolumen Drehen'!C41","v":0},{"$f":"'Aufmaß Zeitspanvolumen Drehen'!D41","v":0},{"$f":"'Aufmaß Zeitspanvolumen Drehen'!E41","v":0},{"$f":"'Aufmaß Zeitspanvolumen Drehen'!F41","v":0},{"$f":"'Aufmaß Zeitspanvolumen Drehen'!G41","v":0},{"$f":"'Aufmaß Zeitspanvolumen Drehen'!H41","v":0},{"$f":"'Aufmaß Zeitspanvolumen Drehen'!I41","v":0},null,null,null,0,0,0,0,0,0,0,0,0]
[null,null,null,{"$f":"'Aufmaß Zeitspanvolumen Drehen'!A42","v":0},{"$f":"'Aufmaß Zeitspanvolumen Drehen'!B42","v":0},{"$f":"'Aufmaß Zeitspanvolumen Drehen'!C42","v":0},{"$f":"'Aufmaß Zeitspanvolumen Drehen'!D42","v":0},{"$f":"'Aufmaß Zeitspanvolumen Drehen'!E42","v":0},{"$f":"'Aufmaß Zeitspanvolumen Drehen'!F42","v":0},{"$f":"'Aufmaß Zeitspanvolumen Drehen'!G42","v":0},{"$f":"'Aufmaß Zeitspanvolumen Drehen'!H42","v":0},{"$f":"'Aufmaß Zeitspanvolumen Drehen'!I42","v":0},null,null,null,0,0,0,0,0,0,0,0,0]
[null,null,null,{"$f":"'Aufmaß Zeitspanvolumen Drehen'!A43","v":0},{"$f":"'Aufmaß Zeitspanvolumen Drehen'!B43","v":0},{"$f":"'Aufmaß Zeitspanvolumen Drehen'!C43","v":0},{"$f":"'Aufmaß Zeitspanvolumen Drehen'!D43","v":0},{"$f":"'Aufmaß Zeitspanvolumen Drehen'!E43","v":0},{"$f":"'Aufmaß Zeitspanvolumen Drehen'!F43","v":0},{"$f":"'Aufmaß Zeitspanvolumen Drehen'!G43","v":0},{"$f":"'Aufmaß Zeitspanvolumen Drehen'!H43","v":0},{"$f":"'Aufmaß Zeitspanvolumen Drehen'!I43","v":0},null,null,null,0,0,0,0,0,0,0,0,0]
[null,null,null,{"$f":"'Aufmaß Zeitspanvolumen Drehen'!A44","v":0},{"$f":"'Aufmaß Zeitspanvolumen Drehen'!B44","v":0},{"$f":"'Aufmaß Zeitspanvolumen Drehen'!C44","v":0},{"$f":"'Aufmaß Zeitspanvolumen Drehen'!D44","v":0},{"$f":"'Aufmaß Zeitspanvolumen Drehen'!E44","v":0},{"$f":"'Aufmaß Zeitspanvolumen Drehen'!F44","v":0},{"$f":"'Aufmaß Zeitspanvolumen Drehen'!G44","v":0},{"$f":"'Aufmaß Zeitspanvolumen Drehen'!H44","v":0},{"$f":"'Aufmaß Zeitspanvolumen Drehen'!I44","v":0},null,null,null,0,0,0,0,0,0,0,0,0]
[null,null,null,{"$f":"'Aufmaß Zeitspanvolumen Drehen'!A45","v":0},{"$f":"'Aufmaß Zeitspanvolumen Drehen'!B45","v":0},{"$f":"'Aufmaß Zeitspanvolumen Drehen'!C45","v":0},{"$f":"'Aufmaß Zeitspanvolumen Drehen'!D45","v":0},{"$f":"'Aufmaß Zeitspanvolumen Drehen'!E45","v":0},{"$f":"'Aufmaß Zeitspanvolumen Drehen'!F45","v":0},{"$f":"'Aufmaß Zeitspanvolumen Drehen'!G45","v":0},{"$f":"'Aufmaß Zeitspanvolumen Drehen'!H45","v":0},{"$f":"'Aufmaß Zeitspanvolumen Drehen'!I45","v":0},null,null,null,0,0,0,0,0,0,0,0,0]
[null,null,null,{"$f":"'Aufmaß Zeitspanvolumen Drehen'!A46","v":0},{"$f":"'Aufmaß Zeitspanvolumen Drehen'!B46","v":0},{"$f":"'Aufmaß Zeitspanvolumen Drehen'!C46","v":0},{"$f":"'Aufmaß Zeitspanvolumen Drehen'!D46","v":0},{"$f":"'Aufmaß Zeitspanvolumen Drehen'!E46","v":0},{"$f":"'Aufmaß Zeitspanvolumen Drehen'!F46","v":0},{"$f":"'Aufmaß Zeitspanvolumen Drehen'!G46","v":0},{"$f":"'Aufmaß Zeitspanvolumen Drehen'!H46","v":0},{"$f":"'Aufmaß Zeitspanvolumen Drehen'!I46","v":0},null,null,null,0,0,0,0,0,0,0,0,0]
[null,null,null,{"$f":"'Aufmaß Zeitspanvolumen Drehen'!A47","v":0},{"$f":"'Aufmaß Zeitspanvolumen Drehen'!B47","v":0},{"$f":"'Aufmaß Zeitspanvolumen Drehen'!C47","v":0},{"$f":"'Aufmaß Zeitspanvolumen Drehen'!D47","v":0},{"$f":"'Aufmaß Zeitspanvolumen Drehen'!E47","v":0},{"$f":"'Aufmaß Zeitspanvolumen Drehen'!F47","v":0},{"$f":"'Aufmaß Zeitspanvolumen Drehen'!G47","v":0},{"$f":"'Aufmaß Zeitspanvolumen Drehen'!H47","v":0},{"$f":"'Aufmaß Zeitspanvolumen Drehen'!I47","v":0},null,null,null,0,0,0,0,0,0,0,0,0]
[null,null,null,{"$f":"'Aufmaß Zeitspanvolumen Drehen'!A48","v":0},{"$f":"'Aufmaß Zeitspanvolumen Drehen'!B48","v":0},{"$f":"'Aufmaß Zeitspanvolumen Drehen'!C48","v":0},{"$f":"'Aufmaß Zeitspanvolumen Drehen'!D48","v":0},{"$f":"'Aufmaß Zeitspanvolumen Drehen'!E48","v":0},{"$f":"'Aufmaß Zeitspanvolumen Drehen'!F48","v":0},{"$f":"'Aufmaß Zeitspanvolumen Drehen'!G48","v":0},{"$f":"'Aufmaß Zeitspanvolumen Drehen'!H48","v":0},{"$f":"'Aufmaß Zeitspanvolumen Drehen'!I48","v":0},null,null,null,0,0,0,0,0,0,0,0,0]
[null,null,null,{"$f":"'Aufmaß Zeitspanvolumen Drehen'!A49","v":0},{"$f":"'Aufmaß Zeitspanvolumen Drehen'!B49","v":0},{"$f":"'Aufmaß Zeitspanvolumen Drehen'!C49","v":0},{"$f":"'Aufmaß Zeitspanvolumen Drehen'!D49","v":0},{"$f":"'Aufmaß Zeitspanvolumen Drehen'!E49","v":0},{"$f":"'Aufmaß Zeitspanvolumen Drehen'!F49","v":0},{"$f":"'Aufmaß Zeitspanvolumen Drehen'!G49","v":0},{"$f":"'Aufmaß Zeitspanvolumen Drehen'!H49","v":0},{"$f":"'Aufmaß Zeitspanvolumen Drehen'!I49","v":0},null,null,null,0,0,0,0,0,0,0,0,0]
[null,null,null,{"$f":"'Aufmaß Zeitspanvolumen Drehen'!A50","v":0},{"$f":"'Aufmaß Zeitspanvolumen Drehen'!B50","v":0},{"$f":"'Aufmaß Zeitspanvolumen Drehen'!C50","v":0},{"$f":"'Aufmaß Zeitspanvolumen Drehen'!D50","v":0},{"$f":"'Aufmaß Zeitspanvolumen Drehen'!E50","v":0},{"$f":"'Aufmaß Zeitspanvolumen Drehen'!F50","v":0},{"$f":"'Aufmaß Zeitspanvolumen Drehen'!G50","v":0},{"$f":"'Aufmaß Zeitspanvolumen Drehen'!H50","v":0},{"$f":"'Aufmaß Zeitspanvolumen Drehen'!I50","v":0},null,null,null,0,0,0,0,0,0,0,0,0]
[null,null,null,{"$f":"'Aufmaß Zeitspanvolumen Drehen'!A51","v":0},{"$f":"'Aufmaß Zeitspanvolumen Drehen'!B51","v":0},{"$f":"'Aufmaß Zeitspanvolumen Drehen'!C51","v":0},{"$f":"'Aufmaß Zeitspanvolumen Drehen'!D51","v":0},{"$f":"'Aufmaß Zeitspanvolumen Drehen'!E51","v":0},{"$f":"'Aufmaß Zeitspanvolumen Drehen'!F51","v":0},{"$f":"'Aufmaß Zeitspanvolumen Drehen'!G51","v":0},{"$f":"'Aufmaß Zeitspanvolumen Drehen'!H51","v":0},{"$f":"'Aufmaß Zeitspanvolumen Drehen'!I51","v":0},null,null,null,0,0,0,0,0,0,0,0,0]
[null,null,null,{"$f":"'Aufmaß Zeitspanvolumen Drehen'!A52","v":0},{"$f":"'Aufmaß Zeitspanvolumen Drehen'!B52","v":0},{"$f":"'Aufmaß Zeitspanvolumen Drehen'!C52","v":0},{"$f":"'Aufmaß Zeitspanvolumen Drehen'!D52","v":0},{"$f":"'Aufmaß Zeitspanvolumen Drehen'!E52","v":0},{"$f":"'Aufmaß Zeitspanvolumen Drehen'!F52","v":0},{"$f":"'Aufmaß Zeitspanvolumen Drehen'!G52","v":0},{"$f":"'Aufmaß Zeitspanvolumen Drehen'!H52","v":0},{"$f":"'Aufmaß Zeitspanvolumen Drehen'!I52","v":0},null,null,null,0,0,0,0,0,0,0,0,0]
[null,null,null,{"$f":"'Aufmaß Zeitspanvolumen Drehen'!A53","v":0},{"$f":"'Aufmaß Zeitspanvolumen Drehen'!B53","v":0},{"$f":"'Aufmaß Zeitspanvolumen Drehen'!C53","v":0},{"$f":"'Aufmaß Zeitspanvolumen Drehen'!D53","v":0},{"$f":"'Aufmaß Zeitspanvolumen Drehen'!E53","v":0},{"$f":"'Aufmaß Zeitspanvolumen Drehen'!F53","v":0},{"$f":"'Aufmaß Zeitspanvolumen Drehen'!G53","v":0},{"$f":"'Aufmaß Zeitspanvolumen Drehen'!H53","v":0},{"$f":"'Aufmaß Zeitspanvolumen Drehen'!I53","v":0},null,null,null,0,0,0,0,0,0,0,0,0]
[null,null,null,{"$f":"'Aufmaß Zeitspanvolumen Drehen'!A54","v":0},{"$f":"'Aufmaß Zeitspanvolumen Drehen'!B54","v":0},{"$f":"'Aufmaß Zeitspanvolumen Drehen'!C54","v":0},{"$f":"'Aufmaß Zeitspanvolumen Drehen'!D54","v":0},{"$f":"'Aufmaß Zeitspanvolumen Drehen'!E54","v":0},{"$f":"'Aufmaß Zeitspanvolumen Drehen'!F54","v":0},{"$f":"'Aufmaß Zeitspanvolumen Drehen'!G54","v":0},{"$f":"'Aufmaß Zeitspanvolumen Drehen'!H54","v":0},{"$f":"'Aufmaß Zeitspanvolumen Drehen'!I54","v":0},null,null,null,0,0,0,0,0,0,0,0,0]
[null,null,null,{"$f":"'Aufmaß Zeitspanvolumen Drehen'!A55","v":0},{"$f":"'Aufmaß Zeitspanvolumen Drehen'!B55","v":0},{"$f":"'Aufmaß Zeitspanvolumen Drehen'!C55","v":0},{"$f":"'Aufmaß Zeitspanvolumen Drehen'!D55","v":0},{"$f":"'Aufmaß Zeitspanvolumen Drehen'!E55","v":0},{"$f":"'Aufmaß Zeitspanvolumen Drehen'!F55","v":0},{"$f":"'Aufmaß Zeitspanvolumen Drehen'!G55","v":0},{"$f":"'Aufmaß Zeitspanvolumen Drehen'!H55","v":0},{"$f":"'Aufmaß Zeitspanvolumen Drehen'!I55","v":0},null,null,null,0,0,0,0,0,0,0,0,0]
[null,null,null,{"$f":"'Aufmaß Zeitspanvolumen Drehen'!A56","v":0},{"$f":"'Aufmaß Zeitspanvolumen Drehen'!B56","v":0},{"$f":"'Aufmaß Zeitspanvolumen Drehen'!C56","v":0},{"$f":"'Aufmaß Zeitspanvolumen Drehen'!D56","v":0},{"$f":"'Aufmaß Zeitspanvolumen Drehen'!E56","v":0},{"$f":"'Aufmaß Zeitspanvolumen Drehen'!F56","v":0},{"$f":"'Aufmaß Zeitspanvolumen Drehen'!G56","v":0},{"$f":"'Aufmaß Zeitspanvolumen Drehen'!H56","v":0},{"$f":"'Aufmaß Zeitspanvolumen Drehen'!I56","v":0},null,null,null,0,0,0,0,0,0,0,0,0]
[null,null,null,{"$f":"'Aufmaß Zeitspanvolumen Drehen'!A57","v":0},{"$f":"'Aufmaß Zeitspanvolumen Drehen'!B57","v":0},{"$f":"'Aufmaß Zeitspanvolumen Drehen'!C57","v":0},{"$f":"'Aufmaß Zeitspanvolumen Drehen'!D57","v":0},{"$f":"'Aufmaß Zeitspanvolumen Drehen'!E57","v":0},{"$f":"'Aufmaß Zeitspanvolumen Drehen'!F57","v":0},{"$f":"'Aufmaß Zeitspanvolumen Drehen'!G57","v":0},{"$f":"'Aufmaß Zeitspanvolumen Drehen'!H57","v":0},{"$f":"'Aufmaß Zeitspanvolumen Drehen'!I57","v":0},null,null,null,0,0,0,0,0,0,0,0,0]
[null,null,null,{"$f":"'Aufmaß Zeitspanvolumen Drehen'!A58","v":0},{"$f":"'Aufmaß Zeitspanvolumen Drehen'!B58","v":0},{"$f":"'Aufmaß Zeitspanvolumen Drehen'!C58","v":0},{"$f":"'Aufmaß Zeitspanvolumen Drehen'!D58","v":0},{"$f":"'Aufmaß Zeitspanvolumen Drehen'!E58","v":0},{"$f":"'Aufmaß Zeitspanvolumen Drehen'!F58","v":0},{"$f":"'Aufmaß Zeitspanvolumen Drehen'!G58","v":0},{"$f":"'Aufmaß Zeitspanvolumen Drehen'!H58","v":0},{"$f":"'Aufmaß Zeitspanvolumen Drehen'!I58","v":0},null,null,null,0,0,0,0,0,0,0,0,0]

{"sheet":"Löschen","index":46,"n_rows":107,"n_cols":16,"rows_kept":107,"cut":false,"hidden":false,"merged":[]}
[null,"Datensatz und Datei löschen",null,null,null,null,null,null,null,null,null,null,null,null,null,"0815"]
[null,null,null,null,null,null,null,null,null,null,null,null,null,null,null,{"$f":"IF(P1<>C5,\"Hinweis7\",IF(B7=0,\"Hinweis8\",IF(P3=\"*\",\"Hinweis9\",\"Datensatz_loeschen\")))","v":"Hinweis7"}]
[null,null,null,null,null,null,null,null,null,null,null,null,null,null,null,{"$f":"MID(B7,1,1)","v":""}]
[null,null,"Passworteingabe","Passwort ="]
[null,null,null,"0815"]
[null,"Teile-Nr.","Benennung"]
[null,null,{"$f":"IF(B7=0,\"\",VLOOKUP(B7,Suche!A:B,2,FALSE))","v":""}]
[null,null,{"$f":"IF(B8=0,\"\",VLOOKUP(B8,Suche!A:B,2,FALSE))","v":""}]
[null,null,{"$f":"IF(B9=0,\"\",VLOOKUP(B9,Suche!A:B,2,FALSE))","v":""}]
[null,null,{"$f":"IF(B10=0,\"\",VLOOKUP(B10,Suche!A:B,2,FALSE))","v":""}]
[null,null,{"$f":"IF(B11=0,\"\",VLOOKUP(B11,Suche!A:B,2,FALSE))","v":""}]
[null,null,{"$f":"IF(B12=0,\"\",VLOOKUP(B12,Suche!A:B,2,FALSE))","v":""}]
[null,null,{"$f":"IF(B13=0,\"\",VLOOKUP(B13,Suche!A:B,2,FALSE))","v":""}]
[null,null,{"$f":"IF(B14=0,\"\",VLOOKUP(B14,Suche!A:B,2,FALSE))","v":""}]
[null,null,{"$f":"IF(B15=0,\"\",VLOOKUP(B15,Suche!A:B,2,FALSE))","v":""}]
[null,null,{"$f":"IF(B16=0,\"\",VLOOKUP(B16,Suche!A:B,2,FALSE))","v":""}]
[null,null,{"$f":"IF(B17=0,\"\",VLOOKUP(B17,Suche!A:B,2,FALSE))","v":""}]
[null,null,{"$f":"IF(B18=0,\"\",VLOOKUP(B18,Suche!A:B,2,FALSE))","v":""}]
[null,null,{"$f":"IF(B19=0,\"\",VLOOKUP(B19,Suche!A:B,2,FALSE))","v":""}]
[null,null,{"$f":"IF(B20=0,\"\",VLOOKUP(B20,Suche!A:B,2,FALSE))","v":""}]
[null,null,{"$f":"IF(B21=0,\"\",VLOOKUP(B21,Suche!A:B,2,FALSE))","v":""}]
[null,null,{"$f":"IF(B22=0,\"\",VLOOKUP(B22,Suche!A:B,2,FALSE))","v":""}]
[null,null,{"$f":"IF(B23=0,\"\",VLOOKUP(B23,Suche!A:B,2,FALSE))","v":""}]
[null,null,{"$f":"IF(B24=0,\"\",VLOOKUP(B24,Suche!A:B,2,FALSE))","v":""}]
[null,null,{"$f":"IF(B25=0,\"\",VLOOKUP(B25,Suche!A:B,2,FALSE))","v":""}]
[null,null,{"$f":"IF(B26=0,\"\",VLOOKUP(B26,Suche!A:B,2,FALSE))","v":""}]
[null,null,{"$f":"IF(B27=0,\"\",VLOOKUP(B27,Suche!A:B,2,FALSE))","v":""}]
[null,null,{"$f":"IF(B28=0,\"\",VLOOKUP(B28,Suche!A:B,2,FALSE))","v":""}]
[null,null,{"$f":"IF(B29=0,\"\",VLOOKUP(B29,Suche!A:B,2,FALSE))","v":""}]
[null,null,{"$f":"IF(B30=0,\"\",VLOOKUP(B30,Suche!A:B,2,FALSE))","v":""}]
[null,null,{"$f":"IF(B31=0,\"\",VLOOKUP(B31,Suche!A:B,2,FALSE))","v":""}]
[null,null,{"$f":"IF(B32=0,\"\",VLOOKUP(B32,Suche!A:B,2,FALSE))","v":""}]
[null,null,{"$f":"IF(B33=0,\"\",VLOOKUP(B33,Suche!A:B,2,FALSE))","v":""}]
[null,null,{"$f":"IF(B34=0,\"\",VLOOKUP(B34,Suche!A:B,2,FALSE))","v":""}]
[null,null,{"$f":"IF(B35=0,\"\",VLOOKUP(B35,Suche!A:B,2,FALSE))","v":""}]
[null,null,{"$f":"IF(B36=0,\"\",VLOOKUP(B36,Suche!A:B,2,FALSE))","v":""}]
[null,null,{"$f":"IF(B37=0,\"\",VLOOKUP(B37,Suche!A:B,2,FALSE))","v":""}]
[null,null,{"$f":"IF(B38=0,\"\",VLOOKUP(B38,Suche!A:B,2,FALSE))","v":""}]
[null,null,{"$f":"IF(B39=0,\"\",VLOOKUP(B39,Suche!A:B,2,FALSE))","v":""}]
[null,null,{"$f":"IF(B40=0,\"\",VLOOKUP(B40,Suche!A:B,2,FALSE))","v":""}]
[null,null,{"$f":"IF(B41=0,\"\",VLOOKUP(B41,Suche!A:B,2,FALSE))","v":""}]
[null,null,{"$f":"IF(B42=0,\"\",VLOOKUP(B42,Suche!A:B,2,FALSE))","v":""}]
[null,null,{"$f":"IF(B43=0,\"\",VLOOKUP(B43,Suche!A:B,2,FALSE))","v":""}]
[null,null,{"$f":"IF(B44=0,\"\",VLOOKUP(B44,Suche!A:B,2,FALSE))","v":""}]
[null,null,{"$f":"IF(B45=0,\"\",VLOOKUP(B45,Suche!A:B,2,FALSE))","v":""}]
[null,null,{"$f":"IF(B46=0,\"\",VLOOKUP(B46,Suche!A:B,2,FALSE))","v":""}]
[null,null,{"$f":"IF(B47=0,\"\",VLOOKUP(B47,Suche!A:B,2,FALSE))","v":""}]
[null,null,{"$f":"IF(B48=0,\"\",VLOOKUP(B48,Suche!A:B,2,FALSE))","v":""}]
[null,null,{"$f":"IF(B49=0,\"\",VLOOKUP(B49,Suche!A:B,2,FALSE))","v":""}]
[null,null,{"$f":"IF(B50=0,\"\",VLOOKUP(B50,Suche!A:B,2,FALSE))","v":""}]
[null,null,{"$f":"IF(B51=0,\"\",VLOOKUP(B51,Suche!A:B,2,FALSE))","v":""}]
[null,null,{"$f":"IF(B52=0,\"\",VLOOKUP(B52,Suche!A:B,2,FALSE))","v":""}]
[null,null,{"$f":"IF(B53=0,\"\",VLOOKUP(B53,Suche!A:B,2,FALSE))","v":""}]
[null,null,{"$f":"IF(B54=0,\"\",VLOOKUP(B54,Suche!A:B,2,FALSE))","v":""}]
[null,null,{"$f":"IF(B55=0,\"\",VLOOKUP(B55,Suche!A:B,2,FALSE))","v":""}]
[null,null,{"$f":"IF(B56=0,\"\",VLOOKUP(B56,Suche!A:B,2,FALSE))","v":""}]
[null,null,{"$f":"IF(B57=0,\"\",VLOOKUP(B57,Suche!A:B,2,FALSE))","v":""}]
[null,null,{"$f":"IF(B58=0,\"\",VLOOKUP(B58,Suche!A:B,2,FALSE))","v":""}]
[null,null,{"$f":"IF(B59=0,\"\",VLOOKUP(B59,Suche!A:B,2,FALSE))","v":""}]
[null,null,{"$f":"IF(B60=0,\"\",VLOOKUP(B60,Suche!A:B,2,FALSE))","v":""}]
[null,null,{"$f":"IF(B61=0,\"\",VLOOKUP(B61,Suche!A:B,2,FALSE))","v":""}]
[null,null,{"$f":"IF(B62=0,\"\",VLOOKUP(B62,Suche!A:B,2,FALSE))","v":""}]
[null,null,{"$f":"IF(B63=0,\"\",VLOOKUP(B63,Suche!A:B,2,FALSE))","v":""}]
[null,null,{"$f":"IF(B64=0,\"\",VLOOKUP(B64,Suche!A:B,2,FALSE))","v":""}]
[null,null,{"$f":"IF(B65=0,\"\",VLOOKUP(B65,Suche!A:B,2,FALSE))","v":""}]
[null,null,{"$f":"IF(B66=0,\"\",VLOOKUP(B66,Suche!A:B,2,FALSE))","v":""}]
[null,null,{"$f":"IF(B67=0,\"\",VLOOKUP(B67,Suche!A:B,2,FALSE))","v":""}]
[null,null,{"$f":"IF(B68=0,\"\",VLOOKUP(B68,Suche!A:B,2,FALSE))","v":""}]
[null,null,{"$f":"IF(B69=0,\"\",VLOOKUP(B69,Suche!A:B,2,FALSE))","v":""}]
[null,null,{"$f":"IF(B70=0,\"\",VLOOKUP(B70,Suche!A:B,2,FALSE))","v":""}]
[null,null,{"$f":"IF(B71=0,\"\",VLOOKUP(B71,Suche!A:B,2,FALSE))","v":""}]
[null,null,{"$f":"IF(B72=0,\"\",VLOOKUP(B72,Suche!A:B,2,FALSE))","v":""}]
[null,null,{"$f":"IF(B73=0,\"\",VLOOKUP(B73,Suche!A:B,2,FALSE))","v":""}]
[null,null,{"$f":"IF(B74=0,\"\",VLOOKUP(B74,Suche!A:B,2,FALSE))","v":""}]
[null,null,{"$f":"IF(B75=0,\"\",VLOOKUP(B75,Suche!A:B,2,FALSE))","v":""}]
[null,null,{"$f":"IF(B76=0,\"\",VLOOKUP(B76,Suche!A:B,2,FALSE))","v":""}]
[null,null,{"$f":"IF(B77=0,\"\",VLOOKUP(B77,Suche!A:B,2,FALSE))","v":""}]
[null,null,{"$f":"IF(B78=0,\"\",VLOOKUP(B78,Suche!A:B,2,FALSE))","v":""}]
[null,null,{"$f":"IF(B79=0,\"\",VLOOKUP(B79,Suche!A:B,2,FALSE))","v":""}]
[null,null,{"$f":"IF(B80=0,\"\",VLOOKUP(B80,Suche!A:B,2,FALSE))","v":""}]
[null,null,{"$f":"IF(B81=0,\"\",VLOOKUP(B81,Suche!A:B,2,FALSE))","v":""}]
[null,null,{"$f":"IF(B82=0,\"\",VLOOKUP(B82,Suche!A:B,2,FALSE))","v":""}]
[null,null,{"$f":"IF(B83=0,\"\",VLOOKUP(B83,Suche!A:B,2,FALSE))","v":""}]
[null,null,{"$f":"IF(B84=0,\"\",VLOOKUP(B84,Suche!A:B,2,FALSE))","v":""}]
[null,null,{"$f":"IF(B85=0,\"\",VLOOKUP(B85,Suche!A:B,2,FALSE))","v":""}]
[null,null,{"$f":"IF(B86=0,\"\",VLOOKUP(B86,Suche!A:B,2,FALSE))","v":""}]
[null,null,{"$f":"IF(B87=0,\"\",VLOOKUP(B87,Suche!A:B,2,FALSE))","v":""}]
[null,null,{"$f":"IF(B88=0,\"\",VLOOKUP(B88,Suche!A:B,2,FALSE))","v":""}]
[null,null,{"$f":"IF(B89=0,\"\",VLOOKUP(B89,Suche!A:B,2,FALSE))","v":""}]
[null,null,{"$f":"IF(B90=0,\"\",VLOOKUP(B90,Suche!A:B,2,FALSE))","v":""}]
[null,null,{"$f":"IF(B91=0,\"\",VLOOKUP(B91,Suche!A:B,2,FALSE))","v":""}]
[null,null,{"$f":"IF(B92=0,\"\",VLOOKUP(B92,Suche!A:B,2,FALSE))","v":""}]
[null,null,{"$f":"IF(B93=0,\"\",VLOOKUP(B93,Suche!A:B,2,FALSE))","v":""}]
[null,null,{"$f":"IF(B94=0,\"\",VLOOKUP(B94,Suche!A:B,2,FALSE))","v":""}]
[null,null,{"$f":"IF(B95=0,\"\",VLOOKUP(B95,Suche!A:B,2,FALSE))","v":""}]
[null,null,{"$f":"IF(B96=0,\"\",VLOOKUP(B96,Suche!A:B,2,FALSE))","v":""}]
[null,null,{"$f":"IF(B97=0,\"\",VLOOKUP(B97,Suche!A:B,2,FALSE))","v":""}]
[null,null,{"$f":"IF(B98=0,\"\",VLOOKUP(B98,Suche!A:B,2,FALSE))","v":""}]
[null,null,{"$f":"IF(B99=0,\"\",VLOOKUP(B99,Suche!A:B,2,FALSE))","v":""}]
[null,null,{"$f":"IF(B100=0,\"\",VLOOKUP(B100,Suche!A:B,2,FALSE))","v":""}]
[null,null,{"$f":"IF(B101=0,\"\",VLOOKUP(B101,Suche!A:B,2,FALSE))","v":""}]
[null,null,{"$f":"IF(B102=0,\"\",VLOOKUP(B102,Suche!A:B,2,FALSE))","v":""}]
[null,null,{"$f":"IF(B103=0,\"\",VLOOKUP(B103,Suche!A:B,2,FALSE))","v":""}]
[null,null,{"$f":"IF(B104=0,\"\",VLOOKUP(B104,Suche!A:B,2,FALSE))","v":""}]
[null,null,{"$f":"IF(B105=0,\"\",VLOOKUP(B105,Suche!A:B,2,FALSE))","v":""}]
[null,null,{"$f":"IF(B106=0,\"\",VLOOKUP(B106,Suche!A:B,2,FALSE))","v":""}]
[null,null,{"$f":"IF(B107=0,\"\",VLOOKUP(B107,Suche!A:B,2,FALSE))","v":""}]

{"sheet":"Werkzeugdaten","index":47,"n_rows":2,"n_cols":11,"rows_kept":2,"cut":false,"hidden":false,"merged":[]}
[null,"Werkzeugdaten und Schnittwerte"]
[null,"Bearbeitung: (Drehen, Fräsen, Bohren)","Material:","Werkzeug:","Wendeplatte:","Anzahl der Wendeplatten (Schneiden):","Schnittgeschwindigkeit (Vc in m/min)","Vorschub pro Zahn (Schneide) (fz in mm)","Schnitttiefe (ap in mm)","Schnittbreite (ae in mm)","Bemerkung:"]