{"text_format":"1","workbook":"xlsx","n_sheets":6,"sheets":["Dateneingabe","Dateneingabe-Sortiert","Schichtplan","Auswertung","Urlaub Eintragung MA","Werte"],"not_rendered":{"charts":13,"images":0,"macros":1,"external_links":0,"defined_names":9,"comments":5,"pivot_tables":0},"unopened":[],"bounds":{"document_bytes":16777216,"sheet_cells":100000,"rows_first":2000,"rows_last":500,"rows_between":2000,"halvings":0,"cell_chars":16384,"cell_head_chars":4096},"cells_cut":0,"cells_raw":0,"read":"whole","date_system":"1900"}

{"sheet":"Dateneingabe","index":0,"n_rows":156,"n_cols":30,"rows_kept":156,"cut":false,"hidden":false,"merged":[[0,1,0,4]]}
["Demoversion","Stammdaten-Dateneingabeblatt"]
[{"$f":"WEEKDAY($A$4)","v":4},"1.Wochentag","2.Wochentag","3.Wochentag","4.Wochentag"]
["Eingabe 1.1. im Geltungsjahr",{"$f":"IF($A$2=1,\"So\",IF($A$2=2,\"Mo\",IF($A$2=3,\"Di\",IF($A$2=4,\"Mi\",IF($A$2=5,\"Do\",IF($A$2=6,\"Fr\",IF($A$2=7,\"Sa\",0)))))))","v":"Mi"},{"$f":"IF(B3=\"Mo\",\"Di\",IF(B3=\"Di\",\"Mi\",IF(B3=\"Mi\",\"Do\",IF(B3=\"Do\",\"Fr\",IF(B3=\"Fr\",\"Sa\",IF(B3=\"Sa\",\"So\",IF(B3=\"So\",\"Mo\",\"\")))))))","v":"Do"},{"$f":"IF(C3=\"Mo\",\"Di\",IF(C3=\"Di\",\"Mi\",IF(C3=\"Mi\",\"Do\",IF(C3=\"Do\",\"Fr\",IF(C3=\"Fr\",\"Sa\",IF(C3=\"Sa\",\"So\",IF(C3=\"So\",\"Mo\",\"\")))))))","v":"Fr"},{"$f":"IF(D3=\"Mo\",\"Di\",IF(D3=\"Di\",\"Mi\",IF(D3=\"Mi\",\"Do\",IF(D3=\"Do\",\"Fr\",IF(D3=\"Fr\",\"Sa\",IF(D3=\"Sa\",\"So\",IF(D3=\"So\",\"Mo\",\"\")))))))","v":"Sa"},{"$f":"VALUE($F$4)+VALUE($F$5)","v":2}]
["2014-01-01","5.Wochentag","6.Wochentag","7.Wochentag","Schaltjahr ?",{"$f":"DAY($A$4)","v":1}]
[{"$f":"A4+365","v":"2015-01-01"},{"$f":"IF(E3=\"Mo\",\"Di\",IF(E3=\"Di\",\"Mi\",IF(E3=\"Mi\",\"Do\",IF(E3=\"Do\",\"Fr\",IF(E3=\"Fr\",\"Sa\",IF(E3=\"Sa\",\"So\",IF(E3=\"So\",\"Mo\",\"\")))))))","v":"So"},{"$f":"IF(B5=\"Mo\",\"Di\",IF(B5=\"Di\",\"Mi\",IF(B5=\"Mi\",\"Do\",IF(B5=\"Do\",\"Fr\",IF(B5=\"Fr\",\"Sa\",IF(B5=\"Sa\",\"So\",IF(B5=\"So\",\"Mo\",\"\")))))))","v":"Mo"},{"$f":"IF(C5=\"Mo\",\"Di\",IF(C5=\"Di\",\"Mi\",IF(C5=\"Mi\",\"Do\",IF(C5=\"Do\",\"Fr\",IF(C5=\"Fr\",\"Sa\",IF(C5=\"Sa\",\"So\",IF(C5=\"So\",\"Mo\",\"\")))))))","v":"Di"},{"$f":"IF(F3=32,\"Ja\",IF(F3=2,\"Nein\",\"Fehler\"))","v":"Nein"},{"$f":"DAY($A$5)","v":1}]
["Name, Vorname","Stamm-Nr.","Bemerkung","Abteilung","Geburtstag","PLZ","Wohnort","Straße","Telefon","Funk / E-Mail","Jahresurlaub in Tagen","Resturlaub vom Vorjahr","Urlaubsanspruch in Tagen","Zeilen Nr.","uktueller Resturlaub","Name, Vorname","Stamm-Nr.","Bemerkung","Abteilung","Geburtstag","PLZ","Wohnort","Straße","Telefon","Funk / E-Mail","Jahresurlaub in Tagen","Resturlaub vom Vorjahr","Urlaubsanspruch in Tagen","Zeilen Nr.","uktueller Resturlaub"]
[null,null,null,null,null,null,null,null,null,null,null,null,{"$f":"K7+L7","v":0},1,{"$f":"Schichtplan!NN5","v":0}]
[null,null,null,null,null,null,null,null,null,null,null,null,{"$f":"K8+L8","v":0},2,{"$f":"Schichtplan!NN6","v":0}]
[null,null,null,null,null,null,null,null,null,null,null,null,0,3,{"$f":"Schichtplan!NN7","v":0}]
[null,null,null,null,null,null,null,null,null,null,null,null,0,4,{"$f":"Schichtplan!NN8","v":0}]
[null,null,null,null,null,null,null,null,null,null,null,null,0,5,{"$f":"Schichtplan!NN9","v":0}]
[null,null,null,null,null,null,null,null,null,null,null,null,0,6,{"$f":"Schichtplan!NN10","v":0}]
[null,null,null,null,null,null,null,null,null,null,null,null,0,7,{"$f":"Schichtplan!NN11","v":0}]
[null,null,null,null,null,null,null,null,null,null,null,null,0,8,{"$f":"Schichtplan!NN12","v":0}]
[null,null,null,null,null,null,null,null,null,null,null,null,0,9,{"$f":"Schichtplan!NN13","v":0}]
[null,null,null,null,null,null,null,null,null,null,null,null,0,10,{"$f":"Schichtplan!NN14","v":0}]
[null,null,null,null,null,null,null,null,null,null,null,null,0,11,{"$f":"Schichtplan!NN15","v":0}]
[null,null,null,null,null,null,null,null,null,null,null,null,0,12,{"$f":"Schichtplan!NN16","v":0}]
[null,null,null,null,null,null,null,null,null,null,null,null,0,13,{"$f":"Schichtplan!NN17","v":0}]
[null,null,null,null,null,null,null,null,null,null,null,null,0,14,{"$f":"Schichtplan!NN18","v":0}]
[null,null,null,null,null,null,null,null,null,null,null,null,0,15,{"$f":"Schichtplan!NN19","v":0}]
[null,null,null,null,null,null,null,null,null,null,null,null,0,16,{"$f":"Schichtplan!NN20","v":0}]
[null,null,null,null,null,null,null,null,null,null,null,null,0,17,{"$f":"Schichtplan!NN21","v":0}]
[null,null,null,null,null,null,null,null,null,null,null,null,0,18,{"$f":"Schichtplan!NN22","v":0}]
[null,null,null,null,null,null,null,null,null,null,null,null,0,19,{"$f":"Schichtplan!NN23","v":0}]
[null,null,null,null,null,null,null,null,null,null,null,null,0,20,{"$f":"Schichtplan!NN24","v":0}]
[null,null,null,null,null,null,null,null,null,null,null,null,0,21,{"$f":"Schichtplan!NN25","v":0}]
[null,null,null,null,null,null,null,null,null,null,null,null,0,22,{"$f":"Schichtplan!NN26","v":0}]
[null,null,null,null,null,null,null,null,null,null,null,null,0,23,{"$f":"Schichtplan!NN27","v":0}]
[null,null,null,null,null,null,null,null,null,null,null,null,0,24,{"$f":"Schichtplan!NN28","v":0}]
[null,null,null,null,null,null,null,null,null,null,null,null,0,25,{"$f":"Schichtplan!NN29","v":0}]
[null,null,null,null,null,null,null,null,null,null,null,null,0,26,{"$f":"Schichtplan!NN30","v":0}]
[null,null,null,null,null,null,null,null,null,null,null,null,0,27,{"$f":"Schichtplan!NN31","v":0}]
[null,null,null,null,null,null,null,null,null,null,null,null,0,28,{"$f":"Schichtplan!NN32","v":0}]
[null,null,null,null,null,null,null,null,null,null,null,null,0,29,{"$f":"Schichtplan!NN33","v":0}]
[null,null,null,null,null,null,null,null,null,null,null,null,0,30,{"$f":"Schichtplan!NN34","v":0}]
[null,null,null,null,null,null,null,null,null,null,null,null,0,31,{"$f":"Schichtplan!NN35","v":0}]
[null,null,null,null,null,null,null,null,null,null,null,null,0,32,{"$f":"Schichtplan!NN36","v":0}]
[null,null,null,null,null,null,null,null,null,null,null,null,0,33,{"$f":"Schichtplan!NN37","v":0}]
[null,null,null,null,null,null,null,null,null,null,null,null,0,34,{"$f":"Schichtplan!NN38","v":0}]
[null,null,null,null,null,null,null,null,null,null,null,null,0,35,{"$f":"Schichtplan!NN39","v":0}]
[null,null,null,null,null,null,null,null,null,null,null,null,0,36,{"$f":"Schichtplan!NN40","v":0}]
[null,null,null,null,null,null,null,null,null,null,null,null,0,37,{"$f":"Schichtplan!NN41","v":0}]
[null,null,null,null,null,null,null,null,null,null,null,null,0,38,{"$f":"Schichtplan!NN42","v":0}]
[null,null,null,null,null,null,null,null,null,null,null,null,0,39,{"$f":"Schichtplan!NN43","v":0}]
[null,null,null,null,null,null,null,null,null,null,null,null,0,40,{"$f":"Schichtplan!NN44","v":0}]
[null,null,null,null,null,null,null,null,null,null,null,null,0,41,{"$f":"Schichtplan!NN45","v":0}]
[null,null,null,null,null,null,null,null,null,null,null,null,0,42,{"$f":"Schichtplan!NN46","v":0}]
[null,null,null,null,null,null,null,null,null,null,null,null,0,43,{"$f":"Schichtplan!NN47","v":0}]
[null,null,null,null,null,null,null,null,null,null,null,null,0,44,{"$f":"Schichtplan!NN48","v":0}]
[null,null,null,null,null,null,null,null,null,null,null,null,0,45,{"$f":"Schichtplan!NN49","v":0}]
[null,null,null,null,null,null,null,null,null,null,null,null,0,46,{"$f":"Schichtplan!NN50","v":0}]
[null,null,null,null,null,null,null,null,null,null,null,null,0,47,{"$f":"Schichtplan!NN51","v":0}]
[null,null,null,null,null,null,null,null,null,null,null,null,0,48,{"$f":"Schichtplan!NN52","v":0}]
[null,null,null,null,null,null,null,null,null,null,null,null,0,49,{"$f":"Schichtplan!NN53","v":0}]
[null,null,null,null,null,null,null,null,null,null,null,null,0,50,{"$f":"Schichtplan!NN54","v":0}]
[null,null,null,null,null,null,null,null,null,null,null,null,0,51,{"$f":"Schichtplan!NN55","v":0}]
[null,null,null,null,null,null,null,null,null,null,null,null,0,52,{"$f":"Schichtplan!NN56","v":0}]
[null,null,null,null,null,null,null,null,null,null,null,null,0,53,{"$f":"Schichtplan!NN57","v":0}]
[null,null,null,null,null,null,null,null,null,null,null,null,0,54,{"$f":"Schichtplan!NN58","v":0}]
[null,null,null,null,null,null,null,null,null,null,null,null,0,55,{"$f":"Schichtplan!NN59","v":0}]
[null,null,null,null,null,null,null,null,null,null,null,null,0,56,{"$f":"Schichtplan!NN60","v":0}]
[null,null,null,null,null,null,null,null,null,null,null,null,0,57,{"$f":"Schichtplan!NN61","v":0}]
[null,null,null,null,null,null,null,null,null,null,null,null,0,58,{"$f":"Schichtplan!NN62","v":0}]
[null,null,null,null,null,null,null,null,null,null,null,null,0,59,{"$f":"Schichtplan!NN63","v":0}]
[null,null,null,null,null,null,null,null,null,null,null,null,0,60,{"$f":"Schichtplan!NN64","v":0}]
[null,null,null,null,null,null,null,null,null,null,null,null,0,61,{"$f":"Schichtplan!NN65","v":0}]
[null,null,null,null,null,null,null,null,null,null,null,null,0,62,{"$f":"Schichtplan!NN66","v":0}]
[null,null,null,null,null,null,null,null,null,null,null,null,0,63,{"$f":"Schichtplan!NN67","v":0}]
[null,null,null,null,null,null,null,null,null,null,null,null,0,64,{"$f":"Schichtplan!NN68","v":0}]
[null,null,null,null,null,null,null,null,null,null,null,null,0,65,{"$f":"Schichtplan!NN69","v":0}]
[null,null,null,null,null,null,null,null,null,null,null,null,{"$f":"K72+L72","v":0},66,{"$f":"Schichtplan!NN70","v":0}]
[null,null,null,null,null,null,null,null,null,null,null,null,0,67,{"$f":"Schichtplan!NN71","v":0}]
[null,null,null,null,null,null,null,null,null,null,null,null,0,68,{"$f":"Schichtplan!NN72","v":0}]
[null,null,null,null,null,null,null,null,null,null,null,null,0,69,{"$f":"Schichtplan!NN73","v":0}]
[null,null,null,null,null,null,null,null,null,null,null,null,0,70,{"$f":"Schichtplan!NN74","v":0}]
[null,null,null,null,null,null,null,null,null,null,null,null,0,71,{"$f":"Schichtplan!NN75","v":0}]
[null,null,null,null,null,null,null,null,null,null,null,null,0,72,{"$f":"Schichtplan!NN76","v":0}]
[null,null,null,null,null,null,null,null,null,null,null,null,0,73,{"$f":"Schichtplan!NN77","v":0}]
[null,null,null,null,null,null,null,null,null,null,null,null,0,74,{"$f":"Schichtplan!NN78","v":0}]
[null,null,null,null,null,null,null,null,null,null,null,null,0,75,{"$f":"Schichtplan!NN79","v":0}]
[null,null,null,null,null,null,null,null,null,null,null,null,0,76,{"$f":"Schichtplan!NN80","v":0}]
[null,null,null,null,null,null,null,null,null,null,null,null,0,77,{"$f":"Schichtplan!NN81","v":0}]
[null,null,null,null,null,null,null,null,null,null,null,null,0,78,{"$f":"Schichtplan!NN82","v":0}]
[null,null,null,null,null,null,null,null,null,null,null,null,0,79,{"$f":"Schichtplan!NN83","v":0}]
[null,null,null,null,null,null,null,null,null,null,null,null,0,80,{"$f":"Schichtplan!NN84","v":0}]
[null,null,null,null,null,null,null,null,null,null,null,null,0,81,{"$f":"Schichtplan!NN85","v":0}]
[null,null,null,null,null,null,null,null,null,null,null,null,0,82,{"$f":"Schichtplan!NN86","v":0}]
[null,null,null,null,null,null,null,null,null,null,null,null,0,83,{"$f":"Schichtplan!NN87","v":0}]
[null,null,null,null,null,null,null,null,null,null,null,null,0,84,{"$f":"Schichtplan!NN88","v":0}]
[null,null,null,null,null,null,null,null,null,null,null,null,0,85,{"$f":"Schichtplan!NN89","v":0}]
[null,null,null,null,null,null,null,null,null,null,null,null,0,86,{"$f":"Schichtplan!NN90","v":0}]
[null,null,null,null,null,null,null,null,null,null,null,null,0,87,{"$f":"Schichtplan!NN91","v":0}]
[null,null,null,null,null,null,null,null,null,null,null,null,0,88,{"$f":"Schichtplan!NN92","v":0}]
[null,null,null,null,null,null,null,null,null,null,null,null,0,89,{"$f":"Schichtplan!NN93","v":0}]
[null,null,null,null,null,null,null,null,null,null,null,null,0,90,{"$f":"Schichtplan!NN94","v":0}]
[null,null,null,null,null,null,null,null,null,null,null,null,0,91,{"$f":"Schichtplan!NN95","v":0}]
[null,null,null,null,null,null,null,null,null,null,null,null,0,92,{"$f":"Schichtplan!NN96","v":0}]
[null,null,null,null,null,null,null,null,null,null,null,null,0,93,{"$f":"Schichtplan!NN97","v":0}]
[null,null,null,null,null,null,null,null,null,null,null,null,0,94,{"$f":"Schichtplan!NN98","v":0}]
[null,null,null,null,null,null,null,null,null,null,null,null,0,95,{"$f":"Schichtplan!NN99","v":0}]
[null,null,null,null,null,null,null,null,null,null,null,null,0,96,{"$f":"Schichtplan!NN100","v":0}]
[null,null,null,null,null,null,null,null,null,null,null,null,0,97,{"$f":"Schichtplan!NN101","v":0}]
[null,null,null,null,null,null,null,null,null,null,null,null,0,98,{"$f":"Schichtplan!NN102","v":0}]
[null,null,null,null,null,null,null,null,null,null,null,null,0,99,{"$f":"Schichtplan!NN103","v":0}]
[null,null,null,null,null,null,null,null,null,null,null,null,0,100,{"$f":"Schichtplan!NN104","v":0}]
[null,null,null,null,null,null,null,null,null,null,null,null,0,101,{"$f":"Schichtplan!NN105","v":0}]
[null,null,null,null,null,null,null,null,null,null,null,null,0,102,{"$f":"Schichtplan!NN106","v":0}]
[null,null,null,null,null,null,null,null,null,null,null,null,0,103,{"$f":"Schichtplan!NN107","v":0}]
[null,null,null,null,null,null,null,null,null,null,null,null,0,104,{"$f":"Schichtplan!NN108","v":0}]
[null,null,null,null,null,null,null,null,null,null,null,null,0,105,{"$f":"Schichtplan!NN109","v":0}]
[null,null,null,null,null,null,null,null,null,null,null,null,0,106,{"$f":"Schichtplan!NN110","v":0}]
[null,null,null,null,null,null,null,null,null,null,null,null,0,107,{"$f":"Schichtplan!NN111","v":0}]
[null,null,null,null,null,null,null,null,null,null,null,null,0,108,{"$f":"Schichtplan!NN112","v":0}]
[null,null,null,null,null,null,null,null,null,null,null,null,0,109,{"$f":"Schichtplan!NN113","v":0}]
[null,null,null,null,null,null,null,null,null,null,null,null,0,110,{"$f":"Schichtplan!NN114","v":0}]
[null,null,null,null,null,null,null,null,null,null,null,null,0,111,{"$f":"Schichtplan!NN115","v":0}]
[null,null,null,null,null,null,null,null,null,null,null,null,0,112,{"$f":"Schichtplan!NN116","v":0}]
[null,null,null,null,null,null,null,null,null,null,null,null,0,113,{"$f":"Schichtplan!NN117","v":0}]
[null,null,null,null,null,null,null,null,null,null,null,null,0,114,{"$f":"Schichtplan!NN118","v":0}]
[null,null,null,null,null,null,null,null,null,null,null,null,0,115,{"$f":"Schichtplan!NN119","v":0}]
[null,null,null,null,null,null,null,null,null,null,null,null,0,116,{"$f":"Schichtplan!NN120","v":0}]
[null,null,null,null,null,null,null,null,null,null,null,null,0,117,{"$f":"Schichtplan!NN121","v":0}]
[null,null,null,null,null,null,null,null,null,null,null,null,0,118,{"$f":"Schichtplan!NN122","v":0}]
[null,null,null,null,null,null,null,null,null,null,null,null,0,119,{"$f":"Schichtplan!NN123","v":0}]
[null,null,null,null,null,null,null,null,null,null,null,null,0,120,{"$f":"Schichtplan!NN124","v":0}]
[null,null,null,null,null,null,null,null,null,null,null,null,0,121,{"$f":"Schichtplan!NN125","v":0}]
[null,null,null,null,null,null,null,null,null,null,null,null,0,122,{"$f":"Schichtplan!NN126","v":0}]
[null,null,null,null,null,null,null,null,null,null,null,null,0,123,{"$f":"Schichtplan!NN127","v":0}]
[null,null,null,null,null,null,null,null,null,null,null,null,0,124,{"$f":"Schichtplan!NN128","v":0}]
[null,null,null,null,null,null,null,null,null,null,null,null,0,125,{"$f":"Schichtplan!NN129","v":0}]
[null,null,null,null,null,null,null,null,null,null,null,null,0,126,{"$f":"Schichtplan!NN130","v":0}]
[null,null,null,null,null,null,null,null,null,null,null,null,0,127,{"$f":"Schichtplan!NN131","v":0}]
[null,null,null,null,null,null,null,null,null,null,null,null,0,128,{"$f":"Schichtplan!NN132","v":0}]
[null,null,null,null,null,null,null,null,null,null,null,null,0,129,{"$f":"Schichtplan!NN133","v":0}]
[null,null,null,null,null,null,null,null,null,null,null,null,{"$f":"K136+L136","v":0},130,{"$f":"Schichtplan!NN134","v":0}]
[null,null,null,null,null,null,null,null,null,null,null,null,0,131,{"$f":"Schichtplan!NN135","v":0}]
[null,null,null,null,null,null,null,null,null,null,null,null,0,132,{"$f":"Schichtplan!NN136","v":0}]
[null,null,null,null,null,null,null,null,null,null,null,null,0,133,{"$f":"Schichtplan!NN137","v":0}]
[null,null,null,null,null,null,null,null,null,null,null,null,0,134,{"$f":"Schichtplan!NN138","v":0}]
[null,null,null,null,null,null,null,null,null,null,null,null,0,135,{"$f":"Schichtplan!NN139","v":0}]
[null,null,null,null,null,null,null,null,null,null,null,null,0,136,{"$f":"Schichtplan!NN140","v":0}]
[null,null,null,null,null,null,null,null,null,null,null,null,0,137,{"$f":"Schichtplan!NN141","v":0}]
[null,null,null,null,null,null,null,null,null,null,null,null,0,138,{"$f":"Schichtplan!NN142","v":0}]
[null,null,null,null,null,null,null,null,null,null,null,null,0,139,{"$f":"Schichtplan!NN143","v":0}]
[null,null,null,null,null,null,null,null,null,null,null,null,0,140,{"$f":"Schichtplan!NN144","v":0}]
[null,null,null,null,null,null,null,null,null,null,null,null,0,141,{"$f":"Schichtplan!NN145","v":0}]
[null,null,null,null,null,null,null,null,null,null,null,null,0,142,{"$f":"Schichtplan!NN146","v":0}]
[null,null,null,null,null,null,null,null,null,null,null,null,0,143,{"$f":"Schichtplan!NN147","v":0}]
[null,null,null,null,null,null,null,null,null,null,null,null,0,144,{"$f":"Schichtplan!NN148","v":0}]
[null,null,null,null,null,null,null,null,null,null,null,null,0,145,{"$f":"Schichtplan!NN149","v":0}]
[null,null,null,null,null,null,null,null,null,null,null,null,0,146,{"$f":"Schichtplan!NN150","v":0}]
[null,null,null,null,null,null,null,null,null,null,null,null,0,147,{"$f":"Schichtplan!NN151","v":0}]
[null,null,null,null,null,null,null,null,null,null,null,null,0,148,{"$f":"Schichtplan!NN152","v":0}]
[null,null,null,null,null,null,null,null,null,null,null,null,0,149,{"$f":"Schichtplan!NN153","v":0}]
[null,null,null,null,null,null,null,null,null,null,null,null,0,150,{"$f":"Schichtplan!NN154","v":0}]

{"sheet":"Dateneingabe-Sortiert","index":1,"n_rows":155,"n_cols":15,"rows_kept":155,"cut":false,"hidden":false,"merged":[]}
[null,"zzz",null,null,null,null,null,{"$f":"NOW()","v":"2014-07-29T22:13:03.090"}]
[null,"                                                                   Mitarbeiter"]
["NR.","Abteilung","Bemerkung","Name, Vorname","Geburtstag","PLZ","Wohnort","Straße","Pers.-Nr.","Tel.Nr: ","Funk / E-Mail","Alter",null,null,"AP"]
[1,{"$f":"IF(Dateneingabe!D7=0,$B$1,Dateneingabe!D7)","v":"zzz"},{"$f":"IF(Dateneingabe!C7=0,$B$1,Dateneingabe!C7)","v":"zzz"},{"$f":"IF(Dateneingabe!A7=0,$B$1,Dateneingabe!A7)","v":"zzz"},{"$f":"IF(Dateneingabe!E7=0,$B$1,Dateneingabe!E7)","v":"zzz"},{"$f":"IF(Dateneingabe!F7=0,$B$1,Dateneingabe!F7)","v":"zzz"},{"$f":"IF(Dateneingabe!G7=0,$B$1,Dateneingabe!G7)","v":"zzz"},{"$f":"IF(Dateneingabe!H7=0,$B$1,Dateneingabe!H7)","v":"zzz"},{"$f":"IF(Dateneingabe!B7=0,$B$1,Dateneingabe!B7)","v":"zzz"},{"$f":"IF(Dateneingabe!I7=0,$B$1,Dateneingabe!I7)","v":"zzz"},{"$f":"IF(Dateneingabe!J7=0,$B$1,Dateneingabe!J7)","v":"zzz"},{"$f":"IF(D4=\"zzz\",0,IF(E4=\"zzz\",0,($H$1-E4)/365.25))","v":0},{"$f":"IF(D4=\"zzz\",0,1)","v":0},{"$f":"IF(E4=\"zzz\",0,1)","v":0},1]
[2,{"$f":"IF(Dateneingabe!D8=0,$B$1,Dateneingabe!D8)","v":"zzz"},{"$f":"IF(Dateneingabe!C8=0,$B$1,Dateneingabe!C8)","v":"zzz"},{"$f":"IF(Dateneingabe!A8=0,$B$1,Dateneingabe!A8)","v":"zzz"},{"$f":"IF(Dateneingabe!E8=0,$B$1,Dateneingabe!E8)","v":"zzz"},{"$f":"IF(Dateneingabe!F8=0,$B$1,Dateneingabe!F8)","v":"zzz"},{"$f":"IF(Dateneingabe!G8=0,$B$1,Dateneingabe!G8)","v":"zzz"},{"$f":"IF(Dateneingabe!H8=0,$B$1,Dateneingabe!H8)","v":"zzz"},{"$f":"IF(Dateneingabe!B8=0,$B$1,Dateneingabe!B8)","v":"zzz"},{"$f":"IF(Dateneingabe!I8=0,$B$1,Dateneingabe!I8)","v":"zzz"},{"$f":"IF(Dateneingabe!J8=0,$B$1,Dateneingabe!J8)","v":"zzz"},{"$f":"IF(D5=\"zzz\",0,IF(E5=\"zzz\",0,($H$1-E5)/365.25))","v":0},{"$f":"IF(D5=\"zzz\",0,1)","v":0},0,2]
[3,{"$f":"IF(Dateneingabe!D9=0,$B$1,Dateneingabe!D9)","v":"zzz"},{"$f":"IF(Dateneingabe!C9=0,$B$1,Dateneingabe!C9)","v":"zzz"},{"$f":"IF(Dateneingabe!A9=0,$B$1,Dateneingabe!A9)","v":"zzz"},{"$f":"IF(Dateneingabe!E9=0,$B$1,Dateneingabe!E9)","v":"zzz"},{"$f":"IF(Dateneingabe!F9=0,$B$1,Dateneingabe!F9)","v":"zzz"},{"$f":"IF(Dateneingabe!G9=0,$B$1,Dateneingabe!G9)","v":"zzz"},{"$f":"IF(Dateneingabe!H9=0,$B$1,Dateneingabe!H9)","v":"zzz"},{"$f":"IF(Dateneingabe!B9=0,$B$1,Dateneingabe!B9)","v":"zzz"},{"$f":"IF(Dateneingabe!I9=0,$B$1,Dateneingabe!I9)","v":"zzz"},{"$f":"IF(Dateneingabe!J9=0,$B$1,Dateneingabe!J9)","v":"zzz"},0,0,0,3]
[4,{"$f":"IF(Dateneingabe!D10=0,$B$1,Dateneingabe!D10)","v":"zzz"},{"$f":"IF(Dateneingabe!C10=0,$B$1,Dateneingabe!C10)","v":"zzz"},{"$f":"IF(Dateneingabe!A10=0,$B$1,Dateneingabe!A10)","v":"zzz"},{"$f":"IF(Dateneingabe!E10=0,$B$1,Dateneingabe!E10)","v":"zzz"},{"$f":"IF(Dateneingabe!F10=0,$B$1,Dateneingabe!F10)","v":"zzz"},{"$f":"IF(Dateneingabe!G10=0,$B$1,Dateneingabe!G10)","v":"zzz"},{"$f":"IF(Dateneingabe!H10=0,$B$1,Dateneingabe!H10)","v":"zzz"},{"$f":"IF(Dateneingabe!B10=0,$B$1,Dateneingabe!B10)","v":"zzz"},{"$f":"IF(Dateneingabe!I10=0,$B$1,Dateneingabe!I10)","v":"zzz"},{"$f":"IF(Dateneingabe!J10=0,$B$1,Dateneingabe!J10)","v":"zzz"},0,0,0,4]
[5,{"$f":"IF(Dateneingabe!D11=0,$B$1,Dateneingabe!D11)","v":"zzz"},{"$f":"IF(Dateneingabe!C11=0,$B$1,Dateneingabe!C11)","v":"zzz"},{"$f":"IF(Dateneingabe!A11=0,$B$1,Dateneingabe!A11)","v":"zzz"},{"$f":"IF(Dateneingabe!E11=0,$B$1,Dateneingabe!E11)","v":"zzz"},{"$f":"IF(Dateneingabe!F11=0,$B$1,Dateneingabe!F11)","v":"zzz"},{"$f":"IF(Dateneingabe!G11=0,$B$1,Dateneingabe!G11)","v":"zzz"},{"$f":"IF(Dateneingabe!H11=0,$B$1,Dateneingabe!H11)","v":"zzz"},{"$f":"IF(Dateneingabe!B11=0,$B$1,Dateneingabe!B11)","v":"zzz"},{"$f":"IF(Dateneingabe!I11=0,$B$1,Dateneingabe!I11)","v":"zzz"},{"$f":"IF(Dateneingabe!J11=0,$B$1,Dateneingabe!J11)","v":"zzz"},0,0,0,5]
[6,{"$f":"IF(Dateneingabe!D12=0,$B$1,Dateneingabe!D12)","v":"zzz"},{"$f":"IF(Dateneingabe!C12=0,$B$1,Dateneingabe!C12)","v":"zzz"},{"$f":"IF(Dateneingabe!A12=0,$B$1,Dateneingabe!A12)","v":"zzz"},{"$f":"IF(Dateneingabe!E12=0,$B$1,Dateneingabe!E12)","v":"zzz"},{"$f":"IF(Dateneingabe!F12=0,$B$1,Dateneingabe!F12)","v":"zzz"},{"$f":"IF(Dateneingabe!G12=0,$B$1,Dateneingabe!G12)","v":"zzz"},{"$f":"IF(Dateneingabe!H12=0,$B$1,Dateneingabe!H12)","v":"zzz"},{"$f":"IF(Dateneingabe!B12=0,$B$1,Dateneingabe!B12)","v":"zzz"},{"$f":"IF(Dateneingabe!I12=0,$B$1,Dateneingabe!I12)","v":"zzz"},{"$f":"IF(Dateneingabe!J12=0,$B$1,Dateneingabe!J12)","v":"zzz"},0,0,0,6]
[7,{"$f":"IF(Dateneingabe!D13=0,$B$1,Dateneingabe!D13)","v":"zzz"},{"$f":"IF(Dateneingabe!C13=0,$B$1,Dateneingabe!C13)","v":"zzz"},{"$f":"IF(Dateneingabe!A13=0,$B$1,Dateneingabe!A13)","v":"zzz"},{"$f":"IF(Dateneingabe!E13=0,$B$1,Dateneingabe!E13)","v":"zzz"},{"$f":"IF(Dateneingabe!F13=0,$B$1,Dateneingabe!F13)","v":"zzz"},{"$f":"IF(Dateneingabe!G13=0,$B$1,Dateneingabe!G13)","v":"zzz"},{"$f":"IF(Dateneingabe!H13=0,$B$1,Dateneingabe!H13)","v":"zzz"},{"$f":"IF(Dateneingabe!B13=0,$B$1,Dateneingabe!B13)","v":"zzz"},{"$f":"IF(Dateneingabe!I13=0,$B$1,Dateneingabe!I13)","v":"zzz"},{"$f":"IF(Dateneingabe!J13=0,$B$1,Dateneingabe!J13)","v":"zzz"},0,0,0,7]
[8,{"$f":"IF(Dateneingabe!D14=0,$B$1,Dateneingabe!D14)","v":"zzz"},{"$f":"IF(Dateneingabe!C14=0,$B$1,Dateneingabe!C14)","v":"zzz"},{"$f":"IF(Dateneingabe!A14=0,$B$1,Dateneingabe!A14)","v":"zzz"},{"$f":"IF(Dateneingabe!E14=0,$B$1,Dateneingabe!E14)","v":"zzz"},{"$f":"IF(Dateneingabe!F14=0,$B$1,Dateneingabe!F14)","v":"zzz"},{"$f":"IF(Dateneingabe!G14=0,$B$1,Dateneingabe!G14)","v":"zzz"},{"$f":"IF(Dateneingabe!H14=0,$B$1,Dateneingabe!H14)","v":"zzz"},{"$f":"IF(Dateneingabe!B14=0,$B$1,Dateneingabe!B14)","v":"zzz"},{"$f":"IF(Dateneingabe!I14=0,$B$1,Dateneingabe!I14)","v":"zzz"},{"$f":"IF(Dateneingabe!J14=0,$B$1,Dateneingabe!J14)","v":"zzz"},0,0,0,8]
[9,{"$f":"IF(Dateneingabe!D15=0,$B$1,Dateneingabe!D15)","v":"zzz"},{"$f":"IF(Dateneingabe!C15=0,$B$1,Dateneingabe!C15)","v":"zzz"},{"$f":"IF(Dateneingabe!A15=0,$B$1,Dateneingabe!A15)","v":"zzz"},{"$f":"IF(Dateneingabe!E15=0,$B$1,Dateneingabe!E15)","v":"zzz"},{"$f":"IF(Dateneingabe!F15=0,$B$1,Dateneingabe!F15)","v":"zzz"},{"$f":"IF(Dateneingabe!G15=0,$B$1,Dateneingabe!G15)","v":"zzz"},{"$f":"IF(Dateneingabe!H15=0,$B$1,Dateneingabe!H15)","v":"zzz"},{"$f":"IF(Dateneingabe!B15=0,$B$1,Dateneingabe!B15)","v":"zzz"},{"$f":"IF(Dateneingabe!I15=0,$B$1,Dateneingabe!I15)","v":"zzz"},{"$f":"IF(Dateneingabe!J15=0,$B$1,Dateneingabe!J15)","v":"zzz"},0,0,0,9]
[10,{"$f":"IF(Dateneingabe!D16=0,$B$1,Dateneingabe!D16)","v":"zzz"},{"$f":"IF(Dateneingabe!C16=0,$B$1,Dateneingabe!C16)","v":"zzz"},{"$f":"IF(Dateneingabe!A16=0,$B$1,Dateneingabe!A16)","v":"zzz"},{"$f":"IF(Dateneingabe!E16=0,$B$1,Dateneingabe!E16)","v":"zzz"},{"$f":"IF(Dateneingabe!F16=0,$B$1,Dateneingabe!F16)","v":"zzz"},{"$f":"IF(Dateneingabe!G16=0,$B$1,Dateneingabe!G16)","v":"zzz"},{"$f":"IF(Dateneingabe!H16=0,$B$1,Dateneingabe!H16)","v":"zzz"},{"$f":"IF(Dateneingabe!B16=0,$B$1,Dateneingabe!B16)","v":"zzz"},{"$f":"IF(Dateneingabe!I16=0,$B$1,Dateneingabe!I16)","v":"zzz"},{"$f":"IF(Dateneingabe!J16=0,$B$1,Dateneingabe!J16)","v":"zzz"},0,0,0,10]
[11,{"$f":"IF(Dateneingabe!D17=0,$B$1,Dateneingabe!D17)","v":"zzz"},{"$f":"IF(Dateneingabe!C17=0,$B$1,Dateneingabe!C17)","v":"zzz"},{"$f":"IF(Dateneingabe!A17=0,$B$1,Dateneingabe!A17)","v":"zzz"},{"$f":"IF(Dateneingabe!E17=0,$B$1,Dateneingabe!E17)","v":"zzz"},{"$f":"IF(Dateneingabe!F17=0,$B$1,Dateneingabe!F17)","v":"zzz"},{"$f":"IF(Dateneingabe!G17=0,$B$1,Dateneingabe!G17)","v":"zzz"},{"$f":"IF(Dateneingabe!H17=0,$B$1,Dateneingabe!H17)","v":"zzz"},{"$f":"IF(Dateneingabe!B17=0,$B$1,Dateneingabe!B17)","v":"zzz"},{"$f":"IF(Dateneingabe!I17=0,$B$1,Dateneingabe!I17)","v":"zzz"},{"$f":"IF(Dateneingabe!J17=0,$B$1,Dateneingabe!J17)","v":"zzz"},0,0,0,11]
[12,{"$f":"IF(Dateneingabe!D18=0,$B$1,Dateneingabe!D18)","v":"zzz"},{"$f":"IF(Dateneingabe!C18=0,$B$1,Dateneingabe!C18)","v":"zzz"},{"$f":"IF(Dateneingabe!A18=0,$B$1,Dateneingabe!A18)","v":"zzz"},{"$f":"IF(Dateneingabe!E18=0,$B$1,Dateneingabe!E18)","v":"zzz"},{"$f":"IF(Dateneingabe!F18=0,$B$1,Dateneingabe!F18)","v":"zzz"},{"$f":"IF(Dateneingabe!G18=0,$B$1,Dateneingabe!G18)","v":"zzz"},{"$f":"IF(Dateneingabe!H18=0,$B$1,Dateneingabe!H18)","v":"zzz"},{"$f":"IF(Dateneingabe!B18=0,$B$1,Dateneingabe!B18)","v":"zzz"},{"$f":"IF(Dateneingabe!I18=0,$B$1,Dateneingabe!I18)","v":"zzz"},{"$f":"IF(Dateneingabe!J18=0,$B$1,Dateneingabe!J18)","v":"zzz"},0,0,0,12]
[13,{"$f":"IF(Dateneingabe!D19=0,$B$1,Dateneingabe!D19)","v":"zzz"},{"$f":"IF(Dateneingabe!C19=0,$B$1,Dateneingabe!C19)","v":"zzz"},{"$f":"IF(Dateneingabe!A19=0,$B$1,Dateneingabe!A19)","v":"zzz"},{"$f":"IF(Dateneingabe!E19=0,$B$1,Dateneingabe!E19)","v":"zzz"},{"$f":"IF(Dateneingabe!F19=0,$B$1,Dateneingabe!F19)","v":"zzz"},{"$f":"IF(Dateneingabe!G19=0,$B$1,Dateneingabe!G19)","v":"zzz"},{"$f":"IF(Dateneingabe!H19=0,$B$1,Dateneingabe!H19)","v":"zzz"},{"$f":"IF(Dateneingabe!B19=0,$B$1,Dateneingabe!B19)","v":"zzz"},{"$f":"IF(Dateneingabe!I19=0,$B$1,Dateneingabe!I19)","v":"zzz"},{"$f":"IF(Dateneingabe!J19=0,$B$1,Dateneingabe!J19)","v":"zzz"},0,0,0,13]
[14,{"$f":"IF(Dateneingabe!D20=0,$B$1,Dateneingabe!D20)","v":"zzz"},{"$f":"IF(Dateneingabe!C20=0,$B$1,Dateneingabe!C20)","v":"zzz"},{"$f":"IF(Dateneingabe!A20=0,$B$1,Dateneingabe!A20)","v":"zzz"},{"$f":"IF(Dateneingabe!E20=0,$B$1,Dateneingabe!E20)","v":"zzz"},{"$f":"IF(Dateneingabe!F20=0,$B$1,Dateneingabe!F20)","v":"zzz"},{"$f":"IF(Dateneingabe!G20=0,$B$1,Dateneingabe!G20)","v":"zzz"},{"$f":"IF(Dateneingabe!H20=0,$B$1,Dateneingabe!H20)","v":"zzz"},{"$f":"IF(Dateneingabe!B20=0,$B$1,Dateneingabe!B20)","v":"zzz"},{"$f":"IF(Dateneingabe!I20=0,$B$1,Dateneingabe!I20)","v":"zzz"},{"$f":"IF(Dateneingabe!J20=0,$B$1,Dateneingabe!J20)","v":"zzz"},0,0,0,14]
[15,{"$f":"IF(Dateneingabe!D21=0,$B$1,Dateneingabe!D21)","v":"zzz"},{"$f":"IF(Dateneingabe!C21=0,$B$1,Dateneingabe!C21)","v":"zzz"},{"$f":"IF(Dateneingabe!A21=0,$B$1,Dateneingabe!A21)","v":"zzz"},{"$f":"IF(Dateneingabe!E21=0,$B$1,Dateneingabe!E21)","v":"zzz"},{"$f":"IF(Dateneingabe!F21=0,$B$1,Dateneingabe!F21)","v":"zzz"},{"$f":"IF(Dateneingabe!G21=0,$B$1,Dateneingabe!G21)","v":"zzz"},{"$f":"IF(Dateneingabe!H21=0,$B$1,Dateneingabe!H21)","v":"zzz"},{"$f":"IF(Dateneingabe!B21=0,$B$1,Dateneingabe!B21)","v":"zzz"},{"$f":"IF(Dateneingabe!I21=0,$B$1,Dateneingabe!I21)","v":"zzz"},{"$f":"IF(Dateneingabe!J21=0,$B$1,Dateneingabe!J21)","v":"zzz"},0,0,0,15]
[16,{"$f":"IF(Dateneingabe!D22=0,$B$1,Dateneingabe!D22)","v":"zzz"},{"$f":"IF(Dateneingabe!C22=0,$B$1,Dateneingabe!C22)","v":"zzz"},{"$f":"IF(Dateneingabe!A22=0,$B$1,Dateneingabe!A22)","v":"zzz"},{"$f":"IF(Dateneingabe!E22=0,$B$1,Dateneingabe!E22)","v":"zzz"},{"$f":"IF(Dateneingabe!F22=0,$B$1,Dateneingabe!F22)","v":"zzz"},{"$f":"IF(Dateneingabe!G22=0,$B$1,Dateneingabe!G22)","v":"zzz"},{"$f":"IF(Dateneingabe!H22=0,$B$1,Dateneingabe!H22)","v":"zzz"},{"$f":"IF(Dateneingabe!B22=0,$B$1,Dateneingabe!B22)","v":"zzz"},{"$f":"IF(Dateneingabe!I22=0,$B$1,Dateneingabe!I22)","v":"zzz"},{"$f":"IF(Dateneingabe!J22=0,$B$1,Dateneingabe!J22)","v":"zzz"},0,0,0,16]
[17,{"$f":"IF(Dateneingabe!D23=0,$B$1,Dateneingabe!D23)","v":"zzz"},{"$f":"IF(Dateneingabe!C23=0,$B$1,Dateneingabe!C23)","v":"zzz"},{"$f":"IF(Dateneingabe!A23=0,$B$1,Dateneingabe!A23)","v":"zzz"},{"$f":"IF(Dateneingabe!E23=0,$B$1,Dateneingabe!E23)","v":"zzz"},{"$f":"IF(Dateneingabe!F23=0,$B$1,Dateneingabe!F23)","v":"zzz"},{"$f":"IF(Dateneingabe!G23=0,$B$1,Dateneingabe!G23)","v":"zzz"},{"$f":"IF(Dateneingabe!H23=0,$B$1,Dateneingabe!H23)","v":"zzz"},{"$f":"IF(Dateneingabe!B23=0,$B$1,Dateneingabe!B23)","v":"zzz"},{"$f":"IF(Dateneingabe!I23=0,$B$1,Dateneingabe!I23)","v":"zzz"},{"$f":"IF(Dateneingabe!J23=0,$B$1,Dateneingabe!J23)","v":"zzz"},0,0,0,17]
[18,{"$f":"IF(Dateneingabe!D24=0,$B$1,Dateneingabe!D24)","v":"zzz"},{"$f":"IF(Dateneingabe!C24=0,$B$1,Dateneingabe!C24)","v":"zzz"},{"$f":"IF(Dateneingabe!A24=0,$B$1,Dateneingabe!A24)","v":"zzz"},{"$f":"IF(Dateneingabe!E24=0,$B$1,Dateneingabe!E24)","v":"zzz"},{"$f":"IF(Dateneingabe!F24=0,$B$1,Dateneingabe!F24)","v":"zzz"},{"$f":"IF(Dateneingabe!G24=0,$B$1,Dateneingabe!G24)","v":"zzz"},{"$f":"IF(Dateneingabe!H24=0,$B$1,Dateneingabe!H24)","v":"zzz"},{"$f":"IF(Dateneingabe!B24=0,$B$1,Dateneingabe!B24)","v":"zzz"},{"$f":"IF(Dateneingabe!I24=0,$B$1,Dateneingabe!I24)","v":"zzz"},{"$f":"IF(Dateneingabe!J24=0,$B$1,Dateneingabe!J24)","v":"zzz"},0,0,0,18]
[19,{"$f":"IF(Dateneingabe!D25=0,$B$1,Dateneingabe!D25)","v":"zzz"},{"$f":"IF(Dateneingabe!C25=0,$B$1,Dateneingabe!C25)","v":"zzz"},{"$f":"IF(Dateneingabe!A25=0,$B$1,Dateneingabe!A25)","v":"zzz"},{"$f":"IF(Dateneingabe!E25=0,$B$1,Dateneingabe!E25)","v":"zzz"},{"$f":"IF(Dateneingabe!F25=0,$B$1,Dateneingabe!F25)","v":"zzz"},{"$f":"IF(Dateneingabe!G25=0,$B$1,Dateneingabe!G25)","v":"zzz"},{"$f":"IF(Dateneingabe!H25=0,$B$1,Dateneingabe!H25)","v":"zzz"},{"$f":"IF(Dateneingabe!B25=0,$B$1,Dateneingabe!B25)","v":"zzz"},{"$f":"IF(Dateneingabe!I25=0,$B$1,Dateneingabe!I25)","v":"zzz"},{"$f":"IF(Dateneingabe!J25=0,$B$1,Dateneingabe!J25)","v":"zzz"},0,0,0,19]
[20,{"$f":"IF(Dateneingabe!D26=0,$B$1,Dateneingabe!D26)","v":"zzz"},{"$f":"IF(Dateneingabe!C26=0,$B$1,Dateneingabe!C26)","v":"zzz"},{"$f":"IF(Dateneingabe!A26=0,$B$1,Dateneingabe!A26)","v":"zzz"},{"$f":"IF(Dateneingabe!E26=0,$B$1,Dateneingabe!E26)","v":"zzz"},{"$f":"IF(Dateneingabe!F26=0,$B$1,Dateneingabe!F26)","v":"zzz"},{"$f":"IF(Dateneingabe!G26=0,$B$1,Dateneingabe!G26)","v":"zzz"},{"$f":"IF(Dateneingabe!H26=0,$B$1,Dateneingabe!H26)","v":"zzz"},{"$f":"IF(Dateneingabe!B26=0,$B$1,Dateneingabe!B26)","v":"zzz"},{"$f":"IF(Dateneingabe!I26=0,$B$1,Dateneingabe!I26)","v":"zzz"},{"$f":"IF(Dateneingabe!J26=0,$B$1,Dateneingabe!J26)","v":"zzz"},0,0,0,20]
[21,{"$f":"IF(Dateneingabe!D27=0,$B$1,Dateneingabe!D27)","v":"zzz"},{"$f":"IF(Dateneingabe!C27=0,$B$1,Dateneingabe!C27)","v":"zzz"},{"$f":"IF(Dateneingabe!A27=0,$B$1,Dateneingabe!A27)","v":"zzz"},{"$f":"IF(Dateneingabe!E27=0,$B$1,Dateneingabe!E27)","v":"zzz"},{"$f":"IF(Dateneingabe!F27=0,$B$1,Dateneingabe!F27)","v":"zzz"},{"$f":"IF(Dateneingabe!G27=0,$B$1,Dateneingabe!G27)","v":"zzz"},{"$f":"IF(Dateneingabe!H27=0,$B$1,Dateneingabe!H27)","v":"zzz"},{"$f":"IF(Dateneingabe!B27=0,$B$1,Dateneingabe!B27)","v":"zzz"},{"$f":"IF(Dateneingabe!I27=0,$B$1,Dateneingabe!I27)","v":"zzz"},{"$f":"IF(Dateneingabe!J27=0,$B$1,Dateneingabe!J27)","v":"zzz"},0,0,0,21]
[22,{"$f":"IF(Dateneingabe!D28=0,$B$1,Dateneingabe!D28)","v":"zzz"},{"$f":"IF(Dateneingabe!C28=0,$B$1,Dateneingabe!C28)","v":"zzz"},{"$f":"IF(Dateneingabe!A28=0,$B$1,Dateneingabe!A28)","v":"zzz"},{"$f":"IF(Dateneingabe!E28=0,$B$1,Dateneingabe!E28)","v":"zzz"},{"$f":"IF(Dateneingabe!F28=0,$B$1,Dateneingabe!F28)","v":"zzz"},{"$f":"IF(Dateneingabe!G28=0,$B$1,Dateneingabe!G28)","v":"zzz"},{"$f":"IF(Dateneingabe!H28=0,$B$1,Dateneingabe!H28)","v":"zzz"},{"$f":"IF(Dateneingabe!B28=0,$B$1,Dateneingabe!B28)","v":"zzz"},{"$f":"IF(Dateneingabe!I28=0,$B$1,Dateneingabe!I28)","v":"zzz"},{"$f":"IF(Dateneingabe!J28=0,$B$1,Dateneingabe!J28)","v":"zzz"},0,0,0,22]
[23,{"$f":"IF(Dateneingabe!D29=0,$B$1,Dateneingabe!D29)","v":"zzz"},{"$f":"IF(Dateneingabe!C29=0,$B$1,Dateneingabe!C29)","v":"zzz"},{"$f":"IF(Dateneingabe!A29=0,$B$1,Dateneingabe!A29)","v":"zzz"},{"$f":"IF(Dateneingabe!E29=0,$B$1,Dateneingabe!E29)","v":"zzz"},{"$f":"IF(Dateneingabe!F29=0,$B$1,Dateneingabe!F29)","v":"zzz"},{"$f":"IF(Dateneingabe!G29=0,$B$1,Dateneingabe!G29)","v":"zzz"},{"$f":"IF(Dateneingabe!H29=0,$B$1,Dateneingabe!H29)","v":"zzz"},{"$f":"IF(Dateneingabe!B29=0,$B$1,Dateneingabe!B29)","v":"zzz"},{"$f":"IF(Dateneingabe!I29=0,$B$1,Dateneingabe!I29)","v":"zzz"},{"$f":"IF(Dateneingabe!J29=0,$B$1,Dateneingabe!J29)","v":"zzz"},0,0,0,23]
[24,{"$f":"IF(Dateneingabe!D30=0,$B$1,Dateneingabe!D30)","v":"zzz"},{"$f":"IF(Dateneingabe!C30=0,$B$1,Dateneingabe!C30)","v":"zzz"},{"$f":"IF(Dateneingabe!A30=0,$B$1,Dateneingabe!A30)","v":"zzz"},{"$f":"IF(Dateneingabe!E30=0,$B$1,Dateneingabe!E30)","v":"zzz"},{"$f":"IF(Dateneingabe!F30=0,$B$1,Dateneingabe!F30)","v":"zzz"},{"$f":"IF(Dateneingabe!G30=0,$B$1,Dateneingabe!G30)","v":"zzz"},{"$f":"IF(Dateneingabe!H30=0,$B$1,Dateneingabe!H30)","v":"zzz"},{"$f":"IF(Dateneingabe!B30=0,$B$1,Dateneingabe!B30)","v":"zzz"},{"$f":"IF(Dateneingabe!I30=0,$B$1,Dateneingabe!I30)","v":"zzz"},{"$f":"IF(Dateneingabe!J30=0,$B$1,Dateneingabe!J30)","v":"zzz"},0,0,0,24]
[25,{"$f":"IF(Dateneingabe!D31=0,$B$1,Dateneingabe!D31)","v":"zzz"},{"$f":"IF(Dateneingabe!C31=0,$B$1,Dateneingabe!C31)","v":"zzz"},{"$f":"IF(Dateneingabe!A31=0,$B$1,Dateneingabe!A31)","v":"zzz"},{"$f":"IF(Dateneingabe!E31=0,$B$1,Dateneingabe!E31)","v":"zzz"},{"$f":"IF(Dateneingabe!F31=0,$B$1,Dateneingabe!F31)","v":"zzz"},{"$f":"IF(Dateneingabe!G31=0,$B$1,Dateneingabe!G31)","v":"zzz"},{"$f":"IF(Dateneingabe!H31=0,$B$1,Dateneingabe!H31)","v":"zzz"},{"$f":"IF(Dateneingabe!B31=0,$B$1,Dateneingabe!B31)","v":"zzz"},{"$f":"IF(Dateneingabe!I31=0,$B$1,Dateneingabe!I31)","v":"zzz"},{"$f":"IF(Dateneingabe!J31=0,$B$1,Dateneingabe!J31)","v":"zzz"},0,0,0,25]
[26,{"$f":"IF(Dateneingabe!D32=0,$B$1,Dateneingabe!D32)","v":"zzz"},{"$f":"IF(Dateneingabe!C32=0,$B$1,Dateneingabe!C32)","v":"zzz"},{"$f":"IF(Dateneingabe!A32=0,$B$1,Dateneingabe!A32)","v":"zzz"},{"$f":"IF(Dateneingabe!E32=0,$B$1,Dateneingabe!E32)","v":"zzz"},{"$f":"IF(Dateneingabe!F32=0,$B$1,Dateneingabe!F32)","v":"zzz"},{"$f":"IF(Dateneingabe!G32=0,$B$1,Dateneingabe!G32)","v":"zzz"},{"$f":"IF(Dateneingabe!H32=0,$B$1,Dateneingabe!H32)","v":"zzz"},{"$f":"IF(Dateneingabe!B32=0,$B$1,Dateneingabe!B32)","v":"zzz"},{"$f":"IF(Dateneingabe!I32=0,$B$1,Dateneingabe!I32)","v":"zzz"},{"$f":"IF(Dateneingabe!J32=0,$B$1,Dateneingabe!J32)","v":"zzz"},0,0,0,26]
[27,{"$f":"IF(Dateneingabe!D33=0,$B$1,Dateneingabe!D33)","v":"zzz"},{"$f":"IF(Dateneingabe!C33=0,$B$1,Dateneingabe!C33)","v":"zzz"},{"$f":"IF(Dateneingabe!A33=0,$B$1,Dateneingabe!A33)","v":"zzz"},{"$f":"IF(Dateneingabe!E33=0,$B$1,Dateneingabe!E33)","v":"zzz"},{"$f":"IF(Dateneingabe!F33=0,$B$1,Dateneingabe!F33)","v":"zzz"},{"$f":"IF(Dateneingabe!G33=0,$B$1,Dateneingabe!G33)","v":"zzz"},{"$f":"IF(Dateneingabe!H33=0,$B$1,Dateneingabe!H33)","v":"zzz"},{"$f":"IF(Dateneingabe!B33=0,$B$1,Dateneingabe!B33)","v":"zzz"},{"$f":"IF(Dateneingabe!I33=0,$B$1,Dateneingabe!I33)","v":"zzz"},{"$f":"IF(Dateneingabe!J33=0,$B$1,Dateneingabe!J33)","v":"zzz"},0,0,0,27]
[28,{"$f":"IF(Dateneingabe!D34=0,$B$1,Dateneingabe!D34)","v":"zzz"},{"$f":"IF(Dateneingabe!C34=0,$B$1,Dateneingabe!C34)","v":"zzz"},{"$f":"IF(Dateneingabe!A34=0,$B$1,Dateneingabe!A34)","v":"zzz"},{"$f":"IF(Dateneingabe!E34=0,$B$1,Dateneingabe!E34)","v":"zzz"},{"$f":"IF(Dateneingabe!F34=0,$B$1,Dateneingabe!F34)","v":"zzz"},{"$f":"IF(Dateneingabe!G34=0,$B$1,Dateneingabe!G34)","v":"zzz"},{"$f":"IF(Dateneingabe!H34=0,$B$1,Dateneingabe!H34)","v":"zzz"},{"$f":"IF(Dateneingabe!B34=0,$B$1,Dateneingabe!B34)","v":"zzz"},{"$f":"IF(Dateneingabe!I34=0,$B$1,Dateneingabe!I34)","v":"zzz"},{"$f":"IF(Dateneingabe!J34=0,$B$1,Dateneingabe!J34)","v":"zzz"},0,0,0,28]
[29,{"$f":"IF(Dateneingabe!D35=0,$B$1,Dateneingabe!D35)","v":"zzz"},{"$f":"IF(Dateneingabe!C35=0,$B$1,Dateneingabe!C35)","v":"zzz"},{"$f":"IF(Dateneingabe!A35=0,$B$1,Dateneingabe!A35)","v":"zzz"},{"$f":"IF(Dateneingabe!E35=0,$B$1,Dateneingabe!E35)","v":"zzz"},{"$f":"IF(Dateneingabe!F35=0,$B$1,Dateneingabe!F35)","v":"zzz"},{"$f":"IF(Dateneingabe!G35=0,$B$1,Dateneingabe!G35)","v":"zzz"},{"$f":"IF(Dateneingabe!H35=0,$B$1,Dateneingabe!H35)","v":"zzz"},{"$f":"IF(Dateneingabe!B35=0,$B$1,Dateneingabe!B35)","v":"zzz"},{"$f":"IF(Dateneingabe!I35=0,$B$1,Dateneingabe!I35)","v":"zzz"},{"$f":"IF(Dateneingabe!J35=0,$B$1,Dateneingabe!J35)","v":"zzz"},0,0,0,29]
[30,{"$f":"IF(Dateneingabe!D36=0,$B$1,Dateneingabe!D36)","v":"zzz"},{"$f":"IF(Dateneingabe!C36=0,$B$1,Dateneingabe!C36)","v":"zzz"},{"$f":"IF(Dateneingabe!A36=0,$B$1,Dateneingabe!A36)","v":"zzz"},{"$f":"IF(Dateneingabe!E36=0,$B$1,Dateneingabe!E36)","v":"zzz"},{"$f":"IF(Dateneingabe!F36=0,$B$1,Dateneingabe!F36)","v":"zzz"},{"$f":"IF(Dateneingabe!G36=0,$B$1,Dateneingabe!G36)","v":"zzz"},{"$f":"IF(Dateneingabe!H36=0,$B$1,Dateneingabe!H36)","v":"zzz"},{"$f":"IF(Dateneingabe!B36=0,$B$1,Dateneingabe!B36)","v":"zzz"},{"$f":"IF(Dateneingabe!I36=0,$B$1,Dateneingabe!I36)","v":"zzz"},{"$f":"IF(Dateneingabe!J36=0,$B$1,Dateneingabe!J36)","v":"zzz"},0,0,0,30]
[31,{"$f":"IF(Dateneingabe!D37=0,$B$1,Dateneingabe!D37)","v":"zzz"},{"$f":"IF(Dateneingabe!C37=0,$B$1,Dateneingabe!C37)","v":"zzz"},{"$f":"IF(Dateneingabe!A37=0,$B$1,Dateneingabe!A37)","v":"zzz"},{"$f":"IF(Dateneingabe!E37=0,$B$1,Dateneingabe!E37)","v":"zzz"},{"$f":"IF(Dateneingabe!F37=0,$B$1,Dateneingabe!F37)","v":"zzz"},{"$f":"IF(Dateneingabe!G37=0,$B$1,Dateneingabe!G37)","v":"zzz"},{"$f":"IF(Dateneingabe!H37=0,$B$1,Dateneingabe!H37)","v":"zzz"},{"$f":"IF(Dateneingabe!B37=0,$B$1,Dateneingabe!B37)","v":"zzz"},{"$f":"IF(Dateneingabe!I37=0,$B$1,Dateneingabe!I37)","v":"zzz"},{"$f":"IF(Dateneingabe!J37=0,$B$1,Dateneingabe!J37)","v":"zzz"},0,0,0,31]
[32,{"$f":"IF(Dateneingabe!D38=0,$B$1,Dateneingabe!D38)","v":"zzz"},{"$f":"IF(Dateneingabe!C38=0,$B$1,Dateneingabe!C38)","v":"zzz"},{"$f":"IF(Dateneingabe!A38=0,$B$1,Dateneingabe!A38)","v":"zzz"},{"$f":"IF(Dateneingabe!E38=0,$B$1,Dateneingabe!E38)","v":"zzz"},{"$f":"IF(Dateneingabe!F38=0,$B$1,Dateneingabe!F38)","v":"zzz"},{"$f":"IF(Dateneingabe!G38=0,$B$1,Dateneingabe!G38)","v":"zzz"},{"$f":"IF(Dateneingabe!H38=0,$B$1,Dateneingabe!H38)","v":"zzz"},{"$f":"IF(Dateneingabe!B38=0,$B$1,Dateneingabe!B38)","v":"zzz"},{"$f":"IF(Dateneingabe!I38=0,$B$1,Dateneingabe!I38)","v":"zzz"},{"$f":"IF(Dateneingabe!J38=0,$B$1,Dateneingabe!J38)","v":"zzz"},0,0,0,32]
[33,{"$f":"IF(Dateneingabe!D39=0,$B$1,Dateneingabe!D39)","v":"zzz"},{"$f":"IF(Dateneingabe!C39=0,$B$1,Dateneingabe!C39)","v":"zzz"},{"$f":"IF(Dateneingabe!A39=0,$B$1,Dateneingabe!A39)","v":"zzz"},{"$f":"IF(Dateneingabe!E39=0,$B$1,Dateneingabe!E39)","v":"zzz"},{"$f":"IF(Dateneingabe!F39=0,$B$1,Dateneingabe!F39)","v":"zzz"},{"$f":"IF(Dateneingabe!G39=0,$B$1,Dateneingabe!G39)","v":"zzz"},{"$f":"IF(Dateneingabe!H39=0,$B$1,Dateneingabe!H39)","v":"zzz"},{"$f":"IF(Dateneingabe!B39=0,$B$1,Dateneingabe!B39)","v":"zzz"},{"$f":"IF(Dateneingabe!I39=0,$B$1,Dateneingabe!I39)","v":"zzz"},{"$f":"IF(Dateneingabe!J39=0,$B$1,Dateneingabe!J39)","v":"zzz"},0,0,0,33]
[34,{"$f":"IF(Dateneingabe!D40=0,$B$1,Dateneingabe!D40)","v":"zzz"},{"$f":"IF(Dateneingabe!C40=0,$B$1,Dateneingabe!C40)","v":"zzz"},{"$f":"IF(Dateneingabe!A40=0,$B$1,Dateneingabe!A40)","v":"zzz"},{"$f":"IF(Dateneingabe!E40=0,$B$1,Dateneingabe!E40)","v":"zzz"},{"$f":"IF(Dateneingabe!F40=0,$B$1,Dateneingabe!F40)","v":"zzz"},{"$f":"IF(Dateneingabe!G40=0,$B$1,Dateneingabe!G40)","v":"zzz"},{"$f":"IF(Dateneingabe!H40=0,$B$1,Dateneingabe!H40)","v":"zzz"},{"$f":"IF(Dateneingabe!B40=0,$B$1,Dateneingabe!B40)","v":"zzz"},{"$f":"IF(Dateneingabe!I40=0,$B$1,Dateneingabe!I40)","v":"zzz"},{"$f":"IF(Dateneingabe!J40=0,$B$1,Dateneingabe!J40)","v":"zzz"},0,0,0,34]
[35,{"$f":"IF(Dateneingabe!D41=0,$B$1,Dateneingabe!D41)","v":"zzz"},{"$f":"IF(Dateneingabe!C41=0,$B$1,Dateneingabe!C41)","v":"zzz"},{"$f":"IF(Dateneingabe!A41=0,$B$1,Dateneingabe!A41)","v":"zzz"},{"$f":"IF(Dateneingabe!E41=0,$B$1,Dateneingabe!E41)","v":"zzz"},{"$f":"IF(Dateneingabe!F41=0,$B$1,Dateneingabe!F41)","v":"zzz"},{"$f":"IF(Dateneingabe!G41=0,$B$1,Dateneingabe!G41)","v":"zzz"},{"$f":"IF(Dateneingabe!H41=0,$B$1,Dateneingabe!H41)","v":"zzz"},{"$f":"IF(Dateneingabe!B41=0,$B$1,Dateneingabe!B41)","v":"zzz"},{"$f":"IF(Dateneingabe!I41=0,$B$1,Dateneingabe!I41)","v":"zzz"},{"$f":"IF(Dateneingabe!J41=0,$B$1,Dateneingabe!J41)","v":"zzz"},0,0,0,35]
[36,{"$f":"IF(Dateneingabe!D42=0,$B$1,Dateneingabe!D42)","v":"zzz"},{"$f":"IF(Dateneingabe!C42=0,$B$1,Dateneingabe!C42)","v":"zzz"},{"$f":"IF(Dateneingabe!A42=0,$B$1,Dateneingabe!A42)","v":"zzz"},{"$f":"IF(Dateneingabe!E42=0,$B$1,Dateneingabe!E42)","v":"zzz"},{"$f":"IF(Dateneingabe!F42=0,$B$1,Dateneingabe!F42)","v":"zzz"},{"$f":"IF(Dateneingabe!G42=0,$B$1,Dateneingabe!G42)","v":"zzz"},{"$f":"IF(Dateneingabe!H42=0,$B$1,Dateneingabe!H42)","v":"zzz"},{"$f":"IF(Dateneingabe!B42=0,$B$1,Dateneingabe!B42)","v":"zzz"},{"$f":"IF(Dateneingabe!I42=0,$B$1,Dateneingabe!I42)","v":"zzz"},{"$f":"IF(Dateneingabe!J42=0,$B$1,Dateneingabe!J42)","v":"zzz"},0,0,0,36]
[37,{"$f":"IF(Dateneingabe!D43=0,$B$1,Dateneingabe!D43)","v":"zzz"},{"$f":"IF(Dateneingabe!C43=0,$B$1,Dateneingabe!C43)","v":"zzz"},{"$f":"IF(Dateneingabe!A43=0,$B$1,Dateneingabe!A43)","v":"zzz"},{"$f":"IF(Dateneingabe!E43=0,$B$1,Dateneingabe!E43)","v":"zzz"},{"$f":"IF(Dateneingabe!F43=0,$B$1,Dateneingabe!F43)","v":"zzz"},{"$f":"IF(Dateneingabe!G43=0,$B$1,Dateneingabe!G43)","v":"zzz"},{"$f":"IF(Dateneingabe!H43=0,$B$1,Dateneingabe!H43)","v":"zzz"},{"$f":"IF(Dateneingabe!B43=0,$B$1,Dateneingabe!B43)","v":"zzz"},{"$f":"IF(Dateneingabe!I43=0,$B$1,Dateneingabe!I43)","v":"zzz"},{"$f":"IF(Dateneingabe!J43=0,$B$1,Dateneingabe!J43)","v":"zzz"},0,0,0,37]
[38,{"$f":"IF(Dateneingabe!D44=0,$B$1,Dateneingabe!D44)","v":"zzz"},{"$f":"IF(Dateneingabe!C44=0,$B$1,Dateneingabe!C44)","v":"zzz"},{"$f":"IF(Dateneingabe!A44=0,$B$1,Dateneingabe!A44)","v":"zzz"},{"$f":"IF(Dateneingabe!E44=0,$B$1,Dateneingabe!E44)","v":"zzz"},{"$f":"IF(Dateneingabe!F44=0,$B$1,Dateneingabe!F44)","v":"zzz"},{"$f":"IF(Dateneingabe!G44=0,$B$1,Dateneingabe!G44)","v":"zzz"},{"$f":"IF(Dateneingabe!H44=0,$B$1,Dateneingabe!H44)","v":"zzz"},{"$f":"IF(Dateneingabe!B44=0,$B$1,Dateneingabe!B44)","v":"zzz"},{"$f":"IF(Dateneingabe!I44=0,$B$1,Dateneingabe!I44)","v":"zzz"},{"$f":"IF(Dateneingabe!J44=0,$B$1,Dateneingabe!J44)","v":"zzz"},0,0,0,38]
[39,{"$f":"IF(Dateneingabe!D45=0,$B$1,Dateneingabe!D45)","v":"zzz"},{"$f":"IF(Dateneingabe!C45=0,$B$1,Dateneingabe!C45)","v":"zzz"},{"$f":"IF(Dateneingabe!A45=0,$B$1,Dateneingabe!A45)","v":"zzz"},{"$f":"IF(Dateneingabe!E45=0,$B$1,Dateneingabe!E45)","v":"zzz"},{"$f":"IF(Dateneingabe!F45=0,$B$1,Dateneingabe!F45)","v":"zzz"},{"$f":"IF(Dateneingabe!G45=0,$B$1,Dateneingabe!G45)","v":"zzz"},{"$f":"IF(Dateneingabe!H45=0,$B$1,Dateneingabe!H45)","v":"zzz"},{"$f":"IF(Dateneingabe!B45=0,$B$1,Dateneingabe!B45)","v":"zzz"},{"$f":"IF(Dateneingabe!I45=0,$B$1,Dateneingabe!I45)","v":"zzz"},{"$f":"IF(Dateneingabe!J45=0,$B$1,Dateneingabe!J45)","v":"zzz"},0,0,0,39]
[40,{"$f":"IF(Dateneingabe!D46=0,$B$1,Dateneingabe!D46)","v":"zzz"},{"$f":"IF(Dateneingabe!C46=0,$B$1,Dateneingabe!C46)","v":"zzz"},{"$f":"IF(Dateneingabe!A46=0,$B$1,Dateneingabe!A46)","v":"zzz"},{"$f":"IF(Dateneingabe!E46=0,$B$1,Dateneingabe!E46)","v":"zzz"},{"$f":"IF(Dateneingabe!F46=0,$B$1,Dateneingabe!F46)","v":"zzz"},{"$f":"IF(Dateneingabe!G46=0,$B$1,Dateneingabe!G46)","v":"zzz"},{"$f":"IF(Dateneingabe!H46=0,$B$1,Dateneingabe!H46)","v":"zzz"},{"$f":"IF(Dateneingabe!B46=0,$B$1,Dateneingabe!B46)","v":"zzz"},{"$f":"IF(Dateneingabe!I46=0,$B$1,Dateneingabe!I46)","v":"zzz"},{"$f":"IF(Dateneingabe!J46=0,$B$1,Dateneingabe!J46)","v":"zzz"},0,0,0,40]
[41,{"$f":"IF(Dateneingabe!D47=0,$B$1,Dateneingabe!D47)","v":"zzz"},{"$f":"IF(Dateneingabe!C47=0,$B$1,Dateneingabe!C47)","v":"zzz"},{"$f":"IF(Dateneingabe!A47=0,$B$1,Dateneingabe!A47)","v":"zzz"},{"$f":"IF(Dateneingabe!E47=0,$B$1,Dateneingabe!E47)","v":"zzz"},{"$f":"IF(Dateneingabe!F47=0,$B$1,Dateneingabe!F47)","v":"zzz"},{"$f":"IF(Dateneingabe!G47=0,$B$1,Dateneingabe!G47)","v":"zzz"},{"$f":"IF(Dateneingabe!H47=0,$B$1,Dateneingabe!H47)","v":"zzz"},{"$f":"IF(Dateneingabe!B47=0,$B$1,Dateneingabe!B47)","v":"zzz"},{"$f":"IF(Dateneingabe!I47=0,$B$1,Dateneingabe!I47)","v":"zzz"},{"$f":"IF(Dateneingabe!J47=0,$B$1,Dateneingabe!J47)","v":"zzz"},0,0,0,41]
[42,{"$f":"IF(Dateneingabe!D48=0,$B$1,Dateneingabe!D48)","v":"zzz"},{"$f":"IF(Dateneingabe!C48=0,$B$1,Dateneingabe!C48)","v":"zzz"},{"$f":"IF(Dateneingabe!A48=0,$B$1,Dateneingabe!A48)","v":"zzz"},{"$f":"IF(Dateneingabe!E48=0,$B$1,Dateneingabe!E48)","v":"zzz"},{"$f":"IF(Dateneingabe!F48=0,$B$1,Dateneingabe!F48)","v":"zzz"},{"$f":"IF(Dateneingabe!G48=0,$B$1,Dateneingabe!G48)","v":"zzz"},{"$f":"IF(Dateneingabe!H48=0,$B$1,Dateneingabe!H48)","v":"zzz"},{"$f":"IF(Dateneingabe!B48=0,$B$1,Dateneingabe!B48)","v":"zzz"},{"$f":"IF(Dateneingabe!I48=0,$B$1,Dateneingabe!I48)","v":"zzz"},{"$f":"IF(Dateneingabe!J48=0,$B$1,Dateneingabe!J48)","v":"zzz"},0,0,0,42]
[43,{"$f":"IF(Dateneingabe!D49=0,$B$1,Dateneingabe!D49)","v":"zzz"},{"$f":"IF(Dateneingabe!C49=0,$B$1,Dateneingabe!C49)","v":"zzz"},{"$f":"IF(Dateneingabe!A49=0,$B$1,Dateneingabe!A49)","v":"zzz"},{"$f":"IF(Dateneingabe!E49=0,$B$1,Dateneingabe!E49)","v":"zzz"},{"$f":"IF(Dateneingabe!F49=0,$B$1,Dateneingabe!F49)","v":"zzz"},{"$f":"IF(Dateneingabe!G49=0,$B$1,Dateneingabe!G49)","v":"zzz"},{"$f":"IF(Dateneingabe!H49=0,$B$1,Dateneingabe!H49)","v":"zzz"},{"$f":"IF(Dateneingabe!B49=0,$B$1,Dateneingabe!B49)","v":"zzz"},{"$f":"IF(Dateneingabe!I49=0,$B$1,Dateneingabe!I49)","v":"zzz"},{"$f":"IF(Dateneingabe!J49=0,$B$1,Dateneingabe!J49)","v":"zzz"},0,0,0,43]
[44,{"$f":"IF(Dateneingabe!D50=0,$B$1,Dateneingabe!D50)","v":"zzz"},{"$f":"IF(Dateneingabe!C50=0,$B$1,Dateneingabe!C50)","v":"zzz"},{"$f":"IF(Dateneingabe!A50=0,$B$1,Dateneingabe!A50)","v":"zzz"},{"$f":"IF(Dateneingabe!E50=0,$B$1,Dateneingabe!E50)","v":"zzz"},{"$f":"IF(Dateneingabe!F50=0,$B$1,Dateneingabe!F50)","v":"zzz"},{"$f":"IF(Dateneingabe!G50=0,$B$1,Dateneingabe!G50)","v":"zzz"},{"$f":"IF(Dateneingabe!H50=0,$B$1,Dateneingabe!H50)","v":"zzz"},{"$f":"IF(Dateneingabe!B50=0,$B$1,Dateneingabe!B50)","v":"zzz"},{"$f":"IF(Dateneingabe!I50=0,$B$1,Dateneingabe!I50)","v":"zzz"},{"$f":"IF(Dateneingabe!J50=0,$B$1,Dateneingabe!J50)","v":"zzz"},0,0,0,44]
[45,{"$f":"IF(Dateneingabe!D51=0,$B$1,Dateneingabe!D51)","v":"zzz"},{"$f":"IF(Dateneingabe!C51=0,$B$1,Dateneingabe!C51)","v":"zzz"},{"$f":"IF(Dateneingabe!A51=0,$B$1,Dateneingabe!A51)","v":"zzz"},{"$f":"IF(Dateneingabe!E51=0,$B$1,Dateneingabe!E51)","v":"zzz"},{"$f":"IF(Dateneingabe!F51=0,$B$1,Dateneingabe!F51)","v":"zzz"},{"$f":"IF(Dateneingabe!G51=0,$B$1,Dateneingabe!G51)","v":"zzz"},{"$f":"IF(Dateneingabe!H51=0,$B$1,Dateneingabe!H51)","v":"zzz"},{"$f":"IF(Dateneingabe!B51=0,$B$1,Dateneingabe!B51)","v":"zzz"},{"$f":"IF(Dateneingabe!I51=0,$B$1,Dateneingabe!I51)","v":"zzz"},{"$f":"IF(Dateneingabe!J51=0,$B$1,Dateneingabe!J51)","v":"zzz"},0,0,0,45]
[46,{"$f":"IF(Dateneingabe!D52=0,$B$1,Dateneingabe!D52)","v":"zzz"},{"$f":"IF(Dateneingabe!C52=0,$B$1,Dateneingabe!C52)","v":"zzz"},{"$f":"IF(Dateneingabe!A52=0,$B$1,Dateneingabe!A52)","v":"zzz"},{"$f":"IF(Dateneingabe!E52=0,$B$1,Dateneingabe!E52)","v":"zzz"},{"$f":"IF(Dateneingabe!F52=0,$B$1,Dateneingabe!F52)","v":"zzz"},{"$f":"IF(Dateneingabe!G52=0,$B$1,Dateneingabe!G52)","v":"zzz"},{"$f":"IF(Dateneingabe!H52=0,$B$1,Dateneingabe!H52)","v":"zzz"},{"$f":"IF(Dateneingabe!B52=0,$B$1,Dateneingabe!B52)","v":"zzz"},{"$f":"IF(Dateneingabe!I52=0,$B$1,Dateneingabe!I52)","v":"zzz"},{"$f":"IF(Dateneingabe!J52=0,$B$1,Dateneingabe!J52)","v":"zzz"},0,0,0,46]
[47,{"$f":"IF(Dateneingabe!D53=0,$B$1,Dateneingabe!D53)","v":"zzz"},{"$f":"IF(Dateneingabe!C53=0,$B$1,Dateneingabe!C53)","v":"zzz"},{"$f":"IF(Dateneingabe!A53=0,$B$1,Dateneingabe!A53)","v":"zzz"},{"$f":"IF(Dateneingabe!E53=0,$B$1,Dateneingabe!E53)","v":"zzz"},{"$f":"IF(Dateneingabe!F53=0,$B$1,Dateneingabe!F53)","v":"zzz"},{"$f":"IF(Dateneingabe!G53=0,$B$1,Dateneingabe!G53)","v":"zzz"},{"$f":"IF(Dateneingabe!H53=0,$B$1,Dateneingabe!H53)","v":"zzz"},{"$f":"IF(Dateneingabe!B53=0,$B$1,Dateneingabe!B53)","v":"zzz"},{"$f":"IF(Dateneingabe!I53=0,$B$1,Dateneingabe!I53)","v":"zzz"},{"$f":"IF(Dateneingabe!J53=0,$B$1,Dateneingabe!J53)","v":"zzz"},0,0,0,47]
[48,{"$f":"IF(Dateneingabe!D54=0,$B$1,Dateneingabe!D54)","v":"zzz"},{"$f":"IF(Dateneingabe!C54=0,$B$1,Dateneingabe!C54)","v":"zzz"},{"$f":"IF(Dateneingabe!A54=0,$B$1,Dateneingabe!A54)","v":"zzz"},{"$f":"IF(Dateneingabe!E54=0,$B$1,Dateneingabe!E54)","v":"zzz"},{"$f":"IF(Dateneingabe!F54=0,$B$1,Dateneingabe!F54)","v":"zzz"},{"$f":"IF(Dateneingabe!G54=0,$B$1,Dateneingabe!G54)","v":"zzz"},{"$f":"IF(Dateneingabe!H54=0,$B$1,Dateneingabe!H54)","v":"zzz"},{"$f":"IF(Dateneingabe!B54=0,$B$1,Dateneingabe!B54)","v":"zzz"},{"$f":"IF(Dateneingabe!I54=0,$B$1,Dateneingabe!I54)","v":"zzz"},{"$f":"IF(Dateneingabe!J54=0,$B$1,Dateneingabe!J54)","v":"zzz"},0,0,0,48]
[49,{"$f":"IF(Dateneingabe!D55=0,$B$1,Dateneingabe!D55)","v":"zzz"},{"$f":"IF(Dateneingabe!C55=0,$B$1,Dateneingabe!C55)","v":"zzz"},{"$f":"IF(Dateneingabe!A55=0,$B$1,Dateneingabe!A55)","v":"zzz"},{"$f":"IF(Dateneingabe!E55=0,$B$1,Dateneingabe!E55)","v":"zzz"},{"$f":"IF(Dateneingabe!F55=0,$B$1,Dateneingabe!F55)","v":"zzz"},{"$f":"IF(Dateneingabe!G55=0,$B$1,Dateneingabe!G55)","v":"zzz"},{"$f":"IF(Dateneingabe!H55=0,$B$1,Dateneingabe!H55)","v":"zzz"},{"$f":"IF(Dateneingabe!B55=0,$B$1,Dateneingabe!B55)","v":"zzz"},{"$f":"IF(Dateneingabe!I55=0,$B$1,Dateneingabe!I55)","v":"zzz"},{"$f":"IF(Dateneingabe!J55=0,$B$1,Dateneingabe!J55)","v":"zzz"},0,0,0,49]
[50,{"$f":"IF(Dateneingabe!D56=0,$B$1,Dateneingabe!D56)","v":"zzz"},{"$f":"IF(Dateneingabe!C56=0,$B$1,Dateneingabe!C56)","v":"zzz"},{"$f":"IF(Dateneingabe!A56=0,$B$1,Dateneingabe!A56)","v":"zzz"},{"$f":"IF(Dateneingabe!E56=0,$B$1,Dateneingabe!E56)","v":"zzz"},{"$f":"IF(Dateneingabe!F56=0,$B$1,Dateneingabe!F56)","v":"zzz"},{"$f":"IF(Dateneingabe!G56=0,$B$1,Dateneingabe!G56)","v":"zzz"},{"$f":"IF(Dateneingabe!H56=0,$B$1,Dateneingabe!H56)","v":"zzz"},{"$f":"IF(Dateneingabe!B56=0,$B$1,Dateneingabe!B56)","v":"zzz"},{"$f":"IF(Dateneingabe!I56=0,$B$1,Dateneingabe!I56)","v":"zzz"},{"$f":"IF(Dateneingabe!J56=0,$B$1,Dateneingabe!J56)","v":"zzz"},0,0,0,50]
[51,{"$f":"IF(Dateneingabe!D57=0,$B$1,Dateneingabe!D57)","v":"zzz"},{"$f":"IF(Dateneingabe!C57=0,$B$1,Dateneingabe!C57)","v":"zzz"},{"$f":"IF(Dateneingabe!A57=0,$B$1,Dateneingabe!A57)","v":"zzz"},{"$f":"IF(Dateneingabe!E57=0,$B$1,Dateneingabe!E57)","v":"zzz"},{"$f":"IF(Dateneingabe!F57=0,$B$1,Dateneingabe!F57)","v":"zzz"},{"$f":"IF(Dateneingabe!G57=0,$B$1,Dateneingabe!G57)","v":"zzz"},{"$f":"IF(Dateneingabe!H57=0,$B$1,Dateneingabe!H57)","v":"zzz"},{"$f":"IF(Dateneingabe!B57=0,$B$1,Dateneingabe!B57)","v":"zzz"},{"$f":"IF(Dateneingabe!I57=0,$B$1,Dateneingabe!I57)","v":"zzz"},{"$f":"IF(Dateneingabe!J57=0,$B$1,Dateneingabe!J57)","v":"zzz"},0,0,0,51]
[52,{"$f":"IF(Dateneingabe!D58=0,$B$1,Dateneingabe!D58)","v":"zzz"},{"$f":"IF(Dateneingabe!C58=0,$B$1,Dateneingabe!C58)","v":"zzz"},{"$f":"IF(Dateneingabe!A58=0,$B$1,Dateneingabe!A58)","v":"zzz"},{"$f":"IF(Dateneingabe!E58=0,$B$1,Dateneingabe!E58)","v":"zzz"},{"$f":"IF(Dateneingabe!F58=0,$B$1,Dateneingabe!F58)","v":"zzz"},{"$f":"IF(Dateneingabe!G58=0,$B$1,Dateneingabe!G58)","v":"zzz"},{"$f":"IF(Dateneingabe!H58=0,$B$1,Dateneingabe!H58)","v":"zzz"},{"$f":"IF(Dateneingabe!B58=0,$B$1,Dateneingabe!B58)","v":"zzz"},{"$f":"IF(Dateneingabe!I58=0,$B$1,Dateneingabe!I58)","v":"zzz"},{"$f":"IF(Dateneingabe!J58=0,$B$1,Dateneingabe!J58)","v":"zzz"},0,0,0,52]
[53,{"$f":"IF(Dateneingabe!D59=0,$B$1,Dateneingabe!D59)","v":"zzz"},{"$f":"IF(Dateneingabe!C59=0,$B$1,Dateneingabe!C59)","v":"zzz"},{"$f":"IF(Dateneingabe!A59=0,$B$1,Dateneingabe!A59)","v":"zzz"},{"$f":"IF(Dateneingabe!E59=0,$B$1,Dateneingabe!E59)","v":"zzz"},{"$f":"IF(Dateneingabe!F59=0,$B$1,Dateneingabe!F59)","v":"zzz"},{"$f":"IF(Dateneingabe!G59=0,$B$1,Dateneingabe!G59)","v":"zzz"},{"$f":"IF(Dateneingabe!H59=0,$B$1,Dateneingabe!H59)","v":"zzz"},{"$f":"IF(Dateneingabe!B59=0,$B$1,Dateneingabe!B59)","v":"zzz"},{"$f":"IF(Dateneingabe!I59=0,$B$1,Dateneingabe!I59)","v":"zzz"},{"$f":"IF(Dateneingabe!J59=0,$B$1,Dateneingabe!J59)","v":"zzz"},0,0,0,53]
[54,{"$f":"IF(Dateneingabe!D60=0,$B$1,Dateneingabe!D60)","v":"zzz"},{"$f":"IF(Dateneingabe!C60=0,$B$1,Dateneingabe!C60)","v":"zzz"},{"$f":"IF(Dateneingabe!A60=0,$B$1,Dateneingabe!A60)","v":"zzz"},{"$f":"IF(Dateneingabe!E60=0,$B$1,Dateneingabe!E60)","v":"zzz"},{"$f":"IF(Dateneingabe!F60=0,$B$1,Dateneingabe!F60)","v":"zzz"},{"$f":"IF(Dateneingabe!G60=0,$B$1,Dateneingabe!G60)","v":"zzz"},{"$f":"IF(Dateneingabe!H60=0,$B$1,Dateneingabe!H60)","v":"zzz"},{"$f":"IF(Dateneingabe!B60=0,$B$1,Dateneingabe!B60)","v":"zzz"},{"$f":"IF(Dateneingabe!I60=0,$B$1,Dateneingabe!I60)","v":"zzz"},{"$f":"IF(Dateneingabe!J60=0,$B$1,Dateneingabe!J60)","v":"zzz"},0,0,0,54]
[55,{"$f":"IF(Dateneingabe!D61=0,$B$1,Dateneingabe!D61)","v":"zzz"},{"$f":"IF(Dateneingabe!C61=0,$B$1,Dateneingabe!C61)","v":"zzz"},{"$f":"IF(Dateneingabe!A61=0,$B$1,Dateneingabe!A61)","v":"zzz"},{"$f":"IF(Dateneingabe!E61=0,$B$1,Dateneingabe!E61)","v":"zzz"},{"$f":"IF(Dateneingabe!F61=0,$B$1,Dateneingabe!F61)","v":"zzz"},{"$f":"IF(Dateneingabe!G61=0,$B$1,Dateneingabe!G61)","v":"zzz"},{"$f":"IF(Dateneingabe!H61=0,$B$1,Dateneingabe!H61)","v":"zzz"},{"$f":"IF(Dateneingabe!B61=0,$B$1,Dateneingabe!B61)","v":"zzz"},{"$f":"IF(Dateneingabe!I61=0,$B$1,Dateneingabe!I61)","v":"zzz"},{"$f":"IF(Dateneingabe!J61=0,$B$1,Dateneingabe!J61)","v":"zzz"},0,0,0,55]
[56,{"$f":"IF(Dateneingabe!D62=0,$B$1,Dateneingabe!D62)","v":"zzz"},{"$f":"IF(Dateneingabe!C62=0,$B$1,Dateneingabe!C62)","v":"zzz"},{"$f":"IF(Dateneingabe!A62=0,$B$1,Dateneingabe!A62)","v":"zzz"},{"$f":"IF(Dateneingabe!E62=0,$B$1,Dateneingabe!E62)","v":"zzz"},{"$f":"IF(Dateneingabe!F62=0,$B$1,Dateneingabe!F62)","v":"zzz"},{"$f":"IF(Dateneingabe!G62=0,$B$1,Dateneingabe!G62)","v":"zzz"},{"$f":"IF(Dateneingabe!H62=0,$B$1,Dateneingabe!H62)","v":"zzz"},{"$f":"IF(Dateneingabe!B62=0,$B$1,Dateneingabe!B62)","v":"zzz"},{"$f":"IF(Dateneingabe!I62=0,$B$1,Dateneingabe!I62)","v":"zzz"},{"$f":"IF(Dateneingabe!J62=0,$B$1,Dateneingabe!J62)","v":"zzz"},0,0,0,56]
[57,{"$f":"IF(Dateneingabe!D63=0,$B$1,Dateneingabe!D63)","v":"zzz"},{"$f":"IF(Dateneingabe!C63=0,$B$1,Dateneingabe!C63)","v":"zzz"},{"$f":"IF(Dateneingabe!A63=0,$B$1,Dateneingabe!A63)","v":"zzz"},{"$f":"IF(Dateneingabe!E63=0,$B$1,Dateneingabe!E63)","v":"zzz"},{"$f":"IF(Dateneingabe!F63=0,$B$1,Dateneingabe!F63)","v":"zzz"},{"$f":"IF(Dateneingabe!G63=0,$B$1,Dateneingabe!G63)","v":"zzz"},{"$f":"IF(Dateneingabe!H63=0,$B$1,Dateneingabe!H63)","v":"zzz"},{"$f":"IF(Dateneingabe!B63=0,$B$1,Dateneingabe!B63)","v":"zzz"},{"$f":"IF(Dateneingabe!I63=0,$B$1,Dateneingabe!I63)","v":"zzz"},{"$f":"IF(Dateneingabe!J63=0,$B$1,Dateneingabe!J63)","v":"zzz"},0,0,0,57]
[58,{"$f":"IF(Dateneingabe!D64=0,$B$1,Dateneingabe!D64)","v":"zzz"},{"$f":"IF(Dateneingabe!C64=0,$B$1,Dateneingabe!C64)","v":"zzz"},{"$f":"IF(Dateneingabe!A64=0,$B$1,Dateneingabe!A64)","v":"zzz"},{"$f":"IF(Dateneingabe!E64=0,$B$1,Dateneingabe!E64)","v":"zzz"},{"$f":"IF(Dateneingabe!F64=0,$B$1,Dateneingabe!F64)","v":"zzz"},{"$f":"IF(Dateneingabe!G64=0,$B$1,Dateneingabe!G64)","v":"zzz"},{"$f":"IF(Dateneingabe!H64=0,$B$1,Dateneingabe!H64)","v":"zzz"},{"$f":"IF(Dateneingabe!B64=0,$B$1,Dateneingabe!B64)","v":"zzz"},{"$f":"IF(Dateneingabe!I64=0,$B$1,Dateneingabe!I64)","v":"zzz"},{"$f":"IF(Dateneingabe!J64=0,$B$1,Dateneingabe!J64)","v":"zzz"},0,0,0,58]
[59,{"$f":"IF(Dateneingabe!D65=0,$B$1,Dateneingabe!D65)","v":"zzz"},{"$f":"IF(Dateneingabe!C65=0,$B$1,Dateneingabe!C65)","v":"zzz"},{"$f":"IF(Dateneingabe!A65=0,$B$1,Dateneingabe!A65)","v":"zzz"},{"$f":"IF(Dateneingabe!E65=0,$B$1,Dateneingabe!E65)","v":"zzz"},{"$f":"IF(Dateneingabe!F65=0,$B$1,Dateneingabe!F65)","v":"zzz"},{"$f":"IF(Dateneingabe!G65=0,$B$1,Dateneingabe!G65)","v":"zzz"},{"$f":"IF(Dateneingabe!H65=0,$B$1,Dateneingabe!H65)","v":"zzz"},{"$f":"IF(Dateneingabe!B65=0,$B$1,Dateneingabe!B65)","v":"zzz"},{"$f":"IF(Dateneingabe!I65=0,$B$1,Dateneingabe!I65)","v":"zzz"},{"$f":"IF(Dateneingabe!J65=0,$B$1,Dateneingabe!J65)","v":"zzz"},0,0,0,59]
[60,{"$f":"IF(Dateneingabe!D66=0,$B$1,Dateneingabe!D66)","v":"zzz"},{"$f":"IF(Dateneingabe!C66=0,$B$1,Dateneingabe!C66)","v":"zzz"},{"$f":"IF(Dateneingabe!A66=0,$B$1,Dateneingabe!A66)","v":"zzz"},{"$f":"IF(Dateneingabe!E66=0,$B$1,Dateneingabe!E66)","v":"zzz"},{"$f":"IF(Dateneingabe!F66=0,$B$1,Dateneingabe!F66)","v":"zzz"},{"$f":"IF(Dateneingabe!G66=0,$B$1,Dateneingabe!G66)","v":"zzz"},{"$f":"IF(Dateneingabe!H66=0,$B$1,Dateneingabe!H66)","v":"zzz"},{"$f":"IF(Dateneingabe!B66=0,$B$1,Dateneingabe!B66)","v":"zzz"},{"$f":"IF(Dateneingabe!I66=0,$B$1,Dateneingabe!I66)","v":"zzz"},{"$f":"IF(Dateneingabe!J66=0,$B$1,Dateneingabe!J66)","v":"zzz"},0,0,0,60]
[61,{"$f":"IF(Dateneingabe!D67=0,$B$1,Dateneingabe!D67)","v":"zzz"},{"$f":"IF(Dateneingabe!C67=0,$B$1,Dateneingabe!C67)","v":"zzz"},{"$f":"IF(Dateneingabe!A67=0,$B$1,Dateneingabe!A67)","v":"zzz"},{"$f":"IF(Dateneingabe!E67=0,$B$1,Dateneingabe!E67)","v":"zzz"},{"$f":"IF(Dateneingabe!F67=0,$B$1,Dateneingabe!F67)","v":"zzz"},{"$f":"IF(Dateneingabe!G67=0,$B$1,Dateneingabe!G67)","v":"zzz"},{"$f":"IF(Dateneingabe!H67=0,$B$1,Dateneingabe!H67)","v":"zzz"},{"$f":"IF(Dateneingabe!B67=0,$B$1,Dateneingabe!B67)","v":"zzz"},{"$f":"IF(Dateneingabe!I67=0,$B$1,Dateneingabe!I67)","v":"zzz"},{"$f":"IF(Dateneingabe!J67=0,$B$1,Dateneingabe!J67)","v":"zzz"},0,0,0,61]
[62,{"$f":"IF(Dateneingabe!D68=0,$B$1,Dateneingabe!D68)","v":"zzz"},{"$f":"IF(Dateneingabe!C68=0,$B$1,Dateneingabe!C68)","v":"zzz"},{"$f":"IF(Dateneingabe!A68=0,$B$1,Dateneingabe!A68)","v":"zzz"},{"$f":"IF(Dateneingabe!E68=0,$B$1,Dateneingabe!E68)","v":"zzz"},{"$f":"IF(Dateneingabe!F68=0,$B$1,Dateneingabe!F68)","v":"zzz"},{"$f":"IF(Dateneingabe!G68=0,$B$1,Dateneingabe!G68)","v":"zzz"},{"$f":"IF(Dateneingabe!H68=0,$B$1,Dateneingabe!H68)","v":"zzz"},{"$f":"IF(Dateneingabe!B68=0,$B$1,Dateneingabe!B68)","v":"zzz"},{"$f":"IF(Dateneingabe!I68=0,$B$1,Dateneingabe!I68)","v":"zzz"},{"$f":"IF(Dateneingabe!J68=0,$B$1,Dateneingabe!J68)","v":"zzz"},0,0,0,62]
[63,{"$f":"IF(Dateneingabe!D69=0,$B$1,Dateneingabe!D69)","v":"zzz"},{"$f":"IF(Dateneingabe!C69=0,$B$1,Dateneingabe!C69)","v":"zzz"},{"$f":"IF(Dateneingabe!A69=0,$B$1,Dateneingabe!A69)","v":"zzz"},{"$f":"IF(Dateneingabe!E69=0,$B$1,Dateneingabe!E69)","v":"zzz"},{"$f":"IF(Dateneingabe!F69=0,$B$1,Dateneingabe!F69)","v":"zzz"},{"$f":"IF(Dateneingabe!G69=0,$B$1,Dateneingabe!G69)","v":"zzz"},{"$f":"IF(Dateneingabe!H69=0,$B$1,Dateneingabe!H69)","v":"zzz"},{"$f":"IF(Dateneingabe!B69=0,$B$1,Dateneingabe!B69)","v":"zzz"},{"$f":"IF(Dateneingabe!I69=0,$B$1,Dateneingabe!I69)","v":"zzz"},{"$f":"IF(Dateneingabe!J69=0,$B$1,Dateneingabe!J69)","v":"zzz"},0,0,0,63]
[64,{"$f":"IF(Dateneingabe!D70=0,$B$1,Dateneingabe!D70)","v":"zzz"},{"$f":"IF(Dateneingabe!C70=0,$B$1,Dateneingabe!C70)","v":"zzz"},{"$f":"IF(Dateneingabe!A70=0,$B$1,Dateneingabe!A70)","v":"zzz"},{"$f":"IF(Dateneingabe!E70=0,$B$1,Dateneingabe!E70)","v":"zzz"},{"$f":"IF(Dateneingabe!F70=0,$B$1,Dateneingabe!F70)","v":"zzz"},{"$f":"IF(Dateneingabe!G70=0,$B$1,Dateneingabe!G70)","v":"zzz"},{"$f":"IF(Dateneingabe!H70=0,$B$1,Dateneingabe!H70)","v":"zzz"},{"$f":"IF(Dateneingabe!B70=0,$B$1,Dateneingabe!B70)","v":"zzz"},{"$f":"IF(Dateneingabe!I70=0,$B$1,Dateneingabe!I70)","v":"zzz"},{"$f":"IF(Dateneingabe!J70=0,$B$1,Dateneingabe!J70)","v":"zzz"},0,0,0,64]
[65,{"$f":"IF(Dateneingabe!D71=0,$B$1,Dateneingabe!D71)","v":"zzz"},{"$f":"IF(Dateneingabe!C71=0,$B$1,Dateneingabe!C71)","v":"zzz"},{"$f":"IF(Dateneingabe!A71=0,$B$1,Dateneingabe!A71)","v":"zzz"},{"$f":"IF(Dateneingabe!E71=0,$B$1,Dateneingabe!E71)","v":"zzz"},{"$f":"IF(Dateneingabe!F71=0,$B$1,Dateneingabe!F71)","v":"zzz"},{"$f":"IF(Dateneingabe!G71=0,$B$1,Dateneingabe!G71)","v":"zzz"},{"$f":"IF(Dateneingabe!H71=0,$B$1,Dateneingabe!H71)","v":"zzz"},{"$f":"IF(Dateneingabe!B71=0,$B$1,Dateneingabe!B71)","v":"zzz"},{"$f":"IF(Dateneingabe!I71=0,$B$1,Dateneingabe!I71)","v":"zzz"},{"$f":"IF(Dateneingabe!J71=0,$B$1,Dateneingabe!J71)","v":"zzz"},0,0,0,65]
[66,{"$f":"IF(Dateneingabe!D72=0,$B$1,Dateneingabe!D72)","v":"zzz"},{"$f":"IF(Dateneingabe!C72=0,$B$1,Dateneingabe!C72)","v":"zzz"},{"$f":"IF(Dateneingabe!A72=0,$B$1,Dateneingabe!A72)","v":"zzz"},{"$f":"IF(Dateneingabe!E72=0,$B$1,Dateneingabe!E72)","v":"zzz"},{"$f":"IF(Dateneingabe!F72=0,$B$1,Dateneingabe!F72)","v":"zzz"},{"$f":"IF(Dateneingabe!G72=0,$B$1,Dateneingabe!G72)","v":"zzz"},{"$f":"IF(Dateneingabe!H72=0,$B$1,Dateneingabe!H72)","v":"zzz"},{"$f":"IF(Dateneingabe!B72=0,$B$1,Dateneingabe!B72)","v":"zzz"},{"$f":"IF(Dateneingabe!I72=0,$B$1,Dateneingabe!I72)","v":"zzz"},{"$f":"IF(Dateneingabe!J72=0,$B$1,Dateneingabe!J72)","v":"zzz"},{"$f":"IF(D69=\"zzz\",0,IF(E69=\"zzz\",0,($H$1-E69)/365.25))","v":0},{"$f":"IF(D69=\"zzz\",0,1)","v":0},0,66]
[67,{"$f":"IF(Dateneingabe!D73=0,$B$1,Dateneingabe!D73)","v":"zzz"},{"$f":"IF(Dateneingabe!C73=0,$B$1,Dateneingabe!C73)","v":"zzz"},{"$f":"IF(Dateneingabe!A73=0,$B$1,Dateneingabe!A73)","v":"zzz"},{"$f":"IF(Dateneingabe!E73=0,$B$1,Dateneingabe!E73)","v":"zzz"},{"$f":"IF(Dateneingabe!F73=0,$B$1,Dateneingabe!F73)","v":"zzz"},{"$f":"IF(Dateneingabe!G73=0,$B$1,Dateneingabe!G73)","v":"zzz"},{"$f":"IF(Dateneingabe!H73=0,$B$1,Dateneingabe!H73)","v":"zzz"},{"$f":"IF(Dateneingabe!B73=0,$B$1,Dateneingabe!B73)","v":"zzz"},{"$f":"IF(Dateneingabe!I73=0,$B$1,Dateneingabe!I73)","v":"zzz"},{"$f":"IF(Dateneingabe!J73=0,$B$1,Dateneingabe!J73)","v":"zzz"},0,0,0,67]
[68,{"$f":"IF(Dateneingabe!D74=0,$B$1,Dateneingabe!D74)","v":"zzz"},{"$f":"IF(Dateneingabe!C74=0,$B$1,Dateneingabe!C74)","v":"zzz"},{"$f":"IF(Dateneingabe!A74=0,$B$1,Dateneingabe!A74)","v":"zzz"},{"$f":"IF(Dateneingabe!E74=0,$B$1,Dateneingabe!E74)","v":"zzz"},{"$f":"IF(Dateneingabe!F74=0,$B$1,Dateneingabe!F74)","v":"zzz"},{"$f":"IF(Dateneingabe!G74=0,$B$1,Dateneingabe!G74)","v":"zzz"},{"$f":"IF(Dateneingabe!H74=0,$B$1,Dateneingabe!H74)","v":"zzz"},{"$f":"IF(Dateneingabe!B74=0,$B$1,Dateneingabe!B74)","v":"zzz"},{"$f":"IF(Dateneingabe!I74=0,$B$1,Dateneingabe!I74)","v":"zzz"},{"$f":"IF(Dateneingabe!J74=0,$B$1,Dateneingabe!J74)","v":"zzz"},0,0,0,68]
[69,{"$f":"IF(Dateneingabe!D75=0,$B$1,Dateneingabe!D75)","v":"zzz"},{"$f":"IF(Dateneingabe!C75=0,$B$1,Dateneingabe!C75)","v":"zzz"},{"$f":"IF(Dateneingabe!A75=0,$B$1,Dateneingabe!A75)","v":"zzz"},{"$f":"IF(Dateneingabe!E75=0,$B$1,Dateneingabe!E75)","v":"zzz"},{"$f":"IF(Dateneingabe!F75=0,$B$1,Dateneingabe!F75)","v":"zzz"},{"$f":"IF(Dateneingabe!G75=0,$B$1,Dateneingabe!G75)","v":"zzz"},{"$f":"IF(Dateneingabe!H75=0,$B$1,Dateneingabe!H75)","v":"zzz"},{"$f":"IF(Dateneingabe!B75=0,$B$1,Dateneingabe!B75)","v":"zzz"},{"$f":"IF(Dateneingabe!I75=0,$B$1,Dateneingabe!I75)","v":"zzz"},{"$f":"IF(Dateneingabe!J75=0,$B$1,Dateneingabe!J75)","v":"zzz"},0,0,0,69]
[70,{"$f":"IF(Dateneingabe!D76=0,$B$1,Dateneingabe!D76)","v":"zzz"},{"$f":"IF(Dateneingabe!C76=0,$B$1,Dateneingabe!C76)","v":"zzz"},{"$f":"IF(Dateneingabe!A76=0,$B$1,Dateneingabe!A76)","v":"zzz"},{"$f":"IF(Dateneingabe!E76=0,$B$1,Dateneingabe!E76)","v":"zzz"},{"$f":"IF(Dateneingabe!F76=0,$B$1,Dateneingabe!F76)","v":"zzz"},{"$f":"IF(Dateneingabe!G76=0,$B$1,Dateneingabe!G76)","v":"zzz"},{"$f":"IF(Dateneingabe!H76=0,$B$1,Dateneingabe!H76)","v":"zzz"},{"$f":"IF(Dateneingabe!B76=0,$B$1,Dateneingabe!B76)","v":"zzz"},{"$f":"IF(Dateneingabe!I76=0,$B$1,Dateneingabe!I76)","v":"zzz"},{"$f":"IF(Dateneingabe!J76=0,$B$1,Dateneingabe!J76)","v":"zzz"},0,0,0,70]
[71,{"$f":"IF(Dateneingabe!D77=0,$B$1,Dateneingabe!D77)","v":"zzz"},{"$f":"IF(Dateneingabe!C77=0,$B$1,Dateneingabe!C77)","v":"zzz"},{"$f":"IF(Dateneingabe!A77=0,$B$1,Dateneingabe!A77)","v":"zzz"},{"$f":"IF(Dateneingabe!E77=0,$B$1,Dateneingabe!E77)","v":"zzz"},{"$f":"IF(Dateneingabe!F77=0,$B$1,Dateneingabe!F77)","v":"zzz"},{"$f":"IF(Dateneingabe!G77=0,$B$1,Dateneingabe!G77)","v":"zzz"},{"$f":"IF(Dateneingabe!H77=0,$B$1,Dateneingabe!H77)","v":"zzz"},{"$f":"IF(Dateneingabe!B77=0,$B$1,Dateneingabe!B77)","v":"zzz"},{"$f":"IF(Dateneingabe!I77=0,$B$1,Dateneingabe!I77)","v":"zzz"},{"$f":"IF(Dateneingabe!J77=0,$B$1,Dateneingabe!J77)","v":"zzz"},0,0,0,71]
[72,{"$f":"IF(Dateneingabe!D78=0,$B$1,Dateneingabe!D78)","v":"zzz"},{"$f":"IF(Dateneingabe!C78=0,$B$1,Dateneingabe!C78)","v":"zzz"},{"$f":"IF(Dateneingabe!A78=0,$B$1,Dateneingabe!A78)","v":"zzz"},{"$f":"IF(Dateneingabe!E78=0,$B$1,Dateneingabe!E78)","v":"zzz"},{"$f":"IF(Dateneingabe!F78=0,$B$1,Dateneingabe!F78)","v":"zzz"},{"$f":"IF(Dateneingabe!G78=0,$B$1,Dateneingabe!G78)","v":"zzz"},{"$f":"IF(Dateneingabe!H78=0,$B$1,Dateneingabe!H78)","v":"zzz"},{"$f":"IF(Dateneingabe!B78=0,$B$1,Dateneingabe!B78)","v":"zzz"},{"$f":"IF(Dateneingabe!I78=0,$B$1,Dateneingabe!I78)","v":"zzz"},{"$f":"IF(Dateneingabe!J78=0,$B$1,Dateneingabe!J78)","v":"zzz"},0,0,0,72]
[73,{"$f":"IF(Dateneingabe!D79=0,$B$1,Dateneingabe!D79)","v":"zzz"},{"$f":"IF(Dateneingabe!C79=0,$B$1,Dateneingabe!C79)","v":"zzz"},{"$f":"IF(Dateneingabe!A79=0,$B$1,Dateneingabe!A79)","v":"zzz"},{"$f":"IF(Dateneingabe!E79=0,$B$1,Dateneingabe!E79)","v":"zzz"},{"$f":"IF(Dateneingabe!F79=0,$B$1,Dateneingabe!F79)","v":"zzz"},{"$f":"IF(Dateneingabe!G79=0,$B$1,Dateneingabe!G79)","v":"zzz"},{"$f":"IF(Dateneingabe!H79=0,$B$1,Dateneingabe!H79)","v":"zzz"},{"$f":"IF(Dateneingabe!B79=0,$B$1,Dateneingabe!B79)","v":"zzz"},{"$f":"IF(Dateneingabe!I79=0,$B$1,Dateneingabe!I79)","v":"zzz"},{"$f":"IF(Dateneingabe!J79=0,$B$1,Dateneingabe!J79)","v":"zzz"},0,0,0,73]
[74,{"$f":"IF(Dateneingabe!D80=0,$B$1,Dateneingabe!D80)","v":"zzz"},{"$f":"IF(Dateneingabe!C80=0,$B$1,Dateneingabe!C80)","v":"zzz"},{"$f":"IF(Dateneingabe!A80=0,$B$1,Dateneingabe!A80)","v":"zzz"},{"$f":"IF(Dateneingabe!E80=0,$B$1,Dateneingabe!E80)","v":"zzz"},{"$f":"IF(Dateneingabe!F80=0,$B$1,Dateneingabe!F80)","v":"zzz"},{"$f":"IF(Dateneingabe!G80=0,$B$1,Dateneingabe!G80)","v":"zzz"},{"$f":"IF(Dateneingabe!H80=0,$B$1,Dateneingabe!H80)","v":"zzz"},{"$f":"IF(Dateneingabe!B80=0,$B$1,Dateneingabe!B80)","v":"zzz"},{"$f":"IF(Dateneingabe!I80=0,$B$1,Dateneingabe!I80)","v":"zzz"},{"$f":"IF(Dateneingabe!J80=0,$B$1,Dateneingabe!J80)","v":"zzz"},0,0,0,74]
[75,{"$f":"IF(Dateneingabe!D81=0,$B$1,Dateneingabe!D81)","v":"zzz"},{"$f":"IF(Dateneingabe!C81=0,$B$1,Dateneingabe!C81)","v":"zzz"},{"$f":"IF(Dateneingabe!A81=0,$B$1,Dateneingabe!A81)","v":"zzz"},{"$f":"IF(Dateneingabe!E81=0,$B$1,Dateneingabe!E81)","v":"zzz"},{"$f":"IF(Dateneingabe!F81=0,$B$1,Dateneingabe!F81)","v":"zzz"},{"$f":"IF(Dateneingabe!G81=0,$B$1,Dateneingabe!G81)","v":"zzz"},{"$f":"IF(Dateneingabe!H81=0,$B$1,Dateneingabe!H81)","v":"zzz"},{"$f":"IF(Dateneingabe!B81=0,$B$1,Dateneingabe!B81)","v":"zzz"},{"$f":"IF(Dateneingabe!I81=0,$B$1,Dateneingabe!I81)","v":"zzz"},{"$f":"IF(Dateneingabe!J81=0,$B$1,Dateneingabe!J81)","v":"zzz"},0,0,0,75]
[76,{"$f":"IF(Dateneingabe!D82=0,$B$1,Dateneingabe!D82)","v":"zzz"},{"$f":"IF(Dateneingabe!C82=0,$B$1,Dateneingabe!C82)","v":"zzz"},{"$f":"IF(Dateneingabe!A82=0,$B$1,Dateneingabe!A82)","v":"zzz"},{"$f":"IF(Dateneingabe!E82=0,$B$1,Dateneingabe!E82)","v":"zzz"},{"$f":"IF(Dateneingabe!F82=0,$B$1,Dateneingabe!F82)","v":"zzz"},{"$f":"IF(Dateneingabe!G82=0,$B$1,Dateneingabe!G82)","v":"zzz"},{"$f":"IF(Dateneingabe!H82=0,$B$1,Dateneingabe!H82)","v":"zzz"},{"$f":"IF(Dateneingabe!B82=0,$B$1,Dateneingabe!B82)","v":"zzz"},{"$f":"IF(Dateneingabe!I82=0,$B$1,Dateneingabe!I82)","v":"zzz"},{"$f":"IF(Dateneingabe!J82=0,$B$1,Dateneingabe!J82)","v":"zzz"},0,0,0,76]
[77,{"$f":"IF(Dateneingabe!D83=0,$B$1,Dateneingabe!D83)","v":"zzz"},{"$f":"IF(Dateneingabe!C83=0,$B$1,Dateneingabe!C83)","v":"zzz"},{"$f":"IF(Dateneingabe!A83=0,$B$1,Dateneingabe!A83)","v":"zzz"},{"$f":"IF(Dateneingabe!E83=0,$B$1,Dateneingabe!E83)","v":"zzz"},{"$f":"IF(Dateneingabe!F83=0,$B$1,Dateneingabe!F83)","v":"zzz"},{"$f":"IF(Dateneingabe!G83=0,$B$1,Dateneingabe!G83)","v":"zzz"},{"$f":"IF(Dateneingabe!H83=0,$B$1,Dateneingabe!H83)","v":"zzz"},{"$f":"IF(Dateneingabe!B83=0,$B$1,Dateneingabe!B83)","v":"zzz"},{"$f":"IF(Dateneingabe!I83=0,$B$1,Dateneingabe!I83)","v":"zzz"},{"$f":"IF(Dateneingabe!J83=0,$B$1,Dateneingabe!J83)","v":"zzz"},0,0,0,77]
[78,{"$f":"IF(Dateneingabe!D84=0,$B$1,Dateneingabe!D84)","v":"zzz"},{"$f":"IF(Dateneingabe!C84=0,$B$1,Dateneingabe!C84)","v":"zzz"},{"$f":"IF(Dateneingabe!A84=0,$B$1,Dateneingabe!A84)","v":"zzz"},{"$f":"IF(Dateneingabe!E84=0,$B$1,Dateneingabe!E84)","v":"zzz"},{"$f":"IF(Dateneingabe!F84=0,$B$1,Dateneingabe!F84)","v":"zzz"},{"$f":"IF(Dateneingabe!G84=0,$B$1,Dateneingabe!G84)","v":"zzz"},{"$f":"IF(Dateneingabe!H84=0,$B$1,Dateneingabe!H84)","v":"zzz"},{"$f":"IF(Dateneingabe!B84=0,$B$1,Dateneingabe!B84)","v":"zzz"},{"$f":"IF(Dateneingabe!I84=0,$B$1,Dateneingabe!I84)","v":"zzz"},{"$f":"IF(Dateneingabe!J84=0,$B$1,Dateneingabe!J84)","v":"zzz"},0,0,0,78]
[79,{"$f":"IF(Dateneingabe!D85=0,$B$1,Dateneingabe!D85)","v":"zzz"},{"$f":"IF(Dateneingabe!C85=0,$B$1,Dateneingabe!C85)","v":"zzz"},{"$f":"IF(Dateneingabe!A85=0,$B$1,Dateneingabe!A85)","v":"zzz"},{"$f":"IF(Dateneingabe!E85=0,$B$1,Dateneingabe!E85)","v":"zzz"},{"$f":"IF(Dateneingabe!F85=0,$B$1,Dateneingabe!F85)","v":"zzz"},{"$f":"IF(Dateneingabe!G85=0,$B$1,Dateneingabe!G85)","v":"zzz"},{"$f":"IF(Dateneingabe!H85=0,$B$1,Dateneingabe!H85)","v":"zzz"},{"$f":"IF(Dateneingabe!B85=0,$B$1,Dateneingabe!B85)","v":"zzz"},{"$f":"IF(Dateneingabe!I85=0,$B$1,Dateneingabe!I85)","v":"zzz"},{"$f":"IF(Dateneingabe!J85=0,$B$1,Dateneingabe!J85)","v":"zzz"},0,0,0,79]
[80,{"$f":"IF(Dateneingabe!D86=0,$B$1,Dateneingabe!D86)","v":"zzz"},{"$f":"IF(Dateneingabe!C86=0,$B$1,Dateneingabe!C86)","v":"zzz"},{"$f":"IF(Dateneingabe!A86=0,$B$1,Dateneingabe!A86)","v":"zzz"},{"$f":"IF(Dateneingabe!E86=0,$B$1,Dateneingabe!E86)","v":"zzz"},{"$f":"IF(Dateneingabe!F86=0,$B$1,Dateneingabe!F86)","v":"zzz"},{"$f":"IF(Dateneingabe!G86=0,$B$1,Dateneingabe!G86)","v":"zzz"},{"$f":"IF(Dateneingabe!H86=0,$B$1,Dateneingabe!H86)","v":"zzz"},{"$f":"IF(Dateneingabe!B86=0,$B$1,Dateneingabe!B86)","v":"zzz"},{"$f":"IF(Dateneingabe!I86=0,$B$1,Dateneingabe!I86)","v":"zzz"},{"$f":"IF(Dateneingabe!J86=0,$B$1,Dateneingabe!J86)","v":"zzz"},0,0,0,80]
[81,{"$f":"IF(Dateneingabe!D87=0,$B$1,Dateneingabe!D87)","v":"zzz"},{"$f":"IF(Dateneingabe!C87=0,$B$1,Dateneingabe!C87)","v":"zzz"},{"$f":"IF(Dateneingabe!A87=0,$B$1,Dateneingabe!A87)","v":"zzz"},{"$f":"IF(Dateneingabe!E87=0,$B$1,Dateneingabe!E87)","v":"zzz"},{"$f":"IF(Dateneingabe!F87=0,$B$1,Dateneingabe!F87)","v":"zzz"},{"$f":"IF(Dateneingabe!G87=0,$B$1,Dateneingabe!G87)","v":"zzz"},{"$f":"IF(Dateneingabe!H87=0,$B$1,Dateneingabe!H87)","v":"zzz"},{"$f":"IF(Dateneingabe!B87=0,$B$1,Dateneingabe!B87)","v":"zzz"},{"$f":"IF(Dateneingabe!I87=0,$B$1,Dateneingabe!I87)","v":"zzz"},{"$f":"IF(Dateneingabe!J87=0,$B$1,Dateneingabe!J87)","v":"zzz"},0,0,0,81]
[82,{"$f":"IF(Dateneingabe!D88=0,$B$1,Dateneingabe!D88)","v":"zzz"},{"$f":"IF(Dateneingabe!C88=0,$B$1,Dateneingabe!C88)","v":"zzz"},{"$f":"IF(Dateneingabe!A88=0,$B$1,Dateneingabe!A88)","v":"zzz"},{"$f":"IF(Dateneingabe!E88=0,$B$1,Dateneingabe!E88)","v":"zzz"},{"$f":"IF(Dateneingabe!F88=0,$B$1,Dateneingabe!F88)","v":"zzz"},{"$f":"IF(Dateneingabe!G88=0,$B$1,Dateneingabe!G88)","v":"zzz"},{"$f":"IF(Dateneingabe!H88=0,$B$1,Dateneingabe!H88)","v":"zzz"},{"$f":"IF(Dateneingabe!B88=0,$B$1,Dateneingabe!B88)","v":"zzz"},{"$f":"IF(Dateneingabe!I88=0,$B$1,Dateneingabe!I88)","v":"zzz"},{"$f":"IF(Dateneingabe!J88=0,$B$1,Dateneingabe!J88)","v":"zzz"},0,0,0,82]
[83,{"$f":"IF(Dateneingabe!D89=0,$B$1,Dateneingabe!D89)","v":"zzz"},{"$f":"IF(Dateneingabe!C89=0,$B$1,Dateneingabe!C89)","v":"zzz"},{"$f":"IF(Dateneingabe!A89=0,$B$1,Dateneingabe!A89)","v":"zzz"},{"$f":"IF(Dateneingabe!E89=0,$B$1,Dateneingabe!E89)","v":"zzz"},{"$f":"IF(Dateneingabe!F89=0,$B$1,Dateneingabe!F89)","v":"zzz"},{"$f":"IF(Dateneingabe!G89=0,$B$1,Dateneingabe!G89)","v":"zzz"},{"$f":"IF(Dateneingabe!H89=0,$B$1,Dateneingabe!H89)","v":"zzz"},{"$f":"IF(Dateneingabe!B89=0,$B$1,Dateneingabe!B89)","v":"zzz"},{"$f":"IF(Dateneingabe!I89=0,$B$1,Dateneingabe!I89)","v":"zzz"},{"$f":"IF(Dateneingabe!J89=0,$B$1,Dateneingabe!J89)","v":"zzz"},0,0,0,83]
[84,{"$f":"IF(Dateneingabe!D90=0,$B$1,Dateneingabe!D90)","v":"zzz"},{"$f":"IF(Dateneingabe!C90=0,$B$1,Dateneingabe!C90)","v":"zzz"},{"$f":"IF(Dateneingabe!A90=0,$B$1,Dateneingabe!A90)","v":"zzz"},{"$f":"IF(Dateneingabe!E90=0,$B$1,Dateneingabe!E90)","v":"zzz"},{"$f":"IF(Dateneingabe!F90=0,$B$1,Dateneingabe!F90)","v":"zzz"},{"$f":"IF(Dateneingabe!G90=0,$B$1,Dateneingabe!G90)","v":"zzz"},{"$f":"IF(Dateneingabe!H90=0,$B$1,Dateneingabe!H90)","v":"zzz"},{"$f":"IF(Dateneingabe!B90=0,$B$1,Dateneingabe!B90)","v":"zzz"},{"$f":"IF(Dateneingabe!I90=0,$B$1,Dateneingabe!I90)","v":"zzz"},{"$f":"IF(Dateneingabe!J90=0,$B$1,Dateneingabe!J90)","v":"zzz"},0,0,0,84]
[85,{"$f":"IF(Dateneingabe!D91=0,$B$1,Dateneingabe!D91)","v":"zzz"},{"$f":"IF(Dateneingabe!C91=0,$B$1,Dateneingabe!C91)","v":"zzz"},{"$f":"IF(Dateneingabe!A91=0,$B$1,Dateneingabe!A91)","v":"zzz"},{"$f":"IF(Dateneingabe!E91=0,$B$1,Dateneingabe!E91)","v":"zzz"},{"$f":"IF(Dateneingabe!F91=0,$B$1,Dateneingabe!F91)","v":"zzz"},{"$f":"IF(Dateneingabe!G91=0,$B$1,Dateneingabe!G91)","v":"zzz"},{"$f":"IF(Dateneingabe!H91=0,$B$1,Dateneingabe!H91)","v":"zzz"},{"$f":"IF(Dateneingabe!B91=0,$B$1,Dateneingabe!B91)","v":"zzz"},{"$f":"IF(Dateneingabe!I91=0,$B$1,Dateneingabe!I91)","v":"zzz"},{"$f":"IF(Dateneingabe!J91=0,$B$1,Dateneingabe!J91)","v":"zzz"},0,0,0,85]
[86,{"$f":"IF(Dateneingabe!D92=0,$B$1,Dateneingabe!D92)","v":"zzz"},{"$f":"IF(Dateneingabe!C92=0,$B$1,Dateneingabe!C92)","v":"zzz"},{"$f":"IF(Dateneingabe!A92=0,$B$1,Dateneingabe!A92)","v":"zzz"},{"$f":"IF(Dateneingabe!E92=0,$B$1,Dateneingabe!E92)","v":"zzz"},{"$f":"IF(Dateneingabe!F92=0,$B$1,Dateneingabe!F92)","v":"zzz"},{"$f":"IF(Dateneingabe!G92=0,$B$1,Dateneingabe!G92)","v":"zzz"},{"$f":"IF(Dateneingabe!H92=0,$B$1,Dateneingabe!H92)","v":"zzz"},{"$f":"IF(Dateneingabe!B92=0,$B$1,Dateneingabe!B92)","v":"zzz"},{"$f":"IF(Dateneingabe!I92=0,$B$1,Dateneingabe!I92)","v":"zzz"},{"$f":"IF(Dateneingabe!J92=0,$B$1,Dateneingabe!J92)","v":"zzz"},0,0,0,86]
[87,{"$f":"IF(Dateneingabe!D93=0,$B$1,Dateneingabe!D93)","v":"zzz"},{"$f":"IF(Dateneingabe!C93=0,$B$1,Dateneingabe!C93)","v":"zzz"},{"$f":"IF(Dateneingabe!A93=0,$B$1,Dateneingabe!A93)","v":"zzz"},{"$f":"IF(Dateneingabe!E93=0,$B$1,Dateneingabe!E93)","v":"zzz"},{"$f":"IF(Dateneingabe!F93=0,$B$1,Dateneingabe!F93)","v":"zzz"},{"$f":"IF(Dateneingabe!G93=0,$B$1,Dateneingabe!G93)","v":"zzz"},{"$f":"IF(Dateneingabe!H93=0,$B$1,Dateneingabe!H93)","v":"zzz"},{"$f":"IF(Dateneingabe!B93=0,$B$1,Dateneingabe!B93)","v":"zzz"},{"$f":"IF(Dateneingabe!I93=0,$B$1,Dateneingabe!I93)","v":"zzz"},{"$f":"IF(Dateneingabe!J93=0,$B$1,Dateneingabe!J93)","v":"zzz"},0,0,0,87]
[88,{"$f":"IF(Dateneingabe!D94=0,$B$1,Dateneingabe!D94)","v":"zzz"},{"$f":"IF(Dateneingabe!C94=0,$B$1,Dateneingabe!C94)","v":"zzz"},{"$f":"IF(Dateneingabe!A94=0,$B$1,Dateneingabe!A94)","v":"zzz"},{"$f":"IF(Dateneingabe!E94=0,$B$1,Dateneingabe!E94)","v":"zzz"},{"$f":"IF(Dateneingabe!F94=0,$B$1,Dateneingabe!F94)","v":"zzz"},{"$f":"IF(Dateneingabe!G94=0,$B$1,Dateneingabe!G94)","v":"zzz"},{"$f":"IF(Dateneingabe!H94=0,$B$1,Dateneingabe!H94)","v":"zzz"},{"$f":"IF(Dateneingabe!B94=0,$B$1,Dateneingabe!B94)","v":"zzz"},{"$f":"IF(Dateneingabe!I94=0,$B$1,Dateneingabe!I94)","v":"zzz"},{"$f":"IF(Dateneingabe!J94=0,$B$1,Dateneingabe!J94)","v":"zzz"},0,0,0,88]
[89,{"$f":"IF(Dateneingabe!D95=0,$B$1,Dateneingabe!D95)","v":"zzz"},{"$f":"IF(Dateneingabe!C95=0,$B$1,Dateneingabe!C95)","v":"zzz"},{"$f":"IF(Dateneingabe!A95=0,$B$1,Dateneingabe!A95)","v":"zzz"},{"$f":"IF(Dateneingabe!E95=0,$B$1,Dateneingabe!E95)","v":"zzz"},{"$f":"IF(Dateneingabe!F95=0,$B$1,Dateneingabe!F95)","v":"zzz"},{"$f":"IF(Dateneingabe!G95=0,$B$1,Dateneingabe!G95)","v":"zzz"},{"$f":"IF(Dateneingabe!H95=0,$B$1,Dateneingabe!H95)","v":"zzz"},{"$f":"IF(Dateneingabe!B95=0,$B$1,Dateneingabe!B95)","v":"zzz"},{"$f":"IF(Dateneingabe!I95=0,$B$1,Dateneingabe!I95)","v":"zzz"},{"$f":"IF(Dateneingabe!J95=0,$B$1,Dateneingabe!J95)","v":"zzz"},0,0,0,89]
[90,{"$f":"IF(Dateneingabe!D96=0,$B$1,Dateneingabe!D96)","v":"zzz"},{"$f":"IF(Dateneingabe!C96=0,$B$1,Dateneingabe!C96)","v":"zzz"},{"$f":"IF(Dateneingabe!A96=0,$B$1,Dateneingabe!A96)","v":"zzz"},{"$f":"IF(Dateneingabe!E96=0,$B$1,Dateneingabe!E96)","v":"zzz"},{"$f":"IF(Dateneingabe!F96=0,$B$1,Dateneingabe!F96)","v":"zzz"},{"$f":"IF(Dateneingabe!G96=0,$B$1,Dateneingabe!G96)","v":"zzz"},{"$f":"IF(Dateneingabe!H96=0,$B$1,Dateneingabe!H96)","v":"zzz"},{"$f":"IF(Dateneingabe!B96=0,$B$1,Dateneingabe!B96)","v":"zzz"},{"$f":"IF(Dateneingabe!I96=0,$B$1,Dateneingabe!I96)","v":"zzz"},{"$f":"IF(Dateneingabe!J96=0,$B$1,Dateneingabe!J96)","v":"zzz"},0,0,0,90]
[91,{"$f":"IF(Dateneingabe!D97=0,$B$1,Dateneingabe!D97)","v":"zzz"},{"$f":"IF(Dateneingabe!C97=0,$B$1,Dateneingabe!C97)","v":"zzz"},{"$f":"IF(Dateneingabe!A97=0,$B$1,Dateneingabe!A97)","v":"zzz"},{"$f":"IF(Dateneingabe!E97=0,$B$1,Dateneingabe!E97)","v":"zzz"},{"$f":"IF(Dateneingabe!F97=0,$B$1,Dateneingabe!F97)","v":"zzz"},{"$f":"IF(Dateneingabe!G97=0,$B$1,Dateneingabe!G97)","v":"zzz"},{"$f":"IF(Dateneingabe!H97=0,$B$1,Dateneingabe!H97)","v":"zzz"},{"$f":"IF(Dateneingabe!B97=0,$B$1,Dateneingabe!B97)","v":"zzz"},{"$f":"IF(Dateneingabe!I97=0,$B$1,Dateneingabe!I97)","v":"zzz"},{"$f":"IF(Dateneingabe!J97=0,$B$1,Dateneingabe!J97)","v":"zzz"},0,0,0,91]
[92,{"$f":"IF(Dateneingabe!D98=0,$B$1,Dateneingabe!D98)","v":"zzz"},{"$f":"IF(Dateneingabe!C98=0,$B$1,Dateneingabe!C98)","v":"zzz"},{"$f":"IF(Dateneingabe!A98=0,$B$1,Dateneingabe!A98)","v":"zzz"},{"$f":"IF(Dateneingabe!E98=0,$B$1,Dateneingabe!E98)","v":"zzz"},{"$f":"IF(Dateneingabe!F98=0,$B$1,Dateneingabe!F98)","v":"zzz"},{"$f":"IF(Dateneingabe!G98=0,$B$1,Dateneingabe!G98)","v":"zzz"},{"$f":"IF(Dateneingabe!H98=0,$B$1,Dateneingabe!H98)","v":"zzz"},{"$f":"IF(Dateneingabe!B98=0,$B$1,Dateneingabe!B98)","v":"zzz"},{"$f":"IF(Dateneingabe!I98=0,$B$1,Dateneingabe!I98)","v":"zzz"},{"$f":"IF(Dateneingabe!J98=0,$B$1,Dateneingabe!J98)","v":"zzz"},0,0,0,92]
[93,{"$f":"IF(Dateneingabe!D99=0,$B$1,Dateneingabe!D99)","v":"zzz"},{"$f":"IF(Dateneingabe!C99=0,$B$1,Dateneingabe!C99)","v":"zzz"},{"$f":"IF(Dateneingabe!A99=0,$B$1,Dateneingabe!A99)","v":"zzz"},{"$f":"IF(Dateneingabe!E99=0,$B$1,Dateneingabe!E99)","v":"zzz"},{"$f":"IF(Dateneingabe!F99=0,$B$1,Dateneingabe!F99)","v":"zzz"},{"$f":"IF(Dateneingabe!G99=0,$B$1,Dateneingabe!G99)","v":"zzz"},{"$f":"IF(Dateneingabe!H99=0,$B$1,Dateneingabe!H99)","v":"zzz"},{"$f":"IF(Dateneingabe!B99=0,$B$1,Dateneingabe!B99)","v":"zzz"},{"$f":"IF(Dateneingabe!I99=0,$B$1,Dateneingabe!I99)","v":"zzz"},{"$f":"IF(Dateneingabe!J99=0,$B$1,Dateneingabe!J99)","v":"zzz"},0,0,0,93]
[94,{"$f":"IF(Dateneingabe!D100=0,$B$1,Dateneingabe!D100)","v":"zzz"},{"$f":"IF(Dateneingabe!C100=0,$B$1,Dateneingabe!C100)","v":"zzz"},{"$f":"IF(Dateneingabe!A100=0,$B$1,Dateneingabe!A100)","v":"zzz"},{"$f":"IF(Dateneingabe!E100=0,$B$1,Dateneingabe!E100)","v":"zzz"},{"$f":"IF(Dateneingabe!F100=0,$B$1,Dateneingabe!F100)","v":"zzz"},{"$f":"IF(Dateneingabe!G100=0,$B$1,Dateneingabe!G100)","v":"zzz"},{"$f":"IF(Dateneingabe!H100=0,$B$1,Dateneingabe!H100)","v":"zzz"},{"$f":"IF(Dateneingabe!B100=0,$B$1,Dateneingabe!B100)","v":"zzz"},{"$f":"IF(Dateneingabe!I100=0,$B$1,Dateneingabe!I100)","v":"zzz"},{"$f":"IF(Dateneingabe!J100=0,$B$1,Dateneingabe!J100)","v":"zzz"},0,0,0,94]
[95,{"$f":"IF(Dateneingabe!D101=0,$B$1,Dateneingabe!D101)","v":"zzz"},{"$f":"IF(Dateneingabe!C101=0,$B$1,Dateneingabe!C101)","v":"zzz"},{"$f":"IF(Dateneingabe!A101=0,$B$1,Dateneingabe!A101)","v":"zzz"},{"$f":"IF(Dateneingabe!E101=0,$B$1,Dateneingabe!E101)","v":"zzz"},{"$f":"IF(Dateneingabe!F101=0,$B$1,Dateneingabe!F101)","v":"zzz"},{"$f":"IF(Dateneingabe!G101=0,$B$1,Dateneingabe!G101)","v":"zzz"},{"$f":"IF(Dateneingabe!H101=0,$B$1,Dateneingabe!H101)","v":"zzz"},{"$f":"IF(Dateneingabe!B101=0,$B$1,Dateneingabe!B101)","v":"zzz"},{"$f":"IF(Dateneingabe!I101=0,$B$1,Dateneingabe!I101)","v":"zzz"},{"$f":"IF(Dateneingabe!J101=0,$B$1,Dateneingabe!J101)","v":"zzz"},0,0,0,95]
[96,{"$f":"IF(Dateneingabe!D102=0,$B$1,Dateneingabe!D102)","v":"zzz"},{"$f":"IF(Dateneingabe!C102=0,$B$1,Dateneingabe!C102)","v":"zzz"},{"$f":"IF(Dateneingabe!A102=0,$B$1,Dateneingabe!A102)","v":"zzz"},{"$f":"IF(Dateneingabe!E102=0,$B$1,Dateneingabe!E102)","v":"zzz"},{"$f":"IF(Dateneingabe!F102=0,$B$1,Dateneingabe!F102)","v":"zzz"},{"$f":"IF(Dateneingabe!G102=0,$B$1,Dateneingabe!G102)","v":"zzz"},{"$f":"IF(Dateneingabe!H102=0,$B$1,Dateneingabe!H102)","v":"zzz"},{"$f":"IF(Dateneingabe!B102=0,$B$1,Dateneingabe!B102)","v":"zzz"},{"$f":"IF(Dateneingabe!I102=0,$B$1,Dateneingabe!I102)","v":"zzz"},{"$f":"IF(Dateneingabe!J102=0,$B$1,Dateneingabe!J102)","v":"zzz"},0,0,0,96]
[97,{"$f":"IF(Dateneingabe!D103=0,$B$1,Dateneingabe!D103)","v":"zzz"},{"$f":"IF(Dateneingabe!C103=0,$B$1,Dateneingabe!C103)","v":"zzz"},{"$f":"IF(Dateneingabe!A103=0,$B$1,Dateneingabe!A103)","v":"zzz"},{"$f":"IF(Dateneingabe!E103=0,$B$1,Dateneingabe!E103)","v":"zzz"},{"$f":"IF(Dateneingabe!F103=0,$B$1,Dateneingabe!F103)","v":"zzz"},{"$f":"IF(Dateneingabe!G103=0,$B$1,Dateneingabe!G103)","v":"zzz"},{"$f":"IF(Dateneingabe!H103=0,$B$1,Dateneingabe!H103)","v":"zzz"},{"$f":"IF(Dateneingabe!B103=0,$B$1,Dateneingabe!B103)","v":"zzz"},{"$f":"IF(Dateneingabe!I103=0,$B$1,Dateneingabe!I103)","v":"zzz"},{"$f":"IF(Dateneingabe!J103=0,$B$1,Dateneingabe!J103)","v":"zzz"},0,0,0,97]
[98,{"$f":"IF(Dateneingabe!D104=0,$B$1,Dateneingabe!D104)","v":"zzz"},{"$f":"IF(Dateneingabe!C104=0,$B$1,Dateneingabe!C104)","v":"zzz"},{"$f":"IF(Dateneingabe!A104=0,$B$1,Dateneingabe!A104)","v":"zzz"},{"$f":"IF(Dateneingabe!E104=0,$B$1,Dateneingabe!E104)","v":"zzz"},{"$f":"IF(Dateneingabe!F104=0,$B$1,Dateneingabe!F104)","v":"zzz"},{"$f":"IF(Dateneingabe!G104=0,$B$1,Dateneingabe!G104)","v":"zzz"},{"$f":"IF(Dateneingabe!H104=0,$B$1,Dateneingabe!H104)","v":"zzz"},{"$f":"IF(Dateneingabe!B104=0,$B$1,Dateneingabe!B104)","v":"zzz"},{"$f":"IF(Dateneingabe!I104=0,$B$1,Dateneingabe!I104)","v":"zzz"},{"$f":"IF(Dateneingabe!J104=0,$B$1,Dateneingabe!J104)","v":"zzz"},0,0,0,98]
[99,{"$f":"IF(Dateneingabe!D105=0,$B$1,Dateneingabe!D105)","v":"zzz"},{"$f":"IF(Dateneingabe!C105=0,$B$1,Dateneingabe!C105)","v":"zzz"},{"$f":"IF(Dateneingabe!A105=0,$B$1,Dateneingabe!A105)","v":"zzz"},{"$f":"IF(Dateneingabe!E105=0,$B$1,Dateneingabe!E105)","v":"zzz"},{"$f":"IF(Dateneingabe!F105=0,$B$1,Dateneingabe!F105)","v":"zzz"},{"$f":"IF(Dateneingabe!G105=0,$B$1,Dateneingabe!G105)","v":"zzz"},{"$f":"IF(Dateneingabe!H105=0,$B$1,Dateneingabe!H105)","v":"zzz"},{"$f":"IF(Dateneingabe!B105=0,$B$1,Dateneingabe!B105)","v":"zzz"},{"$f":"IF(Dateneingabe!I105=0,$B$1,Dateneingabe!I105)","v":"zzz"},{"$f":"IF(Dateneingabe!J105=0,$B$1,Dateneingabe!J105)","v":"zzz"},0,0,0,99]
[100,{"$f":"IF(Dateneingabe!D106=0,$B$1,Dateneingabe!D106)","v":"zzz"},{"$f":"IF(Dateneingabe!C106=0,$B$1,Dateneingabe!C106)","v":"zzz"},{"$f":"IF(Dateneingabe!A106=0,$B$1,Dateneingabe!A106)","v":"zzz"},{"$f":"IF(Dateneingabe!E106=0,$B$1,Dateneingabe!E106)","v":"zzz"},{"$f":"IF(Dateneingabe!F106=0,$B$1,Dateneingabe!F106)","v":"zzz"},{"$f":"IF(Dateneingabe!G106=0,$B$1,Dateneingabe!G106)","v":"zzz"},{"$f":"IF(Dateneingabe!H106=0,$B$1,Dateneingabe!H106)","v":"zzz"},{"$f":"IF(Dateneingabe!B106=0,$B$1,Dateneingabe!B106)","v":"zzz"},{"$f":"IF(Dateneingabe!I106=0,$B$1,Dateneingabe!I106)","v":"zzz"},{"$f":"IF(Dateneingabe!J106=0,$B$1,Dateneingabe!J106)","v":"zzz"},0,0,0,100]
[101,{"$f":"IF(Dateneingabe!D107=0,$B$1,Dateneingabe!D107)","v":"zzz"},{"$f":"IF(Dateneingabe!C107=0,$B$1,Dateneingabe!C107)","v":"zzz"},{"$f":"IF(Dateneingabe!A107=0,$B$1,Dateneingabe!A107)","v":"zzz"},{"$f":"IF(Dateneingabe!E107=0,$B$1,Dateneingabe!E107)","v":"zzz"},{"$f":"IF(Dateneingabe!F107=0,$B$1,Dateneingabe!F107)","v":"zzz"},{"$f":"IF(Dateneingabe!G107=0,$B$1,Dateneingabe!G107)","v":"zzz"},{"$f":"IF(Dateneingabe!H107=0,$B$1,Dateneingabe!H107)","v":"zzz"},{"$f":"IF(Dateneingabe!B107=0,$B$1,Dateneingabe!B107)","v":"zzz"},{"$f":"IF(Dateneingabe!I107=0,$B$1,Dateneingabe!I107)","v":"zzz"},{"$f":"IF(Dateneingabe!J107=0,$B$1,Dateneingabe!J107)","v":"zzz"},{"$f":"IF(D104=\"zzz\",0,IF(E104=\"zzz\",0,($H$1-E104)/365.25))","v":0},{"$f":"IF(D104=\"zzz\",0,1)","v":0},{"$f":"IF(E104=\"zzz\",0,1)","v":0},101]
[102,{"$f":"IF(Dateneingabe!D108=0,$B$1,Dateneingabe!D108)","v":"zzz"},{"$f":"IF(Dateneingabe!C108=0,$B$1,Dateneingabe!C108)","v":"zzz"},{"$f":"IF(Dateneingabe!A108=0,$B$1,Dateneingabe!A108)","v":"zzz"},{"$f":"IF(Dateneingabe!E108=0,$B$1,Dateneingabe!E108)","v":"zzz"},{"$f":"IF(Dateneingabe!F108=0,$B$1,Dateneingabe!F108)","v":"zzz"},{"$f":"IF(Dateneingabe!G108=0,$B$1,Dateneingabe!G108)","v":"zzz"},{"$f":"IF(Dateneingabe!H108=0,$B$1,Dateneingabe!H108)","v":"zzz"},{"$f":"IF(Dateneingabe!B108=0,$B$1,Dateneingabe!B108)","v":"zzz"},{"$f":"IF(Dateneingabe!I108=0,$B$1,Dateneingabe!I108)","v":"zzz"},{"$f":"IF(Dateneingabe!J108=0,$B$1,Dateneingabe!J108)","v":"zzz"},0,0,0,102]
[103,{"$f":"IF(Dateneingabe!D109=0,$B$1,Dateneingabe!D109)","v":"zzz"},{"$f":"IF(Dateneingabe!C109=0,$B$1,Dateneingabe!C109)","v":"zzz"},{"$f":"IF(Dateneingabe!A109=0,$B$1,Dateneingabe!A109)","v":"zzz"},{"$f":"IF(Dateneingabe!E109=0,$B$1,Dateneingabe!E109)","v":"zzz"},{"$f":"IF(Dateneingabe!F109=0,$B$1,Dateneingabe!F109)","v":"zzz"},{"$f":"IF(Dateneingabe!G109=0,$B$1,Dateneingabe!G109)","v":"zzz"},{"$f":"IF(Dateneingabe!H109=0,$B$1,Dateneingabe!H109)","v":"zzz"},{"$f":"IF(Dateneingabe!B109=0,$B$1,Dateneingabe!B109)","v":"zzz"},{"$f":"IF(Dateneingabe!I109=0,$B$1,Dateneingabe!I109)","v":"zzz"},{"$f":"IF(Dateneingabe!J109=0,$B$1,Dateneingabe!J109)","v":"zzz"},0,0,0,103]
[104,{"$f":"IF(Dateneingabe!D110=0,$B$1,Dateneingabe!D110)","v":"zzz"},{"$f":"IF(Dateneingabe!C110=0,$B$1,Dateneingabe!C110)","v":"zzz"},{"$f":"IF(Dateneingabe!A110=0,$B$1,Dateneingabe!A110)","v":"zzz"},{"$f":"IF(Dateneingabe!E110=0,$B$1,Dateneingabe!E110)","v":"zzz"},{"$f":"IF(Dateneingabe!F110=0,$B$1,Dateneingabe!F110)","v":"zzz"},{"$f":"IF(Dateneingabe!G110=0,$B$1,Dateneingabe!G110)","v":"zzz"},{"$f":"IF(Dateneingabe!H110=0,$B$1,Dateneingabe!H110)","v":"zzz"},{"$f":"IF(Dateneingabe!B110=0,$B$1,Dateneingabe!B110)","v":"zzz"},{"$f":"IF(Dateneingabe!I110=0,$B$1,Dateneingabe!I110)","v":"zzz"},{"$f":"IF(Dateneingabe!J110=0,$B$1,Dateneingabe!J110)","v":"zzz"},0,0,0,104]
[105,{"$f":"IF(Dateneingabe!D111=0,$B$1,Dateneingabe!D111)","v":"zzz"},{"$f":"IF(Dateneingabe!C111=0,$B$1,Dateneingabe!C111)","v":"zzz"},{"$f":"IF(Dateneingabe!A111=0,$B$1,Dateneingabe!A111)","v":"zzz"},{"$f":"IF(Dateneingabe!E111=0,$B$1,Dateneingabe!E111)","v":"zzz"},{"$f":"IF(Dateneingabe!F111=0,$B$1,Dateneingabe!F111)","v":"zzz"},{"$f":"IF(Dateneingabe!G111=0,$B$1,Dateneingabe!G111)","v":"zzz"},{"$f":"IF(Dateneingabe!H111=0,$B$1,Dateneingabe!H111)","v":"zzz"},{"$f":"IF(Dateneingabe!B111=0,$B$1,Dateneingabe!B111)","v":"zzz"},{"$f":"IF(Dateneingabe!I111=0,$B$1,Dateneingabe!I111)","v":"zzz"},{"$f":"IF(Dateneingabe!J111=0,$B$1,Dateneingabe!J111)","v":"zzz"},0,0,0,105]
[106,{"$f":"IF(Dateneingabe!D112=0,$B$1,Dateneingabe!D112)","v":"zzz"},{"$f":"IF(Dateneingabe!C112=0,$B$1,Dateneingabe!C112)","v":"zzz"},{"$f":"IF(Dateneingabe!A112=0,$B$1,Dateneingabe!A112)","v":"zzz"},{"$f":"IF(Dateneingabe!E112=0,$B$1,Dateneingabe!E112)","v":"zzz"},{"$f":"IF(Dateneingabe!F112=0,$B$1,Dateneingabe!F112)","v":"zzz"},{"$f":"IF(Dateneingabe!G112=0,$B$1,Dateneingabe!G112)","v":"zzz"},{"$f":"IF(Dateneingabe!H112=0,$B$1,Dateneingabe!H112)","v":"zzz"},{"$f":"IF(Dateneingabe!B112=0,$B$1,Dateneingabe!B112)","v":"zzz"},{"$f":"IF(Dateneingabe!I112=0,$B$1,Dateneingabe!I112)","v":"zzz"},{"$f":"IF(Dateneingabe!J112=0,$B$1,Dateneingabe!J112)","v":"zzz"},0,0,0,106]
[107,{"$f":"IF(Dateneingabe!D113=0,$B$1,Dateneingabe!D113)","v":"zzz"},{"$f":"IF(Dateneingabe!C113=0,$B$1,Dateneingabe!C113)","v":"zzz"},{"$f":"IF(Dateneingabe!A113=0,$B$1,Dateneingabe!A113)","v":"zzz"},{"$f":"IF(Dateneingabe!E113=0,$B$1,Dateneingabe!E113)","v":"zzz"},{"$f":"IF(Dateneingabe!F113=0,$B$1,Dateneingabe!F113)","v":"zzz"},{"$f":"IF(Dateneingabe!G113=0,$B$1,Dateneingabe!G113)","v":"zzz"},{"$f":"IF(Dateneingabe!H113=0,$B$1,Dateneingabe!H113)","v":"zzz"},{"$f":"IF(Dateneingabe!B113=0,$B$1,Dateneingabe!B113)","v":"zzz"},{"$f":"IF(Dateneingabe!I113=0,$B$1,Dateneingabe!I113)","v":"zzz"},{"$f":"IF(Dateneingabe!J113=0,$B$1,Dateneingabe!J113)","v":"zzz"},0,0,0,107]
[108,{"$f":"IF(Dateneingabe!D114=0,$B$1,Dateneingabe!D114)","v":"zzz"},{"$f":"IF(Dateneingabe!C114=0,$B$1,Dateneingabe!C114)","v":"zzz"},{"$f":"IF(Dateneingabe!A114=0,$B$1,Dateneingabe!A114)","v":"zzz"},{"$f":"IF(Dateneingabe!E114=0,$B$1,Dateneingabe!E114)","v":"zzz"},{"$f":"IF(Dateneingabe!F114=0,$B$1,Dateneingabe!F114)","v":"zzz"},{"$f":"IF(Dateneingabe!G114=0,$B$1,Dateneingabe!G114)","v":"zzz"},{"$f":"IF(Dateneingabe!H114=0,$B$1,Dateneingabe!H114)","v":"zzz"},{"$f":"IF(Dateneingabe!B114=0,$B$1,Dateneingabe!B114)","v":"zzz"},{"$f":"IF(Dateneingabe!I114=0,$B$1,Dateneingabe!I114)","v":"zzz"},{"$f":"IF(Dateneingabe!J114=0,$B$1,Dateneingabe!J114)","v":"zzz"},0,0,0,108]
[109,{"$f":"IF(Dateneingabe!D115=0,$B$1,Dateneingabe!D115)","v":"zzz"},{"$f":"IF(Dateneingabe!C115=0,$B$1,Dateneingabe!C115)","v":"zzz"},{"$f":"IF(Dateneingabe!A115=0,$B$1,Dateneingabe!A115)","v":"zzz"},{"$f":"IF(Dateneingabe!E115=0,$B$1,Dateneingabe!E115)","v":"zzz"},{"$f":"IF(Dateneingabe!F115=0,$B$1,Dateneingabe!F115)","v":"zzz"},{"$f":"IF(Dateneingabe!G115=0,$B$1,Dateneingabe!G115)","v":"zzz"},{"$f":"IF(Dateneingabe!H115=0,$B$1,Dateneingabe!H115)","v":"zzz"},{"$f":"IF(Dateneingabe!B115=0,$B$1,Dateneingabe!B115)","v":"zzz"},{"$f":"IF(Dateneingabe!I115=0,$B$1,Dateneingabe!I115)","v":"zzz"},{"$f":"IF(Dateneingabe!J115=0,$B$1,Dateneingabe!J115)","v":"zzz"},0,0,0,109]
[110,{"$f":"IF(Dateneingabe!D116=0,$B$1,Dateneingabe!D116)","v":"zzz"},{"$f":"IF(Dateneingabe!C116=0,$B$1,Dateneingabe!C116)","v":"zzz"},{"$f":"IF(Dateneingabe!A116=0,$B$1,Dateneingabe!A116)","v":"zzz"},{"$f":"IF(Dateneingabe!E116=0,$B$1,Dateneingabe!E116)","v":"zzz"},{"$f":"IF(Dateneingabe!F116=0,$B$1,Dateneingabe!F116)","v":"zzz"},{"$f":"IF(Dateneingabe!G116=0,$B$1,Dateneingabe!G116)","v":"zzz"},{"$f":"IF(Dateneingabe!H116=0,$B$1,Dateneingabe!H116)","v":"zzz"},{"$f":"IF(Dateneingabe!B116=0,$B$1,Dateneingabe!B116)","v":"zzz"},{"$f":"IF(Dateneingabe!I116=0,$B$1,Dateneingabe!I116)","v":"zzz"},{"$f":"IF(Dateneingabe!J116=0,$B$1,Dateneingabe!J116)","v":"zzz"},0,0,0,110]
[111,{"$f":"IF(Dateneingabe!D117=0,$B$1,Dateneingabe!D117)","v":"zzz"},{"$f":"IF(Dateneingabe!C117=0,$B$1,Dateneingabe!C117)","v":"zzz"},{"$f":"IF(Dateneingabe!A117=0,$B$1,Dateneingabe!A117)","v":"zzz"},{"$f":"IF(Dateneingabe!E117=0,$B$1,Dateneingabe!E117)","v":"zzz"},{"$f":"IF(Dateneingabe!F117=0,$B$1,Dateneingabe!F117)","v":"zzz"},{"$f":"IF(Dateneingabe!G117=0,$B$1,Dateneingabe!G117)","v":"zzz"},{"$f":"IF(Dateneingabe!H117=0,$B$1,Dateneingabe!H117)","v":"zzz"},{"$f":"IF(Dateneingabe!B117=0,$B$1,Dateneingabe!B117)","v":"zzz"},{"$f":"IF(Dateneingabe!I117=0,$B$1,Dateneingabe!I117)","v":"zzz"},{"$f":"IF(Dateneingabe!J117=0,$B$1,Dateneingabe!J117)","v":"zzz"},0,0,0,111]
[112,{"$f":"IF(Dateneingabe!D118=0,$B$1,Dateneingabe!D118)","v":"zzz"},{"$f":"IF(Dateneingabe!C118=0,$B$1,Dateneingabe!C118)","v":"zzz"},{"$f":"IF(Dateneingabe!A118=0,$B$1,Dateneingabe!A118)","v":"zzz"},{"$f":"IF(Dateneingabe!E118=0,$B$1,Dateneingabe!E118)","v":"zzz"},{"$f":"IF(Dateneingabe!F118=0,$B$1,Dateneingabe!F118)","v":"zzz"},{"$f":"IF(Dateneingabe!G118=0,$B$1,Dateneingabe!G118)","v":"zzz"},{"$f":"IF(Dateneingabe!H118=0,$B$1,Dateneingabe!H118)","v":"zzz"},{"$f":"IF(Dateneingabe!B118=0,$B$1,Dateneingabe!B118)","v":"zzz"},{"$f":"IF(Dateneingabe!I118=0,$B$1,Dateneingabe!I118)","v":"zzz"},{"$f":"IF(Dateneingabe!J118=0,$B$1,Dateneingabe!J118)","v":"zzz"},0,0,0,112]
[113,{"$f":"IF(Dateneingabe!D119=0,$B$1,Dateneingabe!D119)","v":"zzz"},{"$f":"IF(Dateneingabe!C119=0,$B$1,Dateneingabe!C119)","v":"zzz"},{"$f":"IF(Dateneingabe!A119=0,$B$1,Dateneingabe!A119)","v":"zzz"},{"$f":"IF(Dateneingabe!E119=0,$B$1,Dateneingabe!E119)","v":"zzz"},{"$f":"IF(Dateneingabe!F119=0,$B$1,Dateneingabe!F119)","v":"zzz"},{"$f":"IF(Dateneingabe!G119=0,$B$1,Dateneingabe!G119)","v":"zzz"},{"$f":"IF(Dateneingabe!H119=0,$B$1,Dateneingabe!H119)","v":"zzz"},{"$f":"IF(Dateneingabe!B119=0,$B$1,Dateneingabe!B119)","v":"zzz"},{"$f":"IF(Dateneingabe!I119=0,$B$1,Dateneingabe!I119)","v":"zzz"},{"$f":"IF(Dateneingabe!J119=0,$B$1,Dateneingabe!J119)","v":"zzz"},0,0,0,113]
[114,{"$f":"IF(Dateneingabe!D120=0,$B$1,Dateneingabe!D120)","v":"zzz"},{"$f":"IF(Dateneingabe!C120=0,$B$1,Dateneingabe!C120)","v":"zzz"},{"$f":"IF(Dateneingabe!A120=0,$B$1,Dateneingabe!A120)","v":"zzz"},{"$f":"IF(Dateneingabe!E120=0,$B$1,Dateneingabe!E120)","v":"zzz"},{"$f":"IF(Dateneingabe!F120=0,$B$1,Dateneingabe!F120)","v":"zzz"},{"$f":"IF(Dateneingabe!G120=0,$B$1,Dateneingabe!G120)","v":"zzz"},{"$f":"IF(Dateneingabe!H120=0,$B$1,Dateneingabe!H120)","v":"zzz"},{"$f":"IF(Dateneingabe!B120=0,$B$1,Dateneingabe!B120)","v":"zzz"},{"$f":"IF(Dateneingabe!I120=0,$B$1,Dateneingabe!I120)","v":"zzz"},{"$f":"IF(Dateneingabe!J120=0,$B$1,Dateneingabe!J120)","v":"zzz"},0,0,0,114]
[115,{"$f":"IF(Dateneingabe!D121=0,$B$1,Dateneingabe!D121)","v":"zzz"},{"$f":"IF(Dateneingabe!C121=0,$B$1,Dateneingabe!C121)","v":"zzz"},{"$f":"IF(Dateneingabe!A121=0,$B$1,Dateneingabe!A121)","v":"zzz"},{"$f":"IF(Dateneingabe!E121=0,$B$1,Dateneingabe!E121)","v":"zzz"},{"$f":"IF(Dateneingabe!F121=0,$B$1,Dateneingabe!F121)","v":"zzz"},{"$f":"IF(Dateneingabe!G121=0,$B$1,Dateneingabe!G121)","v":"zzz"},{"$f":"IF(Dateneingabe!H121=0,$B$1,Dateneingabe!H121)","v":"zzz"},{"$f":"IF(Dateneingabe!B121=0,$B$1,Dateneingabe!B121)","v":"zzz"},{"$f":"IF(Dateneingabe!I121=0,$B$1,Dateneingabe!I121)","v":"zzz"},{"$f":"IF(Dateneingabe!J121=0,$B$1,Dateneingabe!J121)","v":"zzz"},0,0,0,115]
[116,{"$f":"IF(Dateneingabe!D122=0,$B$1,Dateneingabe!D122)","v":"zzz"},{"$f":"IF(Dateneingabe!C122=0,$B$1,Dateneingabe!C122)","v":"zzz"},{"$f":"IF(Dateneingabe!A122=0,$B$1,Dateneingabe!A122)","v":"zzz"},{"$f":"IF(Dateneingabe!E122=0,$B$1,Dateneingabe!E122)","v":"zzz"},{"$f":"IF(Dateneingabe!F122=0,$B$1,Dateneingabe!F122)","v":"zzz"},{"$f":"IF(Dateneingabe!G122=0,$B$1,Dateneingabe!G122)","v":"zzz"},{"$f":"IF(Dateneingabe!H122=0,$B$1,Dateneingabe!H122)","v":"zzz"},{"$f":"IF(Dateneingabe!B122=0,$B$1,Dateneingabe!B122)","v":"zzz"},{"$f":"IF(Dateneingabe!I122=0,$B$1,Dateneingabe!I122)","v":"zzz"},{"$f":"IF(Dateneingabe!J122=0,$B$1,Dateneingabe!J122)","v":"zzz"},0,0,0,116]
[117,{"$f":"IF(Dateneingabe!D123=0,$B$1,Dateneingabe!D123)","v":"zzz"},{"$f":"IF(Dateneingabe!C123=0,$B$1,Dateneingabe!C123)","v":"zzz"},{"$f":"IF(Dateneingabe!A123=0,$B$1,Dateneingabe!A123)","v":"zzz"},{"$f":"IF(Dateneingabe!E123=0,$B$1,Dateneingabe!E123)","v":"zzz"},{"$f":"IF(Dateneingabe!F123=0,$B$1,Dateneingabe!F123)","v":"zzz"},{"$f":"IF(Dateneingabe!G123=0,$B$1,Dateneingabe!G123)","v":"zzz"},{"$f":"IF(Dateneingabe!H123=0,$B$1,Dateneingabe!H123)","v":"zzz"},{"$f":"IF(Dateneingabe!B123=0,$B$1,Dateneingabe!B123)","v":"zzz"},{"$f":"IF(Dateneingabe!I123=0,$B$1,Dateneingabe!I123)","v":"zzz"},{"$f":"IF(Dateneingabe!J123=0,$B$1,Dateneingabe!J123)","v":"zzz"},0,0,0,117]
[118,{"$f":"IF(Dateneingabe!D124=0,$B$1,Dateneingabe!D124)","v":"zzz"},{"$f":"IF(Dateneingabe!C124=0,$B$1,Dateneingabe!C124)","v":"zzz"},{"$f":"IF(Dateneingabe!A124=0,$B$1,Dateneingabe!A124)","v":"zzz"},{"$f":"IF(Dateneingabe!E124=0,$B$1,Dateneingabe!E124)","v":"zzz"},{"$f":"IF(Dateneingabe!F124=0,$B$1,Dateneingabe!F124)","v":"zzz"},{"$f":"IF(Dateneingabe!G124=0,$B$1,Dateneingabe!G124)","v":"zzz"},{"$f":"IF(Dateneingabe!H124=0,$B$1,Dateneingabe!H124)","v":"zzz"},{"$f":"IF(Dateneingabe!B124=0,$B$1,Dateneingabe!B124)","v":"zzz"},{"$f":"IF(Dateneingabe!I124=0,$B$1,Dateneingabe!I124)","v":"zzz"},{"$f":"IF(Dateneingabe!J124=0,$B$1,Dateneingabe!J124)","v":"zzz"},0,0,0,118]
[119,{"$f":"IF(Dateneingabe!D125=0,$B$1,Dateneingabe!D125)","v":"zzz"},{"$f":"IF(Dateneingabe!C125=0,$B$1,Dateneingabe!C125)","v":"zzz"},{"$f":"IF(Dateneingabe!A125=0,$B$1,Dateneingabe!A125)","v":"zzz"},{"$f":"IF(Dateneingabe!E125=0,$B$1,Dateneingabe!E125)","v":"zzz"},{"$f":"IF(Dateneingabe!F125=0,$B$1,Dateneingabe!F125)","v":"zzz"},{"$f":"IF(Dateneingabe!G125=0,$B$1,Dateneingabe!G125)","v":"zzz"},{"$f":"IF(Dateneingabe!H125=0,$B$1,Dateneingabe!H125)","v":"zzz"},{"$f":"IF(Dateneingabe!B125=0,$B$1,Dateneingabe!B125)","v":"zzz"},{"$f":"IF(Dateneingabe!I125=0,$B$1,Dateneingabe!I125)","v":"zzz"},{"$f":"IF(Dateneingabe!J125=0,$B$1,Dateneingabe!J125)","v":"zzz"},0,0,0,119]
[120,{"$f":"IF(Dateneingabe!D126=0,$B$1,Dateneingabe!D126)","v":"zzz"},{"$f":"IF(Dateneingabe!C126=0,$B$1,Dateneingabe!C126)","v":"zzz"},{"$f":"IF(Dateneingabe!A126=0,$B$1,Dateneingabe!A126)","v":"zzz"},{"$f":"IF(Dateneingabe!E126=0,$B$1,Dateneingabe!E126)","v":"zzz"},{"$f":"IF(Dateneingabe!F126=0,$B$1,Dateneingabe!F126)","v":"zzz"},{"$f":"IF(Dateneingabe!G126=0,$B$1,Dateneingabe!G126)","v":"zzz"},{"$f":"IF(Dateneingabe!H126=0,$B$1,Dateneingabe!H126)","v":"zzz"},{"$f":"IF(Dateneingabe!B126=0,$B$1,Dateneingabe!B126)","v":"zzz"},{"$f":"IF(Dateneingabe!I126=0,$B$1,Dateneingabe!I126)","v":"zzz"},{"$f":"IF(Dateneingabe!J126=0,$B$1,Dateneingabe!J126)","v":"zzz"},0,0,0,120]
[121,{"$f":"IF(Dateneingabe!D127=0,$B$1,Dateneingabe!D127)","v":"zzz"},{"$f":"IF(Dateneingabe!C127=0,$B$1,Dateneingabe!C127)","v":"zzz"},{"$f":"IF(Dateneingabe!A127=0,$B$1,Dateneingabe!A127)","v":"zzz"},{"$f":"IF(Dateneingabe!E127=0,$B$1,Dateneingabe!E127)","v":"zzz"},{"$f":"IF(Dateneingabe!F127=0,$B$1,Dateneingabe!F127)","v":"zzz"},{"$f":"IF(Dateneingabe!G127=0,$B$1,Dateneingabe!G127)","v":"zzz"},{"$f":"IF(Dateneingabe!H127=0,$B$1,Dateneingabe!H127)","v":"zzz"},{"$f":"IF(Dateneingabe!B127=0,$B$1,Dateneingabe!B127)","v":"zzz"},{"$f":"IF(Dateneingabe!I127=0,$B$1,Dateneingabe!I127)","v":"zzz"},{"$f":"IF(Dateneingabe!J127=0,$B$1,Dateneingabe!J127)","v":"zzz"},0,0,0,121]
[122,{"$f":"IF(Dateneingabe!D128=0,$B$1,Dateneingabe!D128)","v":"zzz"},{"$f":"IF(Dateneingabe!C128=0,$B$1,Dateneingabe!C128)","v":"zzz"},{"$f":"IF(Dateneingabe!A128=0,$B$1,Dateneingabe!A128)","v":"zzz"},{"$f":"IF(Dateneingabe!E128=0,$B$1,Dateneingabe!E128)","v":"zzz"},{"$f":"IF(Dateneingabe!F128=0,$B$1,Dateneingabe!F128)","v":"zzz"},{"$f":"IF(Dateneingabe!G128=0,$B$1,Dateneingabe!G128)","v":"zzz"},{"$f":"IF(Dateneingabe!H128=0,$B$1,Dateneingabe!H128)","v":"zzz"},{"$f":"IF(Dateneingabe!B128=0,$B$1,Dateneingabe!B128)","v":"zzz"},{"$f":"IF(Dateneingabe!I128=0,$B$1,Dateneingabe!I128)","v":"zzz"},{"$f":"IF(Dateneingabe!J128=0,$B$1,Dateneingabe!J128)","v":"zzz"},0,0,0,122]
[123,{"$f":"IF(Dateneingabe!D129=0,$B$1,Dateneingabe!D129)","v":"zzz"},{"$f":"IF(Dateneingabe!C129=0,$B$1,Dateneingabe!C129)","v":"zzz"},{"$f":"IF(Dateneingabe!A129=0,$B$1,Dateneingabe!A129)","v":"zzz"},{"$f":"IF(Dateneingabe!E129=0,$B$1,Dateneingabe!E129)","v":"zzz"},{"$f":"IF(Dateneingabe!F129=0,$B$1,Dateneingabe!F129)","v":"zzz"},{"$f":"IF(Dateneingabe!G129=0,$B$1,Dateneingabe!G129)","v":"zzz"},{"$f":"IF(Dateneingabe!H129=0,$B$1,Dateneingabe!H129)","v":"zzz"},{"$f":"IF(Dateneingabe!B129=0,$B$1,Dateneingabe!B129)","v":"zzz"},{"$f":"IF(Dateneingabe!I129=0,$B$1,Dateneingabe!I129)","v":"zzz"},{"$f":"IF(Dateneingabe!J129=0,$B$1,Dateneingabe!J129)","v":"zzz"},0,0,0,123]
[124,{"$f":"IF(Dateneingabe!D130=0,$B$1,Dateneingabe!D130)","v":"zzz"},{"$f":"IF(Dateneingabe!C130=0,$B$1,Dateneingabe!C130)","v":"zzz"},{"$f":"IF(Dateneingabe!A130=0,$B$1,Dateneingabe!A130)","v":"zzz"},{"$f":"IF(Dateneingabe!E130=0,$B$1,Dateneingabe!E130)","v":"zzz"},{"$f":"IF(Dateneingabe!F130=0,$B$1,Dateneingabe!F130)","v":"zzz"},{"$f":"IF(Dateneingabe!G130=0,$B$1,Dateneingabe!G130)","v":"zzz"},{"$f":"IF(Dateneingabe!H130=0,$B$1,Dateneingabe!H130)","v":"zzz"},{"$f":"IF(Dateneingabe!B130=0,$B$1,Dateneingabe!B130)","v":"zzz"},{"$f":"IF(Dateneingabe!I130=0,$B$1,Dateneingabe!I130)","v":"zzz"},{"$f":"IF(Dateneingabe!J130=0,$B$1,Dateneingabe!J130)","v":"zzz"},0,0,0,124]
[125,{"$f":"IF(Dateneingabe!D131=0,$B$1,Dateneingabe!D131)","v":"zzz"},{"$f":"IF(Dateneingabe!C131=0,$B$1,Dateneingabe!C131)","v":"zzz"},{"$f":"IF(Dateneingabe!A131=0,$B$1,Dateneingabe!A131)","v":"zzz"},{"$f":"IF(Dateneingabe!E131=0,$B$1,Dateneingabe!E131)","v":"zzz"},{"$f":"IF(Dateneingabe!F131=0,$B$1,Dateneingabe!F131)","v":"zzz"},{"$f":"IF(Dateneingabe!G131=0,$B$1,Dateneingabe!G131)","v":"zzz"},{"$f":"IF(Dateneingabe!H131=0,$B$1,Dateneingabe!H131)","v":"zzz"},{"$f":"IF(Dateneingabe!B131=0,$B$1,Dateneingabe!B131)","v":"zzz"},{"$f":"IF(Dateneingabe!I131=0,$B$1,Dateneingabe!I131)","v":"zzz"},{"$f":"IF(Dateneingabe!J131=0,$B$1,Dateneingabe!J131)","v":"zzz"},0,0,0,125]
[126,{"$f":"IF(Dateneingabe!D132=0,$B$1,Dateneingabe!D132)","v":"zzz"},{"$f":"IF(Dateneingabe!C132=0,$B$1,Dateneingabe!C132)","v":"zzz"},{"$f":"IF(Dateneingabe!A132=0,$B$1,Dateneingabe!A132)","v":"zzz"},{"$f":"IF(Dateneingabe!E132=0,$B$1,Dateneingabe!E132)","v":"zzz"},{"$f":"IF(Dateneingabe!F132=0,$B$1,Dateneingabe!F132)","v":"zzz"},{"$f":"IF(Dateneingabe!G132=0,$B$1,Dateneingabe!G132)","v":"zzz"},{"$f":"IF(Dateneingabe!H132=0,$B$1,Dateneingabe!H132)","v":"zzz"},{"$f":"IF(Dateneingabe!B132=0,$B$1,Dateneingabe!B132)","v":"zzz"},{"$f":"IF(Dateneingabe!I132=0,$B$1,Dateneingabe!I132)","v":"zzz"},{"$f":"IF(Dateneingabe!J132=0,$B$1,Dateneingabe!J132)","v":"zzz"},0,0,0,126]
[127,{"$f":"IF(Dateneingabe!D133=0,$B$1,Dateneingabe!D133)","v":"zzz"},{"$f":"IF(Dateneingabe!C133=0,$B$1,Dateneingabe!C133)","v":"zzz"},{"$f":"IF(Dateneingabe!A133=0,$B$1,Dateneingabe!A133)","v":"zzz"},{"$f":"IF(Dateneingabe!E133=0,$B$1,Dateneingabe!E133)","v":"zzz"},{"$f":"IF(Dateneingabe!F133=0,$B$1,Dateneingabe!F133)","v":"zzz"},{"$f":"IF(Dateneingabe!G133=0,$B$1,Dateneingabe!G133)","v":"zzz"},{"$f":"IF(Dateneingabe!H133=0,$B$1,Dateneingabe!H133)","v":"zzz"},{"$f":"IF(Dateneingabe!B133=0,$B$1,Dateneingabe!B133)","v":"zzz"},{"$f":"IF(Dateneingabe!I133=0,$B$1,Dateneingabe!I133)","v":"zzz"},{"$f":"IF(Dateneingabe!J133=0,$B$1,Dateneingabe!J133)","v":"zzz"},0,0,0,127]
[128,{"$f":"IF(Dateneingabe!D134=0,$B$1,Dateneingabe!D134)","v":"zzz"},{"$f":"IF(Dateneingabe!C134=0,$B$1,Dateneingabe!C134)","v":"zzz"},{"$f":"IF(Dateneingabe!A134=0,$B$1,Dateneingabe!A134)","v":"zzz"},{"$f":"IF(Dateneingabe!E134=0,$B$1,Dateneingabe!E134)","v":"zzz"},{"$f":"IF(Dateneingabe!F134=0,$B$1,Dateneingabe!F134)","v":"zzz"},{"$f":"IF(Dateneingabe!G134=0,$B$1,Dateneingabe!G134)","v":"zzz"},{"$f":"IF(Dateneingabe!H134=0,$B$1,Dateneingabe!H134)","v":"zzz"},{"$f":"IF(Dateneingabe!B134=0,$B$1,Dateneingabe!B134)","v":"zzz"},{"$f":"IF(Dateneingabe!I134=0,$B$1,Dateneingabe!I134)","v":"zzz"},{"$f":"IF(Dateneingabe!J134=0,$B$1,Dateneingabe!J134)","v":"zzz"},0,0,0,128]
[129,{"$f":"IF(Dateneingabe!D135=0,$B$1,Dateneingabe!D135)","v":"zzz"},{"$f":"IF(Dateneingabe!C135=0,$B$1,Dateneingabe!C135)","v":"zzz"},{"$f":"IF(Dateneingabe!A135=0,$B$1,Dateneingabe!A135)","v":"zzz"},{"$f":"IF(Dateneingabe!E135=0,$B$1,Dateneingabe!E135)","v":"zzz"},{"$f":"IF(Dateneingabe!F135=0,$B$1,Dateneingabe!F135)","v":"zzz"},{"$f":"IF(Dateneingabe!G135=0,$B$1,Dateneingabe!G135)","v":"zzz"},{"$f":"IF(Dateneingabe!H135=0,$B$1,Dateneingabe!H135)","v":"zzz"},{"$f":"IF(Dateneingabe!B135=0,$B$1,Dateneingabe!B135)","v":"zzz"},{"$f":"IF(Dateneingabe!I135=0,$B$1,Dateneingabe!I135)","v":"zzz"},{"$f":"IF(Dateneingabe!J135=0,$B$1,Dateneingabe!J135)","v":"zzz"},0,0,0,129]
[130,{"$f":"IF(Dateneingabe!D136=0,$B$1,Dateneingabe!D136)","v":"zzz"},{"$f":"IF(Dateneingabe!C136=0,$B$1,Dateneingabe!C136)","v":"zzz"},{"$f":"IF(Dateneingabe!A136=0,$B$1,Dateneingabe!A136)","v":"zzz"},{"$f":"IF(Dateneingabe!E136=0,$B$1,Dateneingabe!E136)","v":"zzz"},{"$f":"IF(Dateneingabe!F136=0,$B$1,Dateneingabe!F136)","v":"zzz"},{"$f":"IF(Dateneingabe!G136=0,$B$1,Dateneingabe!G136)","v":"zzz"},{"$f":"IF(Dateneingabe!H136=0,$B$1,Dateneingabe!H136)","v":"zzz"},{"$f":"IF(Dateneingabe!B136=0,$B$1,Dateneingabe!B136)","v":"zzz"},{"$f":"IF(Dateneingabe!I136=0,$B$1,Dateneingabe!I136)","v":"zzz"},{"$f":"IF(Dateneingabe!J136=0,$B$1,Dateneingabe!J136)","v":"zzz"},0,0,0,130]
[131,{"$f":"IF(Dateneingabe!D137=0,$B$1,Dateneingabe!D137)","v":"zzz"},{"$f":"IF(Dateneingabe!C137=0,$B$1,Dateneingabe!C137)","v":"zzz"},{"$f":"IF(Dateneingabe!A137=0,$B$1,Dateneingabe!A137)","v":"zzz"},{"$f":"IF(Dateneingabe!E137=0,$B$1,Dateneingabe!E137)","v":"zzz"},{"$f":"IF(Dateneingabe!F137=0,$B$1,Dateneingabe!F137)","v":"zzz"},{"$f":"IF(Dateneingabe!G137=0,$B$1,Dateneingabe!G137)","v":"zzz"},{"$f":"IF(Dateneingabe!H137=0,$B$1,Dateneingabe!H137)","v":"zzz"},{"$f":"IF(Dateneingabe!B137=0,$B$1,Dateneingabe!B137)","v":"zzz"},{"$f":"IF(Dateneingabe!I137=0,$B$1,Dateneingabe!I137)","v":"zzz"},{"$f":"IF(Dateneingabe!J137=0,$B$1,Dateneingabe!J137)","v":"zzz"},0,0,0,131]
[132,{"$f":"IF(Dateneingabe!D138=0,$B$1,Dateneingabe!D138)","v":"zzz"},{"$f":"IF(Dateneingabe!C138=0,$B$1,Dateneingabe!C138)","v":"zzz"},{"$f":"IF(Dateneingabe!A138=0,$B$1,Dateneingabe!A138)","v":"zzz"},{"$f":"IF(Dateneingabe!E138=0,$B$1,Dateneingabe!E138)","v":"zzz"},{"$f":"IF(Dateneingabe!F138=0,$B$1,Dateneingabe!F138)","v":"zzz"},{"$f":"IF(Dateneingabe!G138=0,$B$1,Dateneingabe!G138)","v":"zzz"},{"$f":"IF(Dateneingabe!H138=0,$B$1,Dateneingabe!H138)","v":"zzz"},{"$f":"IF(Dateneingabe!B138=0,$B$1,Dateneingabe!B138)","v":"zzz"},{"$f":"IF(Dateneingabe!I138=0,$B$1,Dateneingabe!I138)","v":"zzz"},{"$f":"IF(Dateneingabe!J138=0,$B$1,Dateneingabe!J138)","v":"zzz"},0,0,0,132]
[133,{"$f":"IF(Dateneingabe!D139=0,$B$1,Dateneingabe!D139)","v":"zzz"},{"$f":"IF(Dateneingabe!C139=0,$B$1,Dateneingabe!C139)","v":"zzz"},{"$f":"IF(Dateneingabe!A139=0,$B$1,Dateneingabe!A139)","v":"zzz"},{"$f":"IF(Dateneingabe!E139=0,$B$1,Dateneingabe!E139)","v":"zzz"},{"$f":"IF(Dateneingabe!F139=0,$B$1,Dateneingabe!F139)","v":"zzz"},{"$f":"IF(Dateneingabe!G139=0,$B$1,Dateneingabe!G139)","v":"zzz"},{"$f":"IF(Dateneingabe!H139=0,$B$1,Dateneingabe!H139)","v":"zzz"},{"$f":"IF(Dateneingabe!B139=0,$B$1,Dateneingabe!B139)","v":"zzz"},{"$f":"IF(Dateneingabe!I139=0,$B$1,Dateneingabe!I139)","v":"zzz"},{"$f":"IF(Dateneingabe!J139=0,$B$1,Dateneingabe!J139)","v":"zzz"},0,0,0,133]
[134,{"$f":"IF(Dateneingabe!D140=0,$B$1,Dateneingabe!D140)","v":"zzz"},{"$f":"IF(Dateneingabe!C140=0,$B$1,Dateneingabe!C140)","v":"zzz"},{"$f":"IF(Dateneingabe!A140=0,$B$1,Dateneingabe!A140)","v":"zzz"},{"$f":"IF(Dateneingabe!E140=0,$B$1,Dateneingabe!E140)","v":"zzz"},{"$f":"IF(Dateneingabe!F140=0,$B$1,Dateneingabe!F140)","v":"zzz"},{"$f":"IF(Dateneingabe!G140=0,$B$1,Dateneingabe!G140)","v":"zzz"},{"$f":"IF(Dateneingabe!H140=0,$B$1,Dateneingabe!H140)","v":"zzz"},{"$f":"IF(Dateneingabe!B140=0,$B$1,Dateneingabe!B140)","v":"zzz"},{"$f":"IF(Dateneingabe!I140=0,$B$1,Dateneingabe!I140)","v":"zzz"},{"$f":"IF(Dateneingabe!J140=0,$B$1,Dateneingabe!J140)","v":"zzz"},0,0,0,134]
[135,{"$f":"IF(Dateneingabe!D141=0,$B$1,Dateneingabe!D141)","v":"zzz"},{"$f":"IF(Dateneingabe!C141=0,$B$1,Dateneingabe!C141)","v":"zzz"},{"$f":"IF(Dateneingabe!A141=0,$B$1,Dateneingabe!A141)","v":"zzz"},{"$f":"IF(Dateneingabe!E141=0,$B$1,Dateneingabe!E141)","v":"zzz"},{"$f":"IF(Dateneingabe!F141=0,$B$1,Dateneingabe!F141)","v":"zzz"},{"$f":"IF(Dateneingabe!G141=0,$B$1,Dateneingabe!G141)","v":"zzz"},{"$f":"IF(Dateneingabe!H141=0,$B$1,Dateneingabe!H141)","v":"zzz"},{"$f":"IF(Dateneingabe!B141=0,$B$1,Dateneingabe!B141)","v":"zzz"},{"$f":"IF(Dateneingabe!I141=0,$B$1,Dateneingabe!I141)","v":"zzz"},{"$f":"IF(Dateneingabe!J141=0,$B$1,Dateneingabe!J141)","v":"zzz"},0,0,0,135]
[136,{"$f":"IF(Dateneingabe!D142=0,$B$1,Dateneingabe!D142)","v":"zzz"},{"$f":"IF(Dateneingabe!C142=0,$B$1,Dateneingabe!C142)","v":"zzz"},{"$f":"IF(Dateneingabe!A142=0,$B$1,Dateneingabe!A142)","v":"zzz"},{"$f":"IF(Dateneingabe!E142=0,$B$1,Dateneingabe!E142)","v":"zzz"},{"$f":"IF(Dateneingabe!F142=0,$B$1,Dateneingabe!F142)","v":"zzz"},{"$f":"IF(Dateneingabe!G142=0,$B$1,Dateneingabe!G142)","v":"zzz"},{"$f":"IF(Dateneingabe!H142=0,$B$1,Dateneingabe!H142)","v":"zzz"},{"$f":"IF(Dateneingabe!B142=0,$B$1,Dateneingabe!B142)","v":"zzz"},{"$f":"IF(Dateneingabe!I142=0,$B$1,Dateneingabe!I142)","v":"zzz"},{"$f":"IF(Dateneingabe!J142=0,$B$1,Dateneingabe!J142)","v":"zzz"},0,0,0,136]
[137,{"$f":"IF(Dateneingabe!D143=0,$B$1,Dateneingabe!D143)","v":"zzz"},{"$f":"IF(Dateneingabe!C143=0,$B$1,Dateneingabe!C143)","v":"zzz"},{"$f":"IF(Dateneingabe!A143=0,$B$1,Dateneingabe!A143)","v":"zzz"},{"$f":"IF(Dateneingabe!E143=0,$B$1,Dateneingabe!E143)","v":"zzz"},{"$f":"IF(Dateneingabe!F143=0,$B$1,Dateneingabe!F143)","v":"zzz"},{"$f":"IF(Dateneingabe!G143=0,$B$1,Dateneingabe!G143)","v":"zzz"},{"$f":"IF(Dateneingabe!H143=0,$B$1,Dateneingabe!H143)","v":"zzz"},{"$f":"IF(Dateneingabe!B143=0,$B$1,Dateneingabe!B143)","v":"zzz"},{"$f":"IF(Dateneingabe!I143=0,$B$1,Dateneingabe!I143)","v":"zzz"},{"$f":"IF(Dateneingabe!J143=0,$B$1,Dateneingabe!J143)","v":"zzz"},0,0,0,137]
[138,{"$f":"IF(Dateneingabe!D144=0,$B$1,Dateneingabe!D144)","v":"zzz"},{"$f":"IF(Dateneingabe!C144=0,$B$1,Dateneingabe!C144)","v":"zzz"},{"$f":"IF(Dateneingabe!A144=0,$B$1,Dateneingabe!A144)","v":"zzz"},{"$f":"IF(Dateneingabe!E144=0,$B$1,Dateneingabe!E144)","v":"zzz"},{"$f":"IF(Dateneingabe!F144=0,$B$1,Dateneingabe!F144)","v":"zzz"},{"$f":"IF(Dateneingabe!G144=0,$B$1,Dateneingabe!G144)","v":"zzz"},{"$f":"IF(Dateneingabe!H144=0,$B$1,Dateneingabe!H144)","v":"zzz"},{"$f":"IF(Dateneingabe!B144=0,$B$1,Dateneingabe!B144)","v":"zzz"},{"$f":"IF(Dateneingabe!I144=0,$B$1,Dateneingabe!I144)","v":"zzz"},{"$f":"IF(Dateneingabe!J144=0,$B$1,Dateneingabe!J144)","v":"zzz"},0,0,0,138]
[139,{"$f":"IF(Dateneingabe!D145=0,$B$1,Dateneingabe!D145)","v":"zzz"},{"$f":"IF(Dateneingabe!C145=0,$B$1,Dateneingabe!C145)","v":"zzz"},{"$f":"IF(Dateneingabe!A145=0,$B$1,Dateneingabe!A145)","v":"zzz"},{"$f":"IF(Dateneingabe!E145=0,$B$1,Dateneingabe!E145)","v":"zzz"},{"$f":"IF(Dateneingabe!F145=0,$B$1,Dateneingabe!F145)","v":"zzz"},{"$f":"IF(Dateneingabe!G145=0,$B$1,Dateneingabe!G145)","v":"zzz"},{"$f":"IF(Dateneingabe!H145=0,$B$1,Dateneingabe!H145)","v":"zzz"},{"$f":"IF(Dateneingabe!B145=0,$B$1,Dateneingabe!B145)","v":"zzz"},{"$f":"IF(Dateneingabe!I145=0,$B$1,Dateneingabe!I145)","v":"zzz"},{"$f":"IF(Dateneingabe!J145=0,$B$1,Dateneingabe!J145)","v":"zzz"},0,0,0,139]
[140,{"$f":"IF(Dateneingabe!D146=0,$B$1,Dateneingabe!D146)","v":"zzz"},{"$f":"IF(Dateneingabe!C146=0,$B$1,Dateneingabe!C146)","v":"zzz"},{"$f":"IF(Dateneingabe!A146=0,$B$1,Dateneingabe!A146)","v":"zzz"},{"$f":"IF(Dateneingabe!E146=0,$B$1,Dateneingabe!E146)","v":"zzz"},{"$f":"IF(Dateneingabe!F146=0,$B$1,Dateneingabe!F146)","v":"zzz"},{"$f":"IF(Dateneingabe!G146=0,$B$1,Dateneingabe!G146)","v":"zzz"},{"$f":"IF(Dateneingabe!H146=0,$B$1,Dateneingabe!H146)","v":"zzz"},{"$f":"IF(Dateneingabe!B146=0,$B$1,Dateneingabe!B146)","v":"zzz"},{"$f":"IF(Dateneingabe!I146=0,$B$1,Dateneingabe!I146)","v":"zzz"},{"$f":"IF(Dateneingabe!J146=0,$B$1,Dateneingabe!J146)","v":"zzz"},0,0,0,140]
[141,{"$f":"IF(Dateneingabe!D147=0,$B$1,Dateneingabe!D147)","v":"zzz"},{"$f":"IF(Dateneingabe!C147=0,$B$1,Dateneingabe!C147)","v":"zzz"},{"$f":"IF(Dateneingabe!A147=0,$B$1,Dateneingabe!A147)","v":"zzz"},{"$f":"IF(Dateneingabe!E147=0,$B$1,Dateneingabe!E147)","v":"zzz"},{"$f":"IF(Dateneingabe!F147=0,$B$1,Dateneingabe!F147)","v":"zzz"},{"$f":"IF(Dateneingabe!G147=0,$B$1,Dateneingabe!G147)","v":"zzz"},{"$f":"IF(Dateneingabe!H147=0,$B$1,Dateneingabe!H147)","v":"zzz"},{"$f":"IF(Dateneingabe!B147=0,$B$1,Dateneingabe!B147)","v":"zzz"},{"$f":"IF(Dateneingabe!I147=0,$B$1,Dateneingabe!I147)","v":"zzz"},{"$f":"IF(Dateneingabe!J147=0,$B$1,Dateneingabe!J147)","v":"zzz"},0,0,0,141]
[142,{"$f":"IF(Dateneingabe!D148=0,$B$1,Dateneingabe!D148)","v":"zzz"},{"$f":"IF(Dateneingabe!C148=0,$B$1,Dateneingabe!C148)","v":"zzz"},{"$f":"IF(Dateneingabe!A148=0,$B$1,Dateneingabe!A148)","v":"zzz"},{"$f":"IF(Dateneingabe!E148=0,$B$1,Dateneingabe!E148)","v":"zzz"},{"$f":"IF(Dateneingabe!F148=0,$B$1,Dateneingabe!F148)","v":"zzz"},{"$f":"IF(Dateneingabe!G148=0,$B$1,Dateneingabe!G148)","v":"zzz"},{"$f":"IF(Dateneingabe!H148=0,$B$1,Dateneingabe!H148)","v":"zzz"},{"$f":"IF(Dateneingabe!B148=0,$B$1,Dateneingabe!B148)","v":"zzz"},{"$f":"IF(Dateneingabe!I148=0,$B$1,Dateneingabe!I148)","v":"zzz"},{"$f":"IF(Dateneingabe!J148=0,$B$1,Dateneingabe!J148)","v":"zzz"},0,0,0,142]
[143,{"$f":"IF(Dateneingabe!D149=0,$B$1,Dateneingabe!D149)","v":"zzz"},{"$f":"IF(Dateneingabe!C149=0,$B$1,Dateneingabe!C149)","v":"zzz"},{"$f":"IF(Dateneingabe!A149=0,$B$1,Dateneingabe!A149)","v":"zzz"},{"$f":"IF(Dateneingabe!E149=0,$B$1,Dateneingabe!E149)","v":"zzz"},{"$f":"IF(Dateneingabe!F149=0,$B$1,Dateneingabe!F149)","v":"zzz"},{"$f":"IF(Dateneingabe!G149=0,$B$1,Dateneingabe!G149)","v":"zzz"},{"$f":"IF(Dateneingabe!H149=0,$B$1,Dateneingabe!H149)","v":"zzz"},{"$f":"IF(Dateneingabe!B149=0,$B$1,Dateneingabe!B149)","v":"zzz"},{"$f":"IF(Dateneingabe!I149=0,$B$1,Dateneingabe!I149)","v":"zzz"},{"$f":"IF(Dateneingabe!J149=0,$B$1,Dateneingabe!J149)","v":"zzz"},0,0,0,143]
[144,{"$f":"IF(Dateneingabe!D150=0,$B$1,Dateneingabe!D150)","v":"zzz"},{"$f":"IF(Dateneingabe!C150=0,$B$1,Dateneingabe!C150)","v":"zzz"},{"$f":"IF(Dateneingabe!A150=0,$B$1,Dateneingabe!A150)","v":"zzz"},{"$f":"IF(Dateneingabe!E150=0,$B$1,Dateneingabe!E150)","v":"zzz"},{"$f":"IF(Dateneingabe!F150=0,$B$1,Dateneingabe!F150)","v":"zzz"},{"$f":"IF(Dateneingabe!G150=0,$B$1,Dateneingabe!G150)","v":"zzz"},{"$f":"IF(Dateneingabe!H150=0,$B$1,Dateneingabe!H150)","v":"zzz"},{"$f":"IF(Dateneingabe!B150=0,$B$1,Dateneingabe!B150)","v":"zzz"},{"$f":"IF(Dateneingabe!I150=0,$B$1,Dateneingabe!I150)","v":"zzz"},{"$f":"IF(Dateneingabe!J150=0,$B$1,Dateneingabe!J150)","v":"zzz"},0,0,0,144]
[145,{"$f":"IF(Dateneingabe!D151=0,$B$1,Dateneingabe!D151)","v":"zzz"},{"$f":"IF(Dateneingabe!C151=0,$B$1,Dateneingabe!C151)","v":"zzz"},{"$f":"IF(Dateneingabe!A151=0,$B$1,Dateneingabe!A151)","v":"zzz"},{"$f":"IF(Dateneingabe!E151=0,$B$1,Dateneingabe!E151)","v":"zzz"},{"$f":"IF(Dateneingabe!F151=0,$B$1,Dateneingabe!F151)","v":"zzz"},{"$f":"IF(Dateneingabe!G151=0,$B$1,Dateneingabe!G151)","v":"zzz"},{"$f":"IF(Dateneingabe!H151=0,$B$1,Dateneingabe!H151)","v":"zzz"},{"$f":"IF(Dateneingabe!B151=0,$B$1,Dateneingabe!B151)","v":"zzz"},{"$f":"IF(Dateneingabe!I151=0,$B$1,Dateneingabe!I151)","v":"zzz"},{"$f":"IF(Dateneingabe!J151=0,$B$1,Dateneingabe!J151)","v":"zzz"},0,0,0,145]
[146,{"$f":"IF(Dateneingabe!D152=0,$B$1,Dateneingabe!D152)","v":"zzz"},{"$f":"IF(Dateneingabe!C152=0,$B$1,Dateneingabe!C152)","v":"zzz"},{"$f":"IF(Dateneingabe!A152=0,$B$1,Dateneingabe!A152)","v":"zzz"},{"$f":"IF(Dateneingabe!E152=0,$B$1,Dateneingabe!E152)","v":"zzz"},{"$f":"IF(Dateneingabe!F152=0,$B$1,Dateneingabe!F152)","v":"zzz"},{"$f":"IF(Dateneingabe!G152=0,$B$1,Dateneingabe!G152)","v":"zzz"},{"$f":"IF(Dateneingabe!H152=0,$B$1,Dateneingabe!H152)","v":"zzz"},{"$f":"IF(Dateneingabe!B152=0,$B$1,Dateneingabe!B152)","v":"zzz"},{"$f":"IF(Dateneingabe!I152=0,$B$1,Dateneingabe!I152)","v":"zzz"},{"$f":"IF(Dateneingabe!J152=0,$B$1,Dateneingabe!J152)","v":"zzz"},0,0,0,146]
[147,{"$f":"IF(Dateneingabe!D153=0,$B$1,Dateneingabe!D153)","v":"zzz"},{"$f":"IF(Dateneingabe!C153=0,$B$1,Dateneingabe!C153)","v":"zzz"},{"$f":"IF(Dateneingabe!A153=0,$B$1,Dateneingabe!A153)","v":"zzz"},{"$f":"IF(Dateneingabe!E153=0,$B$1,Dateneingabe!E153)","v":"zzz"},{"$f":"IF(Dateneingabe!F153=0,$B$1,Dateneingabe!F153)","v":"zzz"},{"$f":"IF(Dateneingabe!G153=0,$B$1,Dateneingabe!G153)","v":"zzz"},{"$f":"IF(Dateneingabe!H153=0,$B$1,Dateneingabe!H153)","v":"zzz"},{"$f":"IF(Dateneingabe!B153=0,$B$1,Dateneingabe!B153)","v":"zzz"},{"$f":"IF(Dateneingabe!I153=0,$B$1,Dateneingabe!I153)","v":"zzz"},{"$f":"IF(Dateneingabe!J153=0,$B$1,Dateneingabe!J153)","v":"zzz"},0,0,0,147]
[148,{"$f":"IF(Dateneingabe!D154=0,$B$1,Dateneingabe!D154)","v":"zzz"},{"$f":"IF(Dateneingabe!C154=0,$B$1,Dateneingabe!C154)","v":"zzz"},{"$f":"IF(Dateneingabe!A154=0,$B$1,Dateneingabe!A154)","v":"zzz"},{"$f":"IF(Dateneingabe!E154=0,$B$1,Dateneingabe!E154)","v":"zzz"},{"$f":"IF(Dateneingabe!F154=0,$B$1,Dateneingabe!F154)","v":"zzz"},{"$f":"IF(Dateneingabe!G154=0,$B$1,Dateneingabe!G154)","v":"zzz"},{"$f":"IF(Dateneingabe!H154=0,$B$1,Dateneingabe!H154)","v":"zzz"},{"$f":"IF(Dateneingabe!B154=0,$B$1,Dateneingabe!B154)","v":"zzz"},{"$f":"IF(Dateneingabe!I154=0,$B$1,Dateneingabe!I154)","v":"zzz"},{"$f":"IF(Dateneingabe!J154=0,$B$1,Dateneingabe!J154)","v":"zzz"},0,0,0,148]
[149,{"$f":"IF(Dateneingabe!D155=0,$B$1,Dateneingabe!D155)","v":"zzz"},{"$f":"IF(Dateneingabe!C155=0,$B$1,Dateneingabe!C155)","v":"zzz"},{"$f":"IF(Dateneingabe!A155=0,$B$1,Dateneingabe!A155)","v":"zzz"},{"$f":"IF(Dateneingabe!E155=0,$B$1,Dateneingabe!E155)","v":"zzz"},{"$f":"IF(Dateneingabe!F155=0,$B$1,Dateneingabe!F155)","v":"zzz"},{"$f":"IF(Dateneingabe!G155=0,$B$1,Dateneingabe!G155)","v":"zzz"},{"$f":"IF(Dateneingabe!H155=0,$B$1,Dateneingabe!H155)","v":"zzz"},{"$f":"IF(Dateneingabe!B155=0,$B$1,Dateneingabe!B155)","v":"zzz"},{"$f":"IF(Dateneingabe!I155=0,$B$1,Dateneingabe!I155)","v":"zzz"},{"$f":"IF(Dateneingabe!J155=0,$B$1,Dateneingabe!J155)","v":"zzz"},0,0,0,149]
[150,{"$f":"IF(Dateneingabe!D156=0,$B$1,Dateneingabe!D156)","v":"zzz"},{"$f":"IF(Dateneingabe!C156=0,$B$1,Dateneingabe!C156)","v":"zzz"},{"$f":"IF(Dateneingabe!A156=0,$B$1,Dateneingabe!A156)","v":"zzz"},{"$f":"IF(Dateneingabe!E156=0,$B$1,Dateneingabe!E156)","v":"zzz"},{"$f":"IF(Dateneingabe!F156=0,$B$1,Dateneingabe!F156)","v":"zzz"},{"$f":"IF(Dateneingabe!G156=0,$B$1,Dateneingabe!G156)","v":"zzz"},{"$f":"IF(Dateneingabe!H156=0,$B$1,Dateneingabe!H156)","v":"zzz"},{"$f":"IF(Dateneingabe!B156=0,$B$1,Dateneingabe!B156)","v":"zzz"},{"$f":"IF(Dateneingabe!I156=0,$B$1,Dateneingabe!I156)","v":"zzz"},{"$f":"IF(Dateneingabe!J156=0,$B$1,Dateneingabe!J156)","v":"zzz"},0,0,0,150]
[null,null,null,null,null,null,{"$f":"L154","v":0},"(= Durchschnittsalter)",{"$f":"M154","v":0},"Mitarbeiter",null,{"$f":"IF(M154=0,0,(SUM(L4:L153))/N154)","v":0},{"$f":"SUM(M4:M153)","v":0},{"$f":"SUM(N4:N153)","v":0}]
[null,null,null,null,null,null,null,"Achtung Hinweis:",{"$f":"M154-N154","v":0},"Geburtsdaten fehlen",null,"Durchschnittsalter"]

{"sheet":"Schichtplan","index":2,"n_rows":1558,"n_cols":714,"rows_kept":1558,"cut":false,"hidden":false,"merged":[[2,3,3,3],[1,186,1,216],[1,217,1,247],[1,248,1,277],[1,278,1,308],[1,309,1,338],[1,339,1,369],[1,4,1,34],[1,35,1,63],[1,64,1,94],[1,95,1,124],[1,125,1,155],[1,156,1,185],[0,622,2,651],[3,622,3,651],[0,377,3,377],[0,371,3,371],[0,373,3,373],[0,374,3,374],[0,375,3,375],[0,376,3,376],[0,530,2,559],[3,530,3,559],[0,560,2,590],[3,560,3,590],[0,591,2,621],[3,591,3,621],[0,438,2,468],[3,438,3,468],[0,469,2,498],[3,469,3,498],[0,499,2,529],[3,499,3,529],[0,372,3,372],[0,378,2,408],[3,378,3,408],[0,409,2,437],[3,409,3,437],[0,652,2,682],[3,652,3,682],[0,683,2,712],[3,683,3,712],[0,713,2,743],[3,713,3,743]]}
[{"$f":"Dateneingabe!A4","v":"2014-01-01"},"zzz",null," ",{"$f":"A1","v":"2014-01-01"},{"$f":"E1+1","v":"2014-01-02"},{"$f":"F1+1","v":"2014-01-03"},"2014-01-04","2014-01-05","2014-01-06","2014-01-07","2014-01-08","2014-01-09","2014-01-10","2014-01-11","2014-01-12","2014-01-13","2014-01-14","2014-01-15","2014-01-16","2014-01-17","2014-01-18","2014-01-19","2014-01-20","2014-01-21","2014-01-22","2014-01-23","2014-01-24","2014-01-25","2014-01-26","2014-01-27","2014-01-28","2014-01-29","2014-01-30","2014-01-31","2014-02-01","2014-02-02","2014-02-03","2014-02-04","2014-02-05","2014-02-06","2014-02-07","2014-02-08","2014-02-09","2014-02-10","2014-02-11","2014-02-12","2014-02-13","2014-02-14","2014-02-15","2014-02-16","2014-02-17","2014-02-18","2014-02-19","2014-02-20","2014-02-21","2014-02-22","2014-02-23","2014-02-24","2014-02-25","2014-02-26","2014-02-27","2014-02-28",{"$f":"IF(BL3=0,D1,BK1+1)","v":" "},{"$f":"IF(BL3=0,BK1+1,BL1+1)","v":"2014-03-01"},"2014-03-02","2014-03-03","2014-03-04","2014-03-05","2014-03-06",{"$f":"BR1+1","v":"2014-03-07"},"2014-03-08","2014-03-09","2014-03-10","2014-03-11","2014-03-12","2014-03-13","2014-03-14","2014-03-15","2014-03-16","2014-03-17","2014-03-18","2014-03-19","2014-03-20","2014-03-21","2014-03-22","2014-03-23","2014-03-24","2014-03-25","2014-03-26","2014-03-27","2014-03-28","2014-03-29","2014-03-30","2014-03-31","2014-04-01","2014-04-02","2014-04-03","2014-04-04","2014-04-05","2014-04-06","2014-04-07","2014-04-08","2014-04-09","2014-04-10","2014-04-11","2014-04-12","2014-04-13","2014-04-14","2014-04-15","2014-04-16","2014-04-17","2014-04-18","2014-04-19","2014-04-20","2014-04-21","2014-04-22","2014-04-23","2014-04-24","2014-04-25","2014-04-26","2014-04-27","2014-04-28","2014-04-29","2014-04-30","2014-05-01","2014-05-02","2014-05-03","2014-05-04","2014-05-05","2014-05-06","2014-05-07","2014-05-08","2014-05-09",{"$f":"ED1+1","v":"2014-05-10"},"2014-05-11","2014-05-12","2014-05-13","2014-05-14","2014-05-15","2014-05-16","2014-05-17","2014-05-18","2014-05-19","2014-05-20","2014-05-21","2014-05-22","2014-05-23","2014-05-24","2014-05-25","2014-05-26","2014-05-27","2014-05-28","2014-05-29","2014-05-30","2014-05-31","2014-06-01","2014-06-02","2014-06-03","2014-06-04","2014-06-05","2014-06-06","2014-06-07","2014-06-08","2014-06-09","2014-06-10","2014-06-11","2014-06-12","2014-06-13","2014-06-14","2014-06-15","2014-06-16","2014-06-17","2014-06-18","2014-06-19","2014-06-20","2014-06-21","2014-06-22","2014-06-23","2014-06-24","2014-06-25","2014-06-26","2014-06-27","2014-06-28","2014-06-29","2014-06-30","2014-07-01","2014-07-02","2014-07-03","2014-07-04","2014-07-05","2014-07-06","2014-07-07","2014-07-08","2014-07-09","2014-07-10","2014-07-11","2014-07-12",{"$f":"GP1+1","v":"2014-07-13"},"2014-07-14","2014-07-15","2014-07-16","2014-07-17","2014-07-18","2014-07-19","2014-07-20","2014-07-21","2014-07-22","2014-07-23","2014-07-24","2014-07-25","2014-07-26","2014-07-27","2014-07-28","2014-07-29","2014-07-30","2014-07-31","2014-08-01","2014-08-02","2014-08-03","2014-08-04","2014-08-05","2014-08-06","2014-08-07","2014-08-08","2014-08-09","2014-08-10","2014-08-11","2014-08-12","2014-08-13","2014-08-14","2014-08-15","2014-08-16","2014-08-17","2014-08-18","2014-08-19","2014-08-20","2014-08-21","2014-08-22","2014-08-23","2014-08-24","2014-08-25","2014-08-26","2014-08-27","2014-08-28","2014-08-29","2014-08-30","2014-08-31","2014-09-01","2014-09-02","2014-09-03","2014-09-04","2014-09-05","2014-09-06","2014-09-07","2014-09-08","2014-09-09","2014-09-10","2014-09-11","2014-09-12","2014-09-13","2014-09-14",{"$f":"JB1+1","v":"2014-09-15"},"2014-09-16","2014-09-17","2014-09-18","2014-09-19","2014-09-20","2014-09-21","2014-09-22","2014-09-23","2014-09-24","2014-09-25","2014-09-26","2014-09-27","2014-09-28","2014-09-29","2014-09-30","2014-10-01","2014-10-02","2014-10-03","2014-10-04","2014-10-05","2014-10-06","2014-10-07","2014-10-08","2014-10-09","2014-10-10","2014-10-11","2014-10-12","2014-10-13","2014-10-14","2014-10-15","2014-10-16","2014-10-17","2014-10-18","2014-10-19","2014-10-20","2014-10-21","2014-10-22","2014-10-23","2014-10-24","2014-10-25","2014-10-26","2014-10-27","2014-10-28","2014-10-29","2014-10-30","2014-10-31","2014-11-01","2014-11-02","2014-11-03","2014-11-04","2014-11-05","2014-11-06","2014-11-07","2014-11-08","2014-11-09","2014-11-10","2014-11-11","2014-11-12","2014-11-13","2014-11-14","2014-11-15","2014-11-16","2014-11-17",{"$f":"LN1+1","v":"2014-11-18"},"2014-11-19","2014-11-20","2014-11-21","2014-11-22","2014-11-23","2014-11-24","2014-11-25","2014-11-26","2014-11-27","2014-11-28","2014-11-29","2014-11-30","2014-12-01","2014-12-02","2014-12-03","2014-12-04","2014-12-05","2014-12-06","2014-12-07","2014-12-08","2014-12-09","2014-12-10","2014-12-11","2014-12-12","2014-12-13","2014-12-14","2014-12-15","2014-12-16","2014-12-17","2014-12-18","2014-12-19","2014-12-20","2014-12-21","2014-12-22","2014-12-23","2014-12-24","2014-12-25","2014-12-26","2014-12-27","2014-12-28","2014-12-29","2014-12-30","2014-12-31",null,"Zeilen Nr. Dateneingabe","Zusatzbemerkung","Jahresurlaub","Resturlaub vom Vorjahr","Urlaubsanspruch","erhaltene, geplante Urlaubstage","Resturlaub","Januar",null,null,null,null,null,null,null,null,null,null,null,null,null,null,null,null,null,null,null,null,null,null,null,null,null,null,null,null,null,null,"Februar",null,null,null,null,null,null,null,null,null,null,null,null,null,null,null,null,null,null,null,null,null,null,null,null,null,null,null,null,"März",null,null,null,null,null,null,null,null,null,null,null,null,null,null,null,null,null,null,null,null,null,null,null,null,null,null,null,null,null,null,"April",null,null,null,null,null,null,null,null,null,null,null,null,null,null,null,null,null,null,null,null,null,null,null,null,null,null,null,null,null,"Mai",null,null,null,null,null,null,null,null,null,null,null,null,null,null,null,null,null,null,null,null,null,null,null,null,null,null,null,null,null,null,"Juni",null,null,null,null,null,null,null,null,null,null,null,null,null,null,null,null,null,null,null,null,null,null,null,null,null,null,null,null,null,"Juli",null,null,null,null,null,null,null,null,null,null,null,null,null,null,null,null,null,null,null,null,null,null,null,null,null,null,null,null,null,null,"August",null,null,null,null,null,null,null,null,null,null,null,null,null,null,null,null,null,null,null,null,null,null,null,null,null,null,null,null,null,null,"September",null,null,null,null,null,null,null,null,null,null,null,null,null,null,null,null,null,null,null,null,null,null,null,null,null,null,null,null,null,"Oktober",null,null,null,null,null,null,null,null,null,null,null,null,null,null,null,null,null,null,null,null,null,null,null,null,null,null,null,null,null,null,"November",null,null,null,null,null,null,null,null,null,null,null,null,null,null,null,null,null,null,null,null,null,null,null,null,null,null,null,null,null,"Dezember"]
["Beginn Schichtplan","Monat",null,null,"Januar",null,null,null,null,null,null,null,null,null,null,null,null,null,null,null,null,null,null,null,null,null,null,null,null,null,null,null,null,null,null,"Februar",null,null,null,null,null,null,null,null,null,null,null,null,null,null,null,null,null,null,null,null,null,null,null,null,null,null,null,null,"März",null,null,null,null,null,null,null,null,null,null,null,null,null,null,null,null,null,null,null,null,null,null,null,null,null,null,null,null,null,null,"April",null,null,null,null,null,null,null,null,null,null,null,null,null,null,null,null,null,null,null,null,null,null,null,null,null,null,null,null,null,"Mai",null,null,null,null,null,null,null,null,null,null,null,null,null,null,null,null,null,null,null,null,null,null,null,null,null,null,null,null,null,null,"Juni",null,null,null,null,null,null,null,null,null,null,null,null,null,null,null,null,null,null,null,null,null,null,null,null,null,null,null,null,null,"Juli",null,null,null,null,null,null,null,null,null,null,null,null,null,null,null,null,null,null,null,null,null,null,null,null,null,null,null,null,null,null,"August",null,null,null,null,null,null,null,null,null,null,null,null,null,null,null,null,null,null,null,null,null,null,null,null,null,null,null,null,null,null,"September",null,null,null,null,null,null,null,null,null,null,null,null,null,null,null,null,null,null,null,null,null,null,null,null,null,null,null,null,null,"Oktober",null,null,null,null,null,null,null,null,null,null,null,null,null,null,null,null,null,null,null,null,null,null,null,null,null,null,null,null,null,null,"November",null,null,null,null,null,null,null,null,null,null,null,null,null,null,null,null,null,null,null,null,null,null,null,null,null,null,null,null,null,"Dezember"]
["Mitarbeiter           ",null,null,{"$f":"TODAY()","v":"2014-07-29"},"1.","2.","3.","4.","5.","6.","7.","8.","9.","10.","11.","12.","13.","14.","15.","16.","17.","18.","19.","20.","21.","22.","23.","24.","25.","26.","27.","28.","29.","30.","31.","1.","2.","3.","4.","5.","6.","7.","8.","9.","10.","11.","12.","13.","14.","15.","16.","17.","18.","19.","20.","21.","22.","23.","24.","25.","26.","27.","28.",{"$f":"IF(Dateneingabe!E5=\"ja\",\"29.\",0)","v":0},"1.","2.","3.","4.","5.","6.","7.","8.","9.","10.","11.","12.","13.","14.","15.","16.","17.","18.","19.","20.","21.","22.","23.","24.","25.","26.","27.","28.","29.","30.","31.","1.","2.","3.","4.","5.","6.","7.","8.","9.","10.","11.","12.","13.","14.","15.","16.","17.","18.","19.","20.","21.","22.","23.","24.","25.","26.","27.","28.","29.","30.","1.","2.","3.","4.","5.","6.","7.","8.","9.","10.","11.","12.","13.","14.","15.","16.","17.","18.","19.","20.","21.","22.","23.","24.","25.","26.","27.","28.","29.","30.","31.","1.","2.","3.","4.","5.","6.","7.","8.","9.","10.","11.","12.","13.","14.","15.","16.","17.","18.","19.","20.","21.","22.","23.","24.","25.","26.","27.","28.","29.","30.","1.","2.","3.","4.","5.","6.","7.","8.","9.","10.","11.","12.","13.","14.","15.","16.","17.","18.","19.","20.","21.","22.","23.","24.","25.","26.","27.","28.","29.","30.","31.","1.","2.","3.","4.","5.","6.","7.","8.","9.","10.","11.","12.","13.","14.","15.","16.","17.","18.","19.","20.","21.","22.","23.","24.","25.","26.","27.","28.","29.","30.","31.","1.","2.","3.","4.","5.","6.","7.","8.","9.","10.","11.","12.","13.","14.","15.","16.","17.","18.","19.","20.","21.","22.","23.","24.","25.","26.","27.","28.","29.","30.","1.","2.","3.","4.","5.","6.","7.","8.","9.","10.","11.","12.","13.","14.","15.","16.","17.","18.","19.","20.","21.","22.","23.","24.","25.","26.","27.","28.","29.","30.","31.","1.","2.","3.","4.","5.","6.","7.","8.","9.","10.","11.","12.","13.","14.","15.","16.","17.","18.","19.","20.","21.","22.","23.","24.","25.","26.","27.","28.","29.","30.","1.","2.","3.","4.","5.","6.","7.","8.","9.","10.","11.","12.","13.","14.","15.","16.","17.","18.","19.","20.","21.","22.","23.","24.","25.","26.","27.","28.","29.","30.","31."]
["Name, Vorname","Stamm-Nr.","Bemerkung",null,{"$f":"Dateneingabe!B3","v":"Mi"},{"$f":"Dateneingabe!C3","v":"Do"},{"$f":"Dateneingabe!D3","v":"Fr"},{"$f":"Dateneingabe!E3","v":"Sa"},{"$f":"Dateneingabe!B5","v":"So"},{"$f":"Dateneingabe!C5","v":"Mo"},{"$f":"Dateneingabe!D5","v":"Di"},{"$f":"E4","v":"Mi"},"Do","Fr","Sa","So","Mo","Di","Mi","Do","Fr","Sa","So","Mo","Di","Mi","Do","Fr","Sa","So","Mo","Di","Mi","Do","Fr","Sa","So","Mo","Di","Mi","Do","Fr","Sa","So","Mo","Di","Mi","Do","Fr","Sa","So","Mo","Di","Mi","Do","Fr","Sa","So","Mo","Di","Mi","Do","Fr",{"$f":"IF(BL3=0,0,BE4)","v":0},{"$f":"IF($BL$4=0,BE4,BF4)","v":"Sa"},"So","Mo","Di","Mi","Do","Fr",{"$f":"BM4","v":"Sa"},"So","Mo","Di","Mi","Do","Fr","Sa","So","Mo","Di","Mi","Do","Fr","Sa","So","Mo","Di","Mi","Do","Fr","Sa","So","Mo","Di","Mi","Do","Fr","Sa","So","Mo","Di","Mi","Do","Fr","Sa","So","Mo","Di","Mi","Do","Fr","Sa","So","Mo","Di","Mi","Do","Fr","Sa","So","Mo","Di","Mi","Do","Fr","Sa","So","Mo","Di","Mi","Do","Fr","Sa",{"$f":"DY4","v":"So"},"Mo","Di","Mi","Do","Fr","Sa","So","Mo","Di","Mi","Do","Fr","Sa","So","Mo","Di","Mi","Do","Fr","Sa","So","Mo","Di","Mi","Do","Fr","Sa","So","Mo","Di","Mi","Do","Fr","Sa","So","Mo","Di","Mi","Do","Fr","Sa","So","Mo","Di","Mi","Do","Fr","Sa","So","Mo","Di","Mi","Do","Fr","Sa","So","Mo","Di","Mi","Do","Fr","Sa","So",{"$f":"GK4","v":"Mo"},"Di","Mi","Do","Fr","Sa","So","Mo","Di","Mi","Do","Fr","Sa","So","Mo","Di","Mi","Do","Fr","Sa","So","Mo","Di","Mi","Do","Fr","Sa","So","Mo","Di","Mi","Do","Fr","Sa","So","Mo","Di","Mi","Do","Fr","Sa","So","Mo","Di","Mi","Do","Fr","Sa","So","Mo","Di","Mi","Do","Fr","Sa","So","Mo","Di","Mi","Do","Fr","Sa","So","Mo",{"$f":"IW4","v":"Di"},"Mi","Do","Fr","Sa","So","Mo","Di","Mi","Do","Fr","Sa","So","Mo","Di","Mi","Do","Fr","Sa","So","Mo","Di","Mi","Do","Fr","Sa","So","Mo","Di","Mi","Do","Fr","Sa","So","Mo","Di","Mi","Do","Fr","Sa","So","Mo","Di","Mi","Do","Fr","Sa","So","Mo","Di","Mi","Do","Fr","Sa","So","Mo","Di","Mi","Do","Fr","Sa","So","Mo","Di",{"$f":"LI4","v":"Mi"},"Do","Fr","Sa","So","Mo","Di","Mi","Do","Fr","Sa","So","Mo","Di","Mi","Do","Fr","Sa","So","Mo","Di","Mi","Do","Fr","Sa","So","Mo","Di","Mi","Do","Fr","Sa","So","Mo","Di","Mi","Do","Fr","Sa","So","Mo","Di","Mi",null,null,null,null,null,null,null,null,{"$f":"CONCATENATE(COUNTIFS(E5:AI154,\"U\"),\" Tage\")","v":"0 Tage"},null,null,null,null,null,null,null,null,null,null,null,null,null,null,null,null,null,null,null,null,null,null,null,null,null,null,null,null,null,null,{"$f":"CONCATENATE(COUNTIFS(AJ5:BL154,\"U\"),\" Tage\")","v":"0 Tage"},null,null,null,null,null,null,null,null,null,null,null,null,null,null,null,null,null,null,null,null,null,null,null,null,null,null,null,null,{"$f":"CONCATENATE(COUNTIFS(BM5:CQ154,\"U\"),\" Tage\")","v":"0 Tage"},null,null,null,null,null,null,null,null,null,null,null,null,null,null,null,null,null,null,null,null,null,null,null,null,null,null,null,null,null,null,{"$f":"CONCATENATE(COUNTIFS(CR5:DU154,\"U\"),\" Tage\")","v":"0 Tage"},null,null,null,null,null,null,null,null,null,null,null,null,null,null,null,null,null,null,null,null,null,null,null,null,null,null,null,null,null,{"$f":"CONCATENATE(COUNTIFS(DV5:EZ154,\"U\"),\" Tage\")","v":"0 Tage"},null,null,null,null,null,null,null,null,null,null,null,null,null,null,null,null,null,null,null,null,null,null,null,null,null,null,null,null,null,null,{"$f":"CONCATENATE(COUNTIFS(FA5:GD154,\"U\"),\" Tage\")","v":"0 Tage"},null,null,null,null,null,null,null,null,null,null,null,null,null,null,null,null,null,null,null,null,null,null,null,null,null,null,null,null,null,{"$f":"CONCATENATE(COUNTIFS(GE5:HI154,\"U\"),\" Tage\")","v":"0 Tage"},null,null,null,null,null,null,null,null,null,null,null,null,null,null,null,null,null,null,null,null,null,null,null,null,null,null,null,null,null,null,{"$f":"CONCATENATE(COUNTIFS(HJ5:IN154,\"U\"),\" Tage\")","v":"0 Tage"},null,null,null,null,null,null,null,null,null,null,null,null,null,null,null,null,null,null,null,null,null,null,null,null,null,null,null,null,null,null,{"$f":"CONCATENATE(COUNTIFS(IO5:JR154,\"U\"),\" Tage\")","v":"0 Tage"},null,null,null,null,null,null,null,null,null,null,null,null,null,null,null,null,null,null,null,null,null,null,null,null,null,null,null,null,null,{"$f":"CONCATENATE(COUNTIFS(JS5:KW154,\"U\"),\" Tage\")","v":"0 Tage"},null,null,null,null,null,null,null,null,null,null,null,null,null,null,null,null,null,null,null,null,null,null,null,null,null,null,null,null,null,null,{"$f":"CONCATENATE(COUNTIFS(KX5:MA154,\"U\"),\" Tage\")","v":"0 Tage"},null,null,null,null,null,null,null,null,null,null,null,null,null,null,null,null,null,null,null,null,null,null,null,null,null,null,null,null,null,{"$f":"CONCATENATE(COUNTIFS(MB5:NF154,\"U\"),\" Tage\")","v":"0 Tage"}]
[{"$f":"IF(Dateneingabe!A7=0,\"zzz\",Dateneingabe!A7)","v":"zzz"},{"$f":"IF(Dateneingabe!B7=0,\"zzz\",Dateneingabe!B7)","v":"zzz"},{"$f":"IF(Dateneingabe!C7=0,\"zzz\",Dateneingabe!C7)","v":"zzz"},{"$f":"IF($D$3<$E$1,\"<?\",IF($D$3>$NF$1,\">?\",LOOKUP($D$3,$E$1:$NF$1,E5:NF5)))","v":0},null,null,null,null,null,null,null,null,null,null,null,null,null,null,null,null,null,null,null,null,null,null,null,null,null,null,null,null,null,null,null,null,null,null,null,null,null,null,null,null,null,null,null,null,null,null,null,null,null,null,null,null,null,null,null,null,null,null,null,null,null,null,null,null,null,null,null,null,null,null,null,null,null,null,null,null,null,null,null,null,null,null,null,null,null,null,null,null,null,null,null,null,null,null,null,null,null,null,null,null,null,null,null,null,null,null,null,null,null,null,null,null,null,null,null,null,null,null,null,null,null,null,null,null,null,null,null,null,null,null,null,null,null,null,null,null,null,null,null,null,null,null,null,null,null,null,null,null,null,null,null,null,null,null,null,null,null,null,null,null,null,null,null,null,null,null,null,null,null,null,null,null,null,null,null,null,null,null,null,null,null,null,null,null,null,null,null,null,null,null,null,null,null,null,null,null,null,null,null,null,null,null,null,null,null,null,null,null,null,null,null,null,null,null,null,null,null,null,null,null,null,null,null,null,null,null,null,null,null,null,null,null,null,null,null,null,null,null,null,null,null,null,null,null,null,null,null,null,null,null,null,null,null,null,null,null,null,null,null,null,null,null,null,null,null,null,null,null,null,null,null,null,null,null,null,null,null,null,null,null,null,null,null,null,null,null,null,null,null,null,null,null,null,null,null,null,null,null,null,null,null,null,null,null,null,null,null,null,null,null,null,null,null,null,null,null,null,null,null,null,null,null,null,null,null,null,null,null,null,null,null,null,null,null,null,null,null,null,null,null,null,null,null,null,null,null,null,null,null,null,null,null,null,null,null,null,null,null,null,null,null,null,null,null,null,null,null,{"$f":"Dateneingabe!N7","v":1},null,{"$f":"Dateneingabe!K7","v":0},{"$f":"Dateneingabe!L7","v":0},{"$f":"Dateneingabe!M7","v":0},{"$f":"COUNTIFS(E5:NF5,\"U\")","v":0},{"$f":"NL5-NM5","v":0}]
[{"$f":"IF(Dateneingabe!A8=0,\"zzz\",Dateneingabe!A8)","v":"zzz"},{"$f":"IF(Dateneingabe!B8=0,\"zzz\",Dateneingabe!B8)","v":"zzz"},{"$f":"IF(Dateneingabe!C8=0,\"zzz\",Dateneingabe!C8)","v":"zzz"},{"$f":"IF($D$3<$E$1,\"<?\",IF($D$3>$NF$1,\">?\",LOOKUP($D$3,$E$1:$NF$1,E6:NF6)))","v":0},null,null,null,null,null,null,null,null,null,null,null,null,null,null,null,null,null,null,null,null,null,null,null,null,null,null,null,null,null,null,null,null,null,null,null,null,null,null,null,null,null,null,null,null,null,null,null,null,null,null,null,null,null,null,null,null,null,null,null,null,null,null,null,null,null,null,null,null,null,null,null,null,null,null,null,null,null,null,null,null,null,null,null,null,null,null,null,null,null,null,null,null,null,null,null,null,null,null,null,null,null,null,null,null,null,null,null,null,null,null,null,null,null,null,null,null,null,null,null,null,null,null,null,null,null,null,null,null,null,null,null,null,null,null,null,null,null,null,null,null,null,null,null,null,null,null,null,null,null,null,null,null,null,null,null,null,null,null,null,null,null,null,null,null,null,null,null,null,null,null,null,null,null,null,null,null,null,null,null,null,null,null,null,null,null,null,null,null,null,null,null,null,null,null,null,null,null,null,null,null,null,null,null,null,null,null,null,null,null,null,null,null,null,null,null,null,null,null,null,null,null,null,null,null,null,null,null,null,null,null,null,null,null,null,null,null,null,null,null,null,null,null,null,null,null,null,null,null,null,null,null,null,null,null,null,null,null,null,null,null,null,null,null,null,null,null,null,null,null,null,null,null,null,null,null,null,null,null,null,null,null,null,null,null,null,null,null,null,null,null,null,null,null,null,null,null,null,null,null,null,null,null,null,null,null,null,null,null,null,null,null,null,null,null,null,null,null,null,null,null,null,null,null,null,null,null,null,null,null,null,null,null,null,null,null,null,null,null,null,null,null,null,null,null,null,null,null,null,null,null,null,null,null,null,null,null,null,null,null,null,null,null,null,null,null,null,null,{"$f":"Dateneingabe!N8","v":2},null,{"$f":"Dateneingabe!K8","v":0},{"$f":"Dateneingabe!L8","v":0},{"$f":"Dateneingabe!M8","v":0},{"$f":"COUNTIFS(E6:NF6,\"U\")","v":0},{"$f":"NL6-NM6","v":0}]
[{"$f":"IF(Dateneingabe!A9=0,\"zzz\",Dateneingabe!A9)","v":"zzz"},{"$f":"IF(Dateneingabe!B9=0,\"zzz\",Dateneingabe!B9)","v":"zzz"},{"$f":"IF(Dateneingabe!C9=0,\"zzz\",Dateneingabe!C9)","v":"zzz"},{"$f":"IF($D$3<$E$1,\"<?\",IF($D$3>$NF$1,\">?\",LOOKUP($D$3,$E$1:$NF$1,E7:NF7)))","v":0},null,null,null,null,null,null,null,null,null,null,null,null,null,null,null,null,null,null,null,null,null,null,null,null,null,null,null,null,null,null,null,null,null,null,null,null,null,null,null,null,null,null,null,null,null,null,null,null,null,null,null,null,null,null,null,null,null,null,null,null,null,null,null,null,null,null,null,null,null,null,null,null,null,null,null,null,null,null,null,null,null,null,null,null,null,null,null,null,null,null,null,null,null,null,null,null,null,null,null,null,null,null,null,null,null,null,null,null,null,null,null,null,null,null,null,null,null,null,null,null,null,null,null,null,null,null,null,null,null,null,null,null,null,null,null,null,null,null,null,null,null,null,null,null,null,null,null,null,null,null,null,null,null,null,null,null,null,null,null,null,null,null,null,null,null,null,null,null,null,null,null,null,null,null,null,null,null,null,null,null,null,null,null,null,null,null,null,null,null,null,null,null,null,null,null,null,null,null,null,null,null,null,null,null,null,null,null,null,null,null,null,null,null,null,null,null,null,null,null,null,null,null,null,null,null,null,null,null,null,null,null,null,null,null,null,null,null,null,null,null,null,null,null,null,null,null,null,null,null,null,null,null,null,null,null,null,null,null,null,null,null,null,null,null,null,null,null,null,null,null,null,null,null,null,null,null,null,null,null,null,null,null,null,null,null,null,null,null,null,null,null,null,null,null,null,null,null,null,null,null,null,null,null,null,null,null,null,null,null,null,null,null,null,null,null,null,null,null,null,null,null,null,null,null,null,null,null,null,null,null,null,null,null,null,null,null,null,null,null,null,null,null,null,null,null,null,null,null,null,null,null,null,null,null,null,null,null,null,null,null,null,null,null,null,null,null,null,{"$f":"Dateneingabe!N9","v":3},null,{"$f":"Dateneingabe!K9","v":0},{"$f":"Dateneingabe!L9","v":0},{"$f":"Dateneingabe!M9","v":0},{"$f":"COUNTIFS(E7:NF7,\"U\")","v":0},{"$f":"NL7-NM7","v":0}]
[{"$f":"IF(Dateneingabe!A10=0,\"zzz\",Dateneingabe!A10)","v":"zzz"},{"$f":"IF(Dateneingabe!B10=0,\"zzz\",Dateneingabe!B10)","v":"zzz"},{"$f":"IF(Dateneingabe!C10=0,\"zzz\",Dateneingabe!C10)","v":"zzz"},{"$f":"IF($D$3<$E$1,\"<?\",IF($D$3>$NF$1,\">?\",LOOKUP($D$3,$E$1:$NF$1,E8:NF8)))","v":0},null,null,null,null,null,null,null,null,null,null,null,null,null,null,null,null,null,null,null,null,null,null,null,null,null,null,null,null,null,null,null,null,null,null,null,null,null,null,null,null,null,null,null,null,null,null,null,null,null,null,null,null,null,null,null,null,null,null,null,null,null,null,null,null,null,null,null,null,null,null,null,null,null,null,null,null,null,null,null,null,null,null,null,null,null,null,null,null,null,null,null,null,null,null,null,null,null,null,null,null,null,null,null,null,null,null,null,null,null,null,null,null,null,null,null,null,null,null,null,null,null,null,null,null,null,null,null,null,null,null,null,null,null,null,null,null,null,null,null,null,null,null,null,null,null,null,null,null,null,null,null,null,null,null,null,null,null,null,null,null,null,null,null,null,null,null,null,null,null,null,null,null,null,null,null,null,null,null,null,null,null,null,null,null,null,null,null,null,null,null,null,null,null,null,null,null,null,null,null,null,null,null,null,null,null,null,null,null,null,null,null,null,null,null,null,null,null,null,null,null,null,null,null,null,null,null,null,null,null,null,null,null,null,null,null,null,null,null,null,null,null,null,null,null,null,null,null,null,null,null,null,null,null,null,null,null,null,null,null,null,null,null,null,null,null,null,null,null,null,null,null,null,null,null,null,null,null,null,null,null,null,null,null,null,null,null,null,null,null,null,null,null,null,null,null,null,null,null,null,null,null,null,null,null,null,null,null,null,null,null,null,null,null,null,null,null,null,null,null,null,null,null,null,null,null,null,null,null,null,null,null,null,null,null,null,null,null,null,null,null,null,null,null,null,null,null,null,null,null,null,null,null,null,null,null,null,null,null,null,null,null,null,null,null,null,null,null,{"$f":"Dateneingabe!N10","v":4},null,{"$f":"Dateneingabe!K10","v":0},{"$f":"Dateneingabe!L10","v":0},{"$f":"Dateneingabe!M10","v":0},{"$f":"COUNTIFS(E8:NF8,\"U\")","v":0},{"$f":"NL8-NM8","v":0}]
[{"$f":"IF(Dateneingabe!A11=0,\"zzz\",Dateneingabe!A11)","v":"zzz"},{"$f":"IF(Dateneingabe!B11=0,\"zzz\",Dateneingabe!B11)","v":"zzz"},{"$f":"IF(Dateneingabe!C11=0,\"zzz\",Dateneingabe!C11)","v":"zzz"},{"$f":"IF($D$3<$E$1,\"<?\",IF($D$3>$NF$1,\">?\",LOOKUP($D$3,$E$1:$NF$1,E9:NF9)))","v":0},null,null,null,null,null,null,null,null,null,null,null,null,null,null,null,null,null,null,null,null,null,null,null,null,null,null,null,null,null,null,null,null,null,null,null,null,null,null,null,null,null,null,null,null,null,null,null,null,null,null,null,null,null,null,null,null,null,null,null,null,null,null,null,null,null,null,null,null,null,null,null,null,null,null,null,null,null,null,null,null,null,null,null,null,null,null,null,null,null,null,null,null,null,null,null,null,null,null,null,null,null,null,null,null,null,null,null,null,null,null,null,null,null,null,null,null,null,null,null,null,null,null,null,null,null,null,null,null,null,null,null,null,null,null,null,null,null,null,null,null,null,null,null,null,null,null,null,null,null,null,null,null,null,null,null,null,null,null,null,null,null,null,null,null,null,null,null,null,null,null,null,null,null,null,null,null,null,null,null,null,null,null,null,null,null,null,null,null,null,null,null,null,null,null,null,null,null,null,null,null,null,null,null,null,null,null,null,null,null,null,null,null,null,null,null,null,null,null,null,null,null,null,null,null,null,null,null,null,null,null,null,null,null,null,null,null,null,null,null,null,null,null,null,null,null,null,null,null,null,null,null,null,null,null,null,null,null,null,null,null,null,null,null,null,null,null,null,null,null,null,null,null,null,null,null,null,null,null,null,null,null,null,null,null,null,null,null,null,null,null,null,null,null,null,null,null,null,null,null,null,null,null,null,null,null,null,null,null,null,null,null,null,null,null,null,null,null,null,null,null,null,null,null,null,null,null,null,null,null,null,null,null,null,null,null,null,null,null,null,null,null,null,null,null,null,null,null,null,null,null,null,null,null,null,null,null,null,null,null,null,null,null,null,null,null,null,null,{"$f":"Dateneingabe!N11","v":5},null,{"$f":"Dateneingabe!K11","v":0},{"$f":"Dateneingabe!L11","v":0},{"$f":"Dateneingabe!M11","v":0},{"$f":"COUNTIFS(E9:NF9,\"U\")","v":0},{"$f":"NL9-NM9","v":0}]
[{"$f":"IF(Dateneingabe!A12=0,\"zzz\",Dateneingabe!A12)","v":"zzz"},{"$f":"IF(Dateneingabe!B12=0,\"zzz\",Dateneingabe!B12)","v":"zzz"},{"$f":"IF(Dateneingabe!C12=0,\"zzz\",Dateneingabe!C12)","v":"zzz"},{"$f":"IF($D$3<$E$1,\"<?\",IF($D$3>$NF$1,\">?\",LOOKUP($D$3,$E$1:$NF$1,E10:NF10)))","v":0},null,null,null,null,null,null,null,null,null,null,null,null,null,null,null,null,null,null,null,null,null,null,null,null,null,null,null,null,null,null,null,null,null,null,null,null,null,null,null,null,null,null,null,null,null,null,null,null,null,null,null,null,null,null,null,null,null,null,null,null,null,null,null,null,null,null,null,null,null,null,null,null,null,null,null,null,null,null,null,null,null,null,null,null,null,null,null,null,null,null,null,null,null,null,null,null,null,null,null,null,null,null,null,null,null,null,null,null,null,null,null,null,null,null,null,null,null,null,null,null,null,null,null,null,null,null,null,null,null,null,null,null,null,null,null,null,null,null,null,null,null,null,null,null,null,null,null,null,null,null,null,null,null,null,null,null,null,null,null,null,null,null,null,null,null,null,null,null,null,null,null,null,null,null,null,null,null,null,null,null,null,null,null,null,null,null,null,null,null,null,null,null,null,null,null,null,null,null,null,null,null,null,null,null,null,null,null,null,null,null,null,null,null,null,null,null,null,null,null,null,null,null,null,null,null,null,null,null,null,null,null,null,null,null,null,null,null,null,null,null,null,null,null,null,null,null,null,null,null,null,null,null,null,null,null,null,null,null,null,null,null,null,null,null,null,null,null,null,null,null,null,null,null,null,null,null,null,null,null,null,null,null,null,null,null,null,null,null,null,null,null,null,null,null,null,null,null,null,null,null,null,null,null,null,null,null,null,null,null,null,null,null,null,null,null,null,null,null,null,null,null,null,null,null,null,null,null,null,null,null,null,null,null,null,null,null,null,null,null,null,null,null,null,null,null,null,null,null,null,null,null,null,null,null,null,null,null,null,null,null,null,null,null,null,null,null,null,{"$f":"Dateneingabe!N12","v":6},null,{"$f":"Dateneingabe!K12","v":0},{"$f":"Dateneingabe!L12","v":0},{"$f":"Dateneingabe!M12","v":0},{"$f":"COUNTIFS(E10:NF10,\"U\")","v":0},{"$f":"NL10-NM10","v":0}]
[{"$f":"IF(Dateneingabe!A13=0,\"zzz\",Dateneingabe!A13)","v":"zzz"},{"$f":"IF(Dateneingabe!B13=0,\"zzz\",Dateneingabe!B13)","v":"zzz"},{"$f":"IF(Dateneingabe!C13=0,\"zzz\",Dateneingabe!C13)","v":"zzz"},{"$f":"IF($D$3<$E$1,\"<?\",IF($D$3>$NF$1,\">?\",LOOKUP($D$3,$E$1:$NF$1,E11:NF11)))","v":0},null,null,null,null,null,null,null,null,null,null,null,null,null,null,null,null,null,null,null,null,null,null,null,null,null,null,null,null,null,null,null,null,null,null,null,null,null,null,null,null,null,null,null,null,null,null,null,null,null,null,null,null,null,null,null,null,null,null,null,null,null,null,null,null,null,null,null,null,null,null,null,null,null,null,null,null,null,null,null,null,null,null,null,null,null,null,null,null,null,null,null,null,null,null,null,null,null,null,null,null,null,null,null,null,null,null,null,null,null,null,null,null,null,null,null,null,null,null,null,null,null,null,null,null,null,null,null,null,null,null,null,null,null,null,null,null,null,null,null,null,null,null,null,null,null,null,null,null,null,null,null,null,null,null,null,null,null,null,null,null,null,null,null,null,null,null,null,null,null,null,null,null,null,null,null,null,null,null,null,null,null,null,null,null,null,null,null,null,null,null,null,null,null,null,null,null,null,null,null,null,null,null,null,null,null,null,null,null,null,null,null,null,null,null,null,null,null,null,null,null,null,null,null,null,null,null,null,null,null,null,null,null,null,null,null,null,null,null,null,null,null,null,null,null,null,null,null,null,null,null,null,null,null,null,null,null,null,null,null,null,null,null,null,null,null,null,null,null,null,null,null,null,null,null,null,null,null,null,null,null,null,null,null,null,null,null,null,null,null,null,null,null,null,null,null,null,null,null,null,null,null,null,null,null,null,null,null,null,null,null,null,null,null,null,null,null,null,null,null,null,null,null,null,null,null,null,null,null,null,null,null,null,null,null,null,null,null,null,null,null,null,null,null,null,null,null,null,null,null,null,null,null,null,null,null,null,null,null,null,null,null,null,null,null,null,null,null,{"$f":"Dateneingabe!N13","v":7},null,{"$f":"Dateneingabe!K13","v":0},{"$f":"Dateneingabe!L13","v":0},{"$f":"Dateneingabe!M13","v":0},{"$f":"COUNTIFS(E11:NF11,\"U\")","v":0},{"$f":"NL11-NM11","v":0}]
[{"$f":"IF(Dateneingabe!A14=0,\"zzz\",Dateneingabe!A14)","v":"zzz"},{"$f":"IF(Dateneingabe!B14=0,\"zzz\",Dateneingabe!B14)","v":"zzz"},{"$f":"IF(Dateneingabe!C14=0,\"zzz\",Dateneingabe!C14)","v":"zzz"},{"$f":"IF($D$3<$E$1,\"<?\",IF($D$3>$NF$1,\">?\",LOOKUP($D$3,$E$1:$NF$1,E12:NF12)))","v":0},null,null,null,null,null,null,null,null,null,null,null,null,null,null,null,null,null,null,null,null,null,null,null,null,null,null,null,null,null,null,null,null,null,null,null,null,null,null,null,null,null,null,null,null,null,null,null,null,null,null,null,null,null,null,null,null,null,null,null,null,null,null,null,null,null,null,null,null,null,null,null,null,null,null,null,null,null,null,null,null,null,null,null,null,null,null,null,null,null,null,null,null,null,null,null,null,null,null,null,null,null,null,null,null,null,null,null,null,null,null,null,null,null,null,null,null,null,null,null,null,null,null,null,null,null,null,null,null,null,null,null,null,null,null,null,null,null,null,null,null,null,null,null,null,null,null,null,null,null,null,null,null,null,null,null,null,null,null,null,null,null,null,null,null,null,null,null,null,null,null,null,null,null,null,null,null,null,null,null,null,null,null,null,null,null,null,null,null,null,null,null,null,null,null,null,null,null,null,null,null,null,null,null,null,null,null,null,null,null,null,null,null,null,null,null,null,null,null,null,null,null,null,null,null,null,null,null,null,null,null,null,null,null,null,null,null,null,null,null,null,null,null,null,null,null,null,null,null,null,null,null,null,null,null,null,null,null,null,null,null,null,null,null,null,null,null,null,null,null,null,null,null,null,null,null,null,null,null,null,null,null,null,null,null,null,null,null,null,null,null,null,null,null,null,null,null,null,null,null,null,null,null,null,null,null,null,null,null,null,null,null,null,null,null,null,null,null,null,null,null,null,null,null,null,null,null,null,null,null,null,null,null,null,null,null,null,null,null,null,null,null,null,null,null,null,null,null,null,null,null,null,null,null,null,null,null,null,null,null,null,null,null,null,null,null,null,null,{"$f":"Dateneingabe!N14","v":8},null,{"$f":"Dateneingabe!K14","v":0},{"$f":"Dateneingabe!L14","v":0},{"$f":"Dateneingabe!M14","v":0},{"$f":"COUNTIFS(E12:NF12,\"U\")","v":0},{"$f":"NL12-NM12","v":0}]
[{"$f":"IF(Dateneingabe!A15=0,\"zzz\",Dateneingabe!A15)","v":"zzz"},{"$f":"IF(Dateneingabe!B15=0,\"zzz\",Dateneingabe!B15)","v":"zzz"},{"$f":"IF(Dateneingabe!C15=0,\"zzz\",Dateneingabe!C15)","v":"zzz"},{"$f":"IF($D$3<$E$1,\"<?\",IF($D$3>$NF$1,\">?\",LOOKUP($D$3,$E$1:$NF$1,E13:NF13)))","v":0},null,null,null,null,null,null,null,null,null,null,null,null,null,null,null,null,null,null,null,null,null,null,null,null,null,null,null,null,null,null,null,null,null,null,null,null,null,null,null,null,null,null,null,null,null,null,null,null,null,null,null,null,null,null,null,null,null,null,null,null,null,null,null,null,null,null,null,null,null,null,null,null,null,null,null,null,null,null,null,null,null,null,null,null,null,null,null,null,null,null,null,null,null,null,null,null,null,null,null,null,null,null,null,null,null,null,null,null,null,null,null,null,null,null,null,null,null,null,null,null,null,null,null,null,null,null,null,null,null,null,null,null,null,null,null,null,null,null,null,null,null,null,null,null,null,null,null,null,null,null,null,null,null,null,null,null,null,null,null,null,null,null,null,null,null,null,null,null,null,null,null,null,null,null,null,null,null,null,null,null,null,null,null,null,null,null,null,null,null,null,null,null,null,null,null,null,null,null,null,null,null,null,null,null,null,null,null,null,null,null,null,null,null,null,null,null,null,null,null,null,null,null,null,null,null,null,null,null,null,null,null,null,null,null,null,null,null,null,null,null,null,null,null,null,null,null,null,null,null,null,null,null,null,null,null,null,null,null,null,null,null,null,null,null,null,null,null,null,null,null,null,null,null,null,null,null,null,null,null,null,null,null,null,null,null,null,null,null,null,null,null,null,null,null,null,null,null,null,null,null,null,null,null,null,null,null,null,null,null,null,null,null,null,null,null,null,null,null,null,null,null,null,null,null,null,null,null,null,null,null,null,null,null,null,null,null,null,null,null,null,null,null,null,null,null,null,null,null,null,null,null,null,null,null,null,null,null,null,null,null,null,null,null,null,null,null,null,{"$f":"Dateneingabe!N15","v":9},null,{"$f":"Dateneingabe!K15","v":0},{"$f":"Dateneingabe!L15","v":0},{"$f":"Dateneingabe!M15","v":0},{"$f":"COUNTIFS(E13:NF13,\"U\")","v":0},{"$f":"NL13-NM13","v":0}]
[{"$f":"IF(Dateneingabe!A16=0,\"zzz\",Dateneingabe!A16)","v":"zzz"},{"$f":"IF(Dateneingabe!B16=0,\"zzz\",Dateneingabe!B16)","v":"zzz"},{"$f":"IF(Dateneingabe!C16=0,\"zzz\",Dateneingabe!C16)","v":"zzz"},{"$f":"IF($D$3<$E$1,\"<?\",IF($D$3>$NF$1,\">?\",LOOKUP($D$3,$E$1:$NF$1,E14:NF14)))","v":0},null,null,null,null,null,null,null,null,null,null,null,null,null,null,null,null,null,null,null,null,null,null,null,null,null,null,null,null,null,null,null,null,null,null,null,null,null,null,null,null,null,null,null,null,null,null,null,null,null,null,null,null,null,null,null,null,null,null,null,null,null,null,null,null,null,null,null,null,null,null,null,null,null,null,null,null,null,null,null,null,null,null,null,null,null,null,null,null,null,null,null,null,null,null,null,null,null,null,null,null,null,null,null,null,null,null,null,null,null,null,null,null,null,null,null,null,null,null,null,null,null,null,null,null,null,null,null,null,null,null,null,null,null,null,null,null,null,null,null,null,null,null,null,null,null,null,null,null,null,null,null,null,null,null,null,null,null,null,null,null,null,null,null,null,null,null,null,null,null,null,null,null,null,null,null,null,null,null,null,null,null,null,null,null,null,null,null,null,null,null,null,null,null,null,null,null,null,null,null,null,null,null,null,null,null,null,null,null,null,null,null,null,null,null,null,null,null,null,null,null,null,null,null,null,null,null,null,null,null,null,null,null,null,null,null,null,null,null,null,null,null,null,null,null,null,null,null,null,null,null,null,null,null,null,null,null,null,null,null,null,null,null,null,null,null,null,null,null,null,null,null,null,null,null,null,null,null,null,null,null,null,null,null,null,null,null,null,null,null,null,null,null,null,null,null,null,null,null,null,null,null,null,null,null,null,null,null,null,null,null,null,null,null,null,null,null,null,null,null,null,null,null,null,null,null,null,null,null,null,null,null,null,null,null,null,null,null,null,null,null,null,null,null,null,null,null,null,null,null,null,null,null,null,null,null,null,null,null,null,null,null,null,null,null,null,null,null,{"$f":"Dateneingabe!N16","v":10},null,{"$f":"Dateneingabe!K16","v":0},{"$f":"Dateneingabe!L16","v":0},{"$f":"Dateneingabe!M16","v":0},{"$f":"COUNTIFS(E14:NF14,\"U\")","v":0},{"$f":"NL14-NM14","v":0}]
[{"$f":"IF(Dateneingabe!A17=0,\"zzz\",Dateneingabe!A17)","v":"zzz"},{"$f":"IF(Dateneingabe!B17=0,\"zzz\",Dateneingabe!B17)","v":"zzz"},{"$f":"IF(Dateneingabe!C17=0,\"zzz\",Dateneingabe!C17)","v":"zzz"},{"$f":"IF($D$3<$E$1,\"<?\",IF($D$3>$NF$1,\">?\",LOOKUP($D$3,$E$1:$NF$1,E15:NF15)))","v":0},null,null,null,null,null,null,null,null,null,null,null,null,null,null,null,null,null,null,null,null,null,null,null,null,null,null,null,null,null,null,null,null,null,null,null,null,null,null,null,null,null,null,null,null,null,null,null,null,null,null,null,null,null,null,null,null,null,null,null,null,null,null,null,null,null,null,null,null,null,null,null,null,null,null,null,null,null,null,null,null,null,null,null,null,null,null,null,null,null,null,null,null,null,null,null,null,null,null,null,null,null,null,null,null,null,null,null,null,null,null,null,null,null,null,null,null,null,null,null,null,null,null,null,null,null,null,null,null,null,null,null,null,null,null,null,null,null,null,null,null,null,null,null,null,null,null,null,null,null,null,null,null,null,null,null,null,null,null,null,null,null,null,null,null,null,null,null,null,null,null,null,null,null,null,null,null,null,null,null,null,null,null,null,null,null,null,null,null,null,null,null,null,null,null,null,null,null,null,null,null,null,null,null,null,null,null,null,null,null,null,null,null,null,null,null,null,null,null,null,null,null,null,null,null,null,null,null,null,null,null,null,null,null,null,null,null,null,null,null,null,null,null,null,null,null,null,null,null,null,null,null,null,null,null,null,null,null,null,null,null,null,null,null,null,null,null,null,null,null,null,null,null,null,null,null,null,null,null,null,null,null,null,null,null,null,null,null,null,null,null,null,null,null,null,null,null,null,null,null,null,null,null,null,null,null,null,null,null,null,null,null,null,null,null,null,null,null,null,null,null,null,null,null,null,null,null,null,null,null,null,null,null,null,null,null,null,null,null,null,null,null,null,null,null,null,null,null,null,null,null,null,null,null,null,null,null,null,null,null,null,null,null,null,null,null,null,null,{"$f":"Dateneingabe!N17","v":11},null,{"$f":"Dateneingabe!K17","v":0},{"$f":"Dateneingabe!L17","v":0},{"$f":"Dateneingabe!M17","v":0},{"$f":"COUNTIFS(E15:NF15,\"U\")","v":0},{"$f":"NL15-NM15","v":0}]
[{"$f":"IF(Dateneingabe!A18=0,\"zzz\",Dateneingabe!A18)","v":"zzz"},{"$f":"IF(Dateneingabe!B18=0,\"zzz\",Dateneingabe!B18)","v":"zzz"},{"$f":"IF(Dateneingabe!C18=0,\"zzz\",Dateneingabe!C18)","v":"zzz"},{"$f":"IF($D$3<$E$1,\"<?\",IF($D$3>$NF$1,\">?\",LOOKUP($D$3,$E$1:$NF$1,E16:NF16)))","v":0},null,null,null,null,null,null,null,null,null,null,null,null,null,null,null,null,null,null,null,null,null,null,null,null,null,null,null,null,null,null,null,null,null,null,null,null,null,null,null,null,null,null,null,null,null,null,null,null,null,null,null,null,null,null,null,null,null,null,null,null,null,null,null,null,null,null,null,null,null,null,null,null,null,null,null,null,null,null,null,null,null,null,null,null,null,null,null,null,null,null,null,null,null,null,null,null,null,null,null,null,null,null,null,null,null,null,null,null,null,null,null,null,null,null,null,null,null,null,null,null,null,null,null,null,null,null,null,null,null,null,null,null,null,null,null,null,null,null,null,null,null,null,null,null,null,null,null,null,null,null,null,null,null,null,null,null,null,null,null,null,null,null,null,null,null,null,null,null,null,null,null,null,null,null,null,null,null,null,null,null,null,null,null,null,null,null,null,null,null,null,null,null,null,null,null,null,null,null,null,null,null,null,null,null,null,null,null,null,null,null,null,null,null,null,null,null,null,null,null,null,null,null,null,null,null,null,null,null,null,null,null,null,null,null,null,null,null,null,null,null,null,null,null,null,null,null,null,null,null,null,null,null,null,null,null,null,null,null,null,null,null,null,null,null,null,null,null,null,null,null,null,null,null,null,null,null,null,null,null,null,null,null,null,null,null,null,null,null,null,null,null,null,null,null,null,null,null,null,null,null,null,null,null,null,null,null,null,null,null,null,null,null,null,null,null,null,null,null,null,null,null,null,null,null,null,null,null,null,null,null,null,null,null,null,null,null,null,null,null,null,null,null,null,null,null,null,null,null,null,null,null,null,null,null,null,null,null,null,null,null,null,null,null,null,null,null,null,{"$f":"Dateneingabe!N18","v":12},null,{"$f":"Dateneingabe!K18","v":0},{"$f":"Dateneingabe!L18","v":0},{"$f":"Dateneingabe!M18","v":0},{"$f":"COUNTIFS(E16:NF16,\"U\")","v":0},{"$f":"NL16-NM16","v":0}]
[{"$f":"IF(Dateneingabe!A19=0,\"zzz\",Dateneingabe!A19)","v":"zzz"},{"$f":"IF(Dateneingabe!B19=0,\"zzz\",Dateneingabe!B19)","v":"zzz"},{"$f":"IF(Dateneingabe!C19=0,\"zzz\",Dateneingabe!C19)","v":"zzz"},{"$f":"IF($D$3<$E$1,\"<?\",IF($D$3>$NF$1,\">?\",LOOKUP($D$3,$E$1:$NF$1,E17:NF17)))","v":0},null,null,null,null,null,null,null,null,null,null,null,null,null,null,null,null,null,null,null,null,null,null,null,null,null,null,null,null,null,null,null,null,null,null,null,null,null,null,null,null,null,null,null,null,null,null,null,null,null,null,null,null,null,null,null,null,null,null,null,null,null,null,null,null,null,null,null,null,null,null,null,null,null,null,null,null,null,null,null,null,null,null,null,null,null,null,null,null,null,null,null,null,null,null,null,null,null,null,null,null,null,null,null,null,null,null,null,null,null,null,null,null,null,null,null,null,null,null,null,null,null,null,null,null,null,null,null,null,null,null,null,null,null,null,null,null,null,null,null,null,null,null,null,null,null,null,null,null,null,null,null,null,null,null,null,null,null,null,null,null,null,null,null,null,null,null,null,null,null,null,null,null,null,null,null,null,null,null,null,null,null,null,null,null,null,null,null,null,null,null,null,null,null,null,null,null,null,null,null,null,null,null,null,null,null,null,null,null,null,null,null,null,null,null,null,null,null,null,null,null,null,null,null,null,null,null,null,null,null,null,null,null,null,null,null,null,null,null,null,null,null,null,null,null,null,null,null,null,null,null,null,null,null,null,null,null,null,null,null,null,null,null,null,null,null,null,null,null,null,null,null,null,null,null,null,null,null,null,null,null,null,null,null,null,null,null,null,null,null,null,null,null,null,null,null,null,null,null,null,null,null,null,null,null,null,null,null,null,null,null,null,null,null,null,null,null,null,null,null,null,null,null,null,null,null,null,null,null,null,null,null,null,null,null,null,null,null,null,null,null,null,null,null,null,null,null,null,null,null,null,null,null,null,null,null,null,null,null,null,null,null,null,null,null,null,null,null,{"$f":"Dateneingabe!N19","v":13},null,{"$f":"Dateneingabe!K19","v":0},{"$f":"Dateneingabe!L19","v":0},{"$f":"Dateneingabe!M19","v":0},{"$f":"COUNTIFS(E17:NF17,\"U\")","v":0},{"$f":"NL17-NM17","v":0}]
[{"$f":"IF(Dateneingabe!A20=0,\"zzz\",Dateneingabe!A20)","v":"zzz"},{"$f":"IF(Dateneingabe!B20=0,\"zzz\",Dateneingabe!B20)","v":"zzz"},{"$f":"IF(Dateneingabe!C20=0,\"zzz\",Dateneingabe!C20)","v":"zzz"},{"$f":"IF($D$3<$E$1,\"<?\",IF($D$3>$NF$1,\">?\",LOOKUP($D$3,$E$1:$NF$1,E18:NF18)))","v":0},null,null,null,null,null,null,null,null,null,null,null,null,null,null,null,null,null,null,null,null,null,null,null,null,null,null,null,null,null,null,null,null,null,null,null,null,null,null,null,null,null,null,null,null,null,null,null,null,null,null,null,null,null,null,null,null,null,null,null,null,null,null,null,null,null,null,null,null,null,null,null,null,null,null,null,null,null,null,null,null,null,null,null,null,null,null,null,null,null,null,null,null,null,null,null,null,null,null,null,null,null,null,null,null,null,null,null,null,null,null,null,null,null,null,null,null,null,null,null,null,null,null,null,null,null,null,null,null,null,null,null,null,null,null,null,null,null,null,null,null,null,null,null,null,null,null,null,null,null,null,null,null,null,null,null,null,null,null,null,null,null,null,null,null,null,null,null,null,null,null,null,null,null,null,null,null,null,null,null,null,null,null,null,null,null,null,null,null,null,null,null,null,null,null,null,null,null,null,null,null,null,null,null,null,null,null,null,null,null,null,null,null,null,null,null,null,null,null,null,null,null,null,null,null,null,null,null,null,null,null,null,null,null,null,null,null,null,null,null,null,null,null,null,null,null,null,null,null,null,null,null,null,null,null,null,null,null,null,null,null,null,null,null,null,null,null,null,null,null,null,null,null,null,null,null,null,null,null,null,null,null,null,null,null,null,null,null,null,null,null,null,null,null,null,null,null,null,null,null,null,null,null,null,null,null,null,null,null,null,null,null,null,null,null,null,null,null,null,null,null,null,null,null,null,null,null,null,null,null,null,null,null,null,null,null,null,null,null,null,null,null,null,null,null,null,null,null,null,null,null,null,null,null,null,null,null,null,null,null,null,null,null,null,null,null,null,null,{"$f":"Dateneingabe!N20","v":14},null,{"$f":"Dateneingabe!K20","v":0},{"$f":"Dateneingabe!L20","v":0},{"$f":"Dateneingabe!M20","v":0},{"$f":"COUNTIFS(E18:NF18,\"U\")","v":0},{"$f":"NL18-NM18","v":0}]
[{"$f":"IF(Dateneingabe!A21=0,\"zzz\",Dateneingabe!A21)","v":"zzz"},{"$f":"IF(Dateneingabe!B21=0,\"zzz\",Dateneingabe!B21)","v":"zzz"},{"$f":"IF(Dateneingabe!C21=0,\"zzz\",Dateneingabe!C21)","v":"zzz"},{"$f":"IF($D$3<$E$1,\"<?\",IF($D$3>$NF$1,\">?\",LOOKUP($D$3,$E$1:$NF$1,E19:NF19)))","v":0},null,null,null,null,null,null,null,null,null,null,null,null,null,null,null,null,null,null,null,null,null,null,null,null,null,null,null,null,null,null,null,null,null,null,null,null,null,null,null,null,null,null,null,null,null,null,null,null,null,null,null,null,null,null,null,null,null,null,null,null,null,null,null,null,null,null,null,null,null,null,null,null,null,null,null,null,null,null,null,null,null,null,null,null,null,null,null,null,null,null,null,null,null,null,null,null,null,null,null,null,null,null,null,null,null,null,null,null,null,null,null,null,null,null,null,null,null,null,null,null,null,null,null,null,null,null,null,null,null,null,null,null,null,null,null,null,null,null,null,null,null,null,null,null,null,null,null,null,null,null,null,null,null,null,null,null,null,null,null,null,null,null,null,null,null,null,null,null,null,null,null,null,null,null,null,null,null,null,null,null,null,null,null,null,null,null,null,null,null,null,null,null,null,null,null,null,null,null,null,null,null,null,null,null,null,null,null,null,null,null,null,null,null,null,null,null,null,null,null,null,null,null,null,null,null,null,null,null,null,null,null,null,null,null,null,null,null,null,null,null,null,null,null,null,null,null,null,null,null,null,null,null,null,null,null,null,null,null,null,null,null,null,null,null,null,null,null,null,null,null,null,null,null,null,null,null,null,null,null,null,null,null,null,null,null,null,null,null,null,null,null,null,null,null,null,null,null,null,null,null,null,null,null,null,null,null,null,null,null,null,null,null,null,null,null,null,null,null,null,null,null,null,null,null,null,null,null,null,null,null,null,null,null,null,null,null,null,null,null,null,null,null,null,null,null,null,null,null,null,null,null,null,null,null,null,null,null,null,null,null,null,null,null,null,null,null,null,{"$f":"Dateneingabe!N21","v":15},null,{"$f":"Dateneingabe!K21","v":0},{"$f":"Dateneingabe!L21","v":0},{"$f":"Dateneingabe!M21","v":0},{"$f":"COUNTIFS(E19:NF19,\"U\")","v":0},{"$f":"NL19-NM19","v":0}]
[{"$f":"IF(Dateneingabe!A22=0,\"zzz\",Dateneingabe!A22)","v":"zzz"},{"$f":"IF(Dateneingabe!B22=0,\"zzz\",Dateneingabe!B22)","v":"zzz"},{"$f":"IF(Dateneingabe!C22=0,\"zzz\",Dateneingabe!C22)","v":"zzz"},{"$f":"IF($D$3<$E$1,\"<?\",IF($D$3>$NF$1,\">?\",LOOKUP($D$3,$E$1:$NF$1,E20:NF20)))","v":0},null,null,null,null,null,null,null,null,null,null,null,null,null,null,null,null,null,null,null,null,null,null,null,null,null,null,null,null,null,null,null,null,null,null,null,null,null,null,null,null,null,null,null,null,null,null,null,null,null,null,null,null,null,null,null,null,null,null,null,null,null,null,null,null,null,null,null,null,null,null,null,null,null,null,null,null,null,null,null,null,null,null,null,null,null,null,null,null,null,null,null,null,null,null,null,null,null,null,null,null,null,null,null,null,null,null,null,null,null,null,null,null,null,null,null,null,null,null,null,null,null,null,null,null,null,null,null,null,null,null,null,null,null,null,null,null,null,null,null,null,null,null,null,null,null,null,null,null,null,null,null,null,null,null,null,null,null,null,null,null,null,null,null,null,null,null,null,null,null,null,null,null,null,null,null,null,null,null,null,null,null,null,null,null,null,null,null,null,null,null,null,null,null,null,null,null,null,null,null,null,null,null,null,null,null,null,null,null,null,null,null,null,null,null,null,null,null,null,null,null,null,null,null,null,null,null,null,null,null,null,null,null,null,null,null,null,null,null,null,null,null,null,null,null,null,null,null,null,null,null,null,null,null,null,null,null,null,null,null,null,null,null,null,null,null,null,null,null,null,null,null,null,null,null,null,null,null,null,null,null,null,null,null,null,null,null,null,null,null,null,null,null,null,null,null,null,null,null,null,null,null,null,null,null,null,null,null,null,null,null,null,null,null,null,null,null,null,null,null,null,null,null,null,null,null,null,null,null,null,null,null,null,null,null,null,null,null,null,null,null,null,null,null,null,null,null,null,null,null,null,null,null,null,null,null,null,null,null,null,null,null,null,null,null,null,null,null,{"$f":"Dateneingabe!N22","v":16},null,{"$f":"Dateneingabe!K22","v":0},{"$f":"Dateneingabe!L22","v":0},{"$f":"Dateneingabe!M22","v":0},{"$f":"COUNTIFS(E20:NF20,\"U\")","v":0},{"$f":"NL20-NM20","v":0}]
[{"$f":"IF(Dateneingabe!A23=0,\"zzz\",Dateneingabe!A23)","v":"zzz"},{"$f":"IF(Dateneingabe!B23=0,\"zzz\",Dateneingabe!B23)","v":"zzz"},{"$f":"IF(Dateneingabe!C23=0,\"zzz\",Dateneingabe!C23)","v":"zzz"},{"$f":"IF($D$3<$E$1,\"<?\",IF($D$3>$NF$1,\">?\",LOOKUP($D$3,$E$1:$NF$1,E21:NF21)))","v":0},null,null,null,null,null,null,null,null,null,null,null,null,null,null,null,null,null,null,null,null,null,null,null,null,null,null,null,null,null,null,null,null,null,null,null,null,null,null,null,null,null,null,null,null,null,null,null,null,null,null,null,null,null,null,null,null,null,null,null,null,null,null,null,null,null,null,null,null,null,null,null,null,null,null,null,null,null,null,null,null,null,null,null,null,null,null,null,null,null,null,null,null,null,null,null,null,null,null,null,null,null,null,null,null,null,null,null,null,null,null,null,null,null,null,null,null,null,null,null,null,null,null,null,null,null,null,null,null,null,null,null,null,null,null,null,null,null,null,null,null,null,null,null,null,null,null,null,null,null,null,null,null,null,null,null,null,null,null,null,null,null,null,null,null,null,null,null,null,null,null,null,null,null,null,null,null,null,null,null,null,null,null,null,null,null,null,null,null,null,null,null,null,null,null,null,null,null,null,null,null,null,null,null,null,null,null,null,null,null,null,null,null,null,null,null,null,null,null,null,null,null,null,null,null,null,null,null,null,null,null,null,null,null,null,null,null,null,null,null,null,null,null,null,null,null,null,null,null,null,null,null,null,null,null,null,null,null,null,null,null,null,null,null,null,null,null,null,null,null,null,null,null,null,null,null,null,null,null,null,null,null,null,null,null,null,null,null,null,null,null,null,null,null,null,null,null,null,null,null,null,null,null,null,null,null,null,null,null,null,null,null,null,null,null,null,null,null,null,null,null,null,null,null,null,null,null,null,null,null,null,null,null,null,null,null,null,null,null,null,null,null,null,null,null,null,null,null,null,null,null,null,null,null,null,null,null,null,null,null,null,null,null,null,null,null,null,null,{"$f":"Dateneingabe!N23","v":17},null,{"$f":"Dateneingabe!K23","v":0},{"$f":"Dateneingabe!L23","v":0},{"$f":"Dateneingabe!M23","v":0},{"$f":"COUNTIFS(E21:NF21,\"U\")","v":0},{"$f":"NL21-NM21","v":0}]
[{"$f":"IF(Dateneingabe!A24=0,\"zzz\",Dateneingabe!A24)","v":"zzz"},{"$f":"IF(Dateneingabe!B24=0,\"zzz\",Dateneingabe!B24)","v":"zzz"},{"$f":"IF(Dateneingabe!C24=0,\"zzz\",Dateneingabe!C24)","v":"zzz"},{"$f":"IF($D$3<$E$1,\"<?\",IF($D$3>$NF$1,\">?\",LOOKUP($D$3,$E$1:$NF$1,E22:NF22)))","v":0},null,null,null,null,null,null,null,null,null,null,null,null,null,null,null,null,null,null,null,null,null,null,null,null,null,null,null,null,null,null,null,null,null,null,null,null,null,null,null,null,null,null,null,null,null,null,null,null,null,null,null,null,null,null,null,null,null,null,null,null,null,null,null,null,null,null,null,null,null,null,null,null,null,null,null,null,null,null,null,null,null,null,null,null,null,null,null,null,null,null,null,null,null,null,null,null,null,null,null,null,null,null,null,null,null,null,null,null,null,null,null,null,null,null,null,null,null,null,null,null,null,null,null,null,null,null,null,null,null,null,null,null,null,null,null,null,null,null,null,null,null,null,null,null,null,null,null,null,null,null,null,null,null,null,null,null,null,null,null,null,null,null,null,null,null,null,null,null,null,null,null,null,null,null,null,null,null,null,null,null,null,null,null,null,null,null,null,null,null,null,null,null,null,null,null,null,null,null,null,null,null,null,null,null,null,null,null,null,null,null,null,null,null,null,null,null,null,null,null,null,null,null,null,null,null,null,null,null,null,null,null,null,null,null,null,null,null,null,null,null,null,null,null,null,null,null,null,null,null,null,null,null,null,null,null,null,null,null,null,null,null,null,null,null,null,null,null,null,null,null,null,null,null,null,null,null,null,null,null,null,null,null,null,null,null,null,null,null,null,null,null,null,null,null,null,null,null,null,null,null,null,null,null,null,null,null,null,null,null,null,null,null,null,null,null,null,null,null,null,null,null,null,null,null,null,null,null,null,null,null,null,null,null,null,null,null,null,null,null,null,null,null,null,null,null,null,null,null,null,null,null,null,null,null,null,null,null,null,null,null,null,null,null,null,null,null,null,{"$f":"Dateneingabe!N24","v":18},null,{"$f":"Dateneingabe!K24","v":0},{"$f":"Dateneingabe!L24","v":0},{"$f":"Dateneingabe!M24","v":0},{"$f":"COUNTIFS(E22:NF22,\"U\")","v":0},{"$f":"NL22-NM22","v":0}]
[{"$f":"IF(Dateneingabe!A25=0,\"zzz\",Dateneingabe!A25)","v":"zzz"},{"$f":"IF(Dateneingabe!B25=0,\"zzz\",Dateneingabe!B25)","v":"zzz"},{"$f":"IF(Dateneingabe!C25=0,\"zzz\",Dateneingabe!C25)","v":"zzz"},{"$f":"IF($D$3<$E$1,\"<?\",IF($D$3>$NF$1,\">?\",LOOKUP($D$3,$E$1:$NF$1,E23:NF23)))","v":0},null,null,null,null,null,null,null,null,null,null,null,null,null,null,null,null,null,null,null,null,null,null,null,null,null,null,null,null,null,null,null,null,null,null,null,null,null,null,null,null,null,null,null,null,null,null,null,null,null,null,null,null,null,null,null,null,null,null,null,null,null,null,null,null,null,null,null,null,null,null,null,null,null,null,null,null,null,null,null,null,null,null,null,null,null,null,null,null,null,null,null,null,null,null,null,null,null,null,null,null,null,null,null,null,null,null,null,null,null,null,null,null,null,null,null,null,null,null,null,null,null,null,null,null,null,null,null,null,null,null,null,null,null,null,null,null,null,null,null,null,null,null,null,null,null,null,null,null,null,null,null,null,null,null,null,null,null,null,null,null,null,null,null,null,null,null,null,null,null,null,null,null,null,null,null,null,null,null,null,null,null,null,null,null,null,null,null,null,null,null,null,null,null,null,null,null,null,null,null,null,null,null,null,null,null,null,null,null,null,null,null,null,null,null,null,null,null,null,null,null,null,null,null,null,null,null,null,null,null,null,null,null,null,null,null,null,null,null,null,null,null,null,null,null,null,null,null,null,null,null,null,null,null,null,null,null,null,null,null,null,null,null,null,null,null,null,null,null,null,null,null,null,null,null,null,null,null,null,null,null,null,null,null,null,null,null,null,null,null,null,null,null,null,null,null,null,null,null,null,null,null,null,null,null,null,null,null,null,null,null,null,null,null,null,null,null,null,null,null,null,null,null,null,null,null,null,null,null,null,null,null,null,null,null,null,null,null,null,null,null,null,null,null,null,null,null,null,null,null,null,null,null,null,null,null,null,null,null,null,null,null,null,null,null,null,null,null,{"$f":"Dateneingabe!N25","v":19},null,{"$f":"Dateneingabe!K25","v":0},{"$f":"Dateneingabe!L25","v":0},{"$f":"Dateneingabe!M25","v":0},{"$f":"COUNTIFS(E23:NF23,\"U\")","v":0},{"$f":"NL23-NM23","v":0}]
[{"$f":"IF(Dateneingabe!A26=0,\"zzz\",Dateneingabe!A26)","v":"zzz"},{"$f":"IF(Dateneingabe!B26=0,\"zzz\",Dateneingabe!B26)","v":"zzz"},{"$f":"IF(Dateneingabe!C26=0,\"zzz\",Dateneingabe!C26)","v":"zzz"},{"$f":"IF($D$3<$E$1,\"<?\",IF($D$3>$NF$1,\">?\",LOOKUP($D$3,$E$1:$NF$1,E24:NF24)))","v":0},null,null,null,null,null,null,null,null,null,null,null,null,null,null,null,null,null,null,null,null,null,null,null,null,null,null,null,null,null,null,null,null,null,null,null,null,null,null,null,null,null,null,null,null,null,null,null,null,null,null,null,null,null,null,null,null,null,null,null,null,null,null,null,null,null,null,null,null,null,null,null,null,null,null,null,null,null,null,null,null,null,null,null,null,null,null,null,null,null,null,null,null,null,null,null,null,null,null,null,null,null,null,null,null,null,null,null,null,null,null,null,null,null,null,null,null,null,null,null,null,null,null,null,null,null,null,null,null,null,null,null,null,null,null,null,null,null,null,null,null,null,null,null,null,null,null,null,null,null,null,null,null,null,null,null,null,null,null,null,null,null,null,null,null,null,null,null,null,null,null,null,null,null,null,null,null,null,null,null,null,null,null,null,null,null,null,null,null,null,null,null,null,null,null,null,null,null,null,null,null,null,null,null,null,null,null,null,null,null,null,null,null,null,null,null,null,null,null,null,null,null,null,null,null,null,null,null,null,null,null,null,null,null,null,null,null,null,null,null,null,null,null,null,null,null,null,null,null,null,null,null,null,null,null,null,null,null,null,null,null,null,null,null,null,null,null,null,null,null,null,null,null,null,null,null,null,null,null,null,null,null,null,null,null,null,null,null,null,null,null,null,null,null,null,null,null,null,null,null,null,null,null,null,null,null,null,null,null,null,null,null,null,null,null,null,null,null,null,null,null,null,null,null,null,null,null,null,null,null,null,null,null,null,null,null,null,null,null,null,null,null,null,null,null,null,null,null,null,null,null,null,null,null,null,null,null,null,null,null,null,null,null,null,null,null,null,null,{"$f":"Dateneingabe!N26","v":20},null,{"$f":"Dateneingabe!K26","v":0},{"$f":"Dateneingabe!L26","v":0},{"$f":"Dateneingabe!M26","v":0},{"$f":"COUNTIFS(E24:NF24,\"U\")","v":0},{"$f":"NL24-NM24","v":0}]
[{"$f":"IF(Dateneingabe!A27=0,\"zzz\",Dateneingabe!A27)","v":"zzz"},{"$f":"IF(Dateneingabe!B27=0,\"zzz\",Dateneingabe!B27)","v":"zzz"},{"$f":"IF(Dateneingabe!C27=0,\"zzz\",Dateneingabe!C27)","v":"zzz"},{"$f":"IF($D$3<$E$1,\"<?\",IF($D$3>$NF$1,\">?\",LOOKUP($D$3,$E$1:$NF$1,E25:NF25)))","v":0},null,null,null,null,null,null,null,null,null,null,null,null,null,null,null,null,null,null,null,null,null,null,null,null,null,null,null,null,null,null,null,null,null,null,null,null,null,null,null,null,null,null,null,null,null,null,null,null,null,null,null,null,null,null,null,null,null,null,null,null,null,null,null,null,null,null,null,null,null,null,null,null,null,null,null,null,null,null,null,null,null,null,null,null,null,null,null,null,null,null,null,null,null,null,null,null,null,null,null,null,null,null,null,null,null,null,null,null,null,null,null,null,null,null,null,null,null,null,null,null,null,null,null,null,null,null,null,null,null,null,null,null,null,null,null,null,null,null,null,null,null,null,null,null,null,null,null,null,null,null,null,null,null,null,null,null,null,null,null,null,null,null,null,null,null,null,null,null,null,null,null,null,null,null,null,null,null,null,null,null,null,null,null,null,null,null,null,null,null,null,null,null,null,null,null,null,null,null,null,null,null,null,null,null,null,null,null,null,null,null,null,null,null,null,null,null,null,null,null,null,null,null,null,null,null,null,null,null,null,null,null,null,null,null,null,null,null,null,null,null,null,null,null,null,null,null,null,null,null,null,null,null,null,null,null,null,null,null,null,null,null,null,null,null,null,null,null,null,null,null,null,null,null,null,null,null,null,null,null,null,null,null,null,null,null,null,null,null,null,null,null,null,null,null,null,null,null,null,null,null,null,null,null,null,null,null,null,null,null,null,null,null,null,null,null,null,null,null,null,null,null,null,null,null,null,null,null,null,null,null,null,null,null,null,null,null,null,null,null,null,null,null,null,null,null,null,null,null,null,null,null,null,null,null,null,null,null,null,null,null,null,null,null,null,null,null,null,{"$f":"Dateneingabe!N27","v":21},null,{"$f":"Dateneingabe!K27","v":0},{"$f":"Dateneingabe!L27","v":0},{"$f":"Dateneingabe!M27","v":0},{"$f":"COUNTIFS(E25:NF25,\"U\")","v":0},{"$f":"NL25-NM25","v":0}]
[{"$f":"IF(Dateneingabe!A28=0,\"zzz\",Dateneingabe!A28)","v":"zzz"},{"$f":"IF(Dateneingabe!B28=0,\"zzz\",Dateneingabe!B28)","v":"zzz"},{"$f":"IF(Dateneingabe!C28=0,\"zzz\",Dateneingabe!C28)","v":"zzz"},{"$f":"IF($D$3<$E$1,\"<?\",IF($D$3>$NF$1,\">?\",LOOKUP($D$3,$E$1:$NF$1,E26:NF26)))","v":0},null,null,null,null,null,null,null,null,null,null,null,null,null,null,null,null,null,null,null,null,null,null,null,null,null,null,null,null,null,null,null,null,null,null,null,null,null,null,null,null,null,null,null,null,null,null,null,null,null,null,null,null,null,null,null,null,null,null,null,null,null,null,null,null,null,null,null,null,null,null,null,null,null,null,null,null,null,null,null,null,null,null,null,null,null,null,null,null,null,null,null,null,null,null,null,null,null,null,null,null,null,null,null,null,null,null,null,null,null,null,null,null,null,null,null,null,null,null,null,null,null,null,null,null,null,null,null,null,null,null,null,null,null,null,null,null,null,null,null,null,null,null,null,null,null,null,null,null,null,null,null,null,null,null,null,null,null,null,null,null,null,null,null,null,null,null,null,null,null,null,null,null,null,null,null,null,null,null,null,null,null,null,null,null,null,null,null,null,null,null,null,null,null,null,null,null,null,null,null,null,null,null,null,null,null,null,null,null,null,null,null,null,null,null,null,null,null,null,null,null,null,null,null,null,null,null,null,null,null,null,null,null,null,null,null,null,null,null,null,null,null,null,null,null,null,null,null,null,null,null,null,null,null,null,null,null,null,null,null,null,null,null,null,null,null,null,null,null,null,null,null,null,null,null,null,null,null,null,null,null,null,null,null,null,null,null,null,null,null,null,null,null,null,null,null,null,null,null,null,null,null,null,null,null,null,null,null,null,null,null,null,null,null,null,null,null,null,null,null,null,null,null,null,null,null,null,null,null,null,null,null,null,null,null,null,null,null,null,null,null,null,null,null,null,null,null,null,null,null,null,null,null,null,null,null,null,null,null,null,null,null,null,null,null,null,null,null,{"$f":"Dateneingabe!N28","v":22},null,{"$f":"Dateneingabe!K28","v":0},{"$f":"Dateneingabe!L28","v":0},{"$f":"Dateneingabe!M28","v":0},{"$f":"COUNTIFS(E26:NF26,\"U\")","v":0},{"$f":"NL26-NM26","v":0}]
[{"$f":"IF(Dateneingabe!A29=0,\"zzz\",Dateneingabe!A29)","v":"zzz"},{"$f":"IF(Dateneingabe!B29=0,\"zzz\",Dateneingabe!B29)","v":"zzz"},{"$f":"IF(Dateneingabe!C29=0,\"zzz\",Dateneingabe!C29)","v":"zzz"},{"$f":"IF($D$3<$E$1,\"<?\",IF($D$3>$NF$1,\">?\",LOOKUP($D$3,$E$1:$NF$1,E27:NF27)))","v":0},null,null,null,null,null,null,null,null,null,null,null,null,null,null,null,null,null,null,null,null,null,null,null,null,null,null,null,null,null,null,null,null,null,null,null,null,null,null,null,null,null,null,null,null,null,null,null,null,null,null,null,null,null,null,null,null,null,null,null,null,null,null,null,null,null,null,null,null,null,null,null,null,null,null,null,null,null,null,null,null,null,null,null,null,null,null,null,null,null,null,null,null,null,null,null,null,null,null,null,null,null,null,null,null,null,null,null,null,null,null,null,null,null,null,null,null,null,null,null,null,null,null,null,null,null,null,null,null,null,null,null,null,null,null,null,null,null,null,null,null,null,null,null,null,null,null,null,null,null,null,null,null,null,null,null,null,null,null,null,null,null,null,null,null,null,null,null,null,null,null,null,null,null,null,null,null,null,null,null,null,null,null,null,null,null,null,null,null,null,null,null,null,null,null,null,null,null,null,null,null,null,null,null,null,null,null,null,null,null,null,null,null,null,null,null,null,null,null,null,null,null,null,null,null,null,null,null,null,null,null,null,null,null,null,null,null,null,null,null,null,null,null,null,null,null,null,null,null,null,null,null,null,null,null,null,null,null,null,null,null,null,null,null,null,null,null,null,null,null,null,null,null,null,null,null,null,null,null,null,null,null,null,null,null,null,null,null,null,null,null,null,null,null,null,null,null,null,null,null,null,null,null,null,null,null,null,null,null,null,null,null,null,null,null,null,null,null,null,null,null,null,null,null,null,null,null,null,null,null,null,null,null,null,null,null,null,null,null,null,null,null,null,null,null,null,null,null,null,null,null,null,null,null,null,null,null,null,null,null,null,null,null,null,null,null,null,null,{"$f":"Dateneingabe!N29","v":23},null,{"$f":"Dateneingabe!K29","v":0},{"$f":"Dateneingabe!L29","v":0},{"$f":"Dateneingabe!M29","v":0},{"$f":"COUNTIFS(E27:NF27,\"U\")","v":0},{"$f":"NL27-NM27","v":0}]
[{"$f":"IF(Dateneingabe!A30=0,\"zzz\",Dateneingabe!A30)","v":"zzz"},{"$f":"IF(Dateneingabe!B30=0,\"zzz\",Dateneingabe!B30)","v":"zzz"},{"$f":"IF(Dateneingabe!C30=0,\"zzz\",Dateneingabe!C30)","v":"zzz"},{"$f":"IF($D$3<$E$1,\"<?\",IF($D$3>$NF$1,\">?\",LOOKUP($D$3,$E$1:$NF$1,E28:NF28)))","v":0},null,null,null,null,null,null,null,null,null,null,null,null,null,null,null,null,null,null,null,null,null,null,null,null,null,null,null,null,null,null,null,null,null,null,null,null,null,null,null,null,null,null,null,null,null,null,null,null,null,null,null,null,null,null,null,null,null,null,null,null,null,null,null,null,null,null,null,null,null,null,null,null,null,null,null,null,null,null,null,null,null,null,null,null,null,null,null,null,null,null,null,null,null,null,null,null,null,null,null,null,null,null,null,null,null,null,null,null,null,null,null,null,null,null,null,null,null,null,null,null,null,null,null,null,null,null,null,null,null,null,null,null,null,null,null,null,null,null,null,null,null,null,null,null,null,null,null,null,null,null,null,null,null,null,null,null,null,null,null,null,null,null,null,null,null,null,null,null,null,null,null,null,null,null,null,null,null,null,null,null,null,null,null,null,null,null,null,null,null,null,null,null,null,null,null,null,null,null,null,null,null,null,null,null,null,null,null,null,null,null,null,null,null,null,null,null,null,null,null,null,null,null,null,null,null,null,null,null,null,null,null,null,null,null,null,null,null,null,null,null,null,null,null,null,null,null,null,null,null,null,null,null,null,null,null,null,null,null,null,null,null,null,null,null,null,null,null,null,null,null,null,null,null,null,null,null,null,null,null,null,null,null,null,null,null,null,null,null,null,null,null,null,null,null,null,null,null,null,null,null,null,null,null,null,null,null,null,null,null,null,null,null,null,null,null,null,null,null,null,null,null,null,null,null,null,null,null,null,null,null,null,null,null,null,null,null,null,null,null,null,null,null,null,null,null,null,null,null,null,null,null,null,null,null,null,null,null,null,null,null,null,null,null,null,null,null,null,{"$f":"Dateneingabe!N30","v":24},null,{"$f":"Dateneingabe!K30","v":0},{"$f":"Dateneingabe!L30","v":0},{"$f":"Dateneingabe!M30","v":0},{"$f":"COUNTIFS(E28:NF28,\"U\")","v":0},{"$f":"NL28-NM28","v":0}]
[{"$f":"IF(Dateneingabe!A31=0,\"zzz\",Dateneingabe!A31)","v":"zzz"},{"$f":"IF(Dateneingabe!B31=0,\"zzz\",Dateneingabe!B31)","v":"zzz"},{"$f":"IF(Dateneingabe!C31=0,\"zzz\",Dateneingabe!C31)","v":"zzz"},{"$f":"IF($D$3<$E$1,\"<?\",IF($D$3>$NF$1,\">?\",LOOKUP($D$3,$E$1:$NF$1,E29:NF29)))","v":0},null,null,null,null,null,null,null,null,null,null,null,null,null,null,null,null,null,null,null,null,null,null,null,null,null,null,null,null,null,null,null,null,null,null,null,null,null,null,null,null,null,null,null,null,null,null,null,null,null,null,null,null,null,null,null,null,null,null,null,null,null,null,null,null,null,null,null,null,null,null,null,null,null,null,null,null,null,null,null,null,null,null,null,null,null,null,null,null,null,null,null,null,null,null,null,null,null,null,null,null,null,null,null,null,null,null,null,null,null,null,null,null,null,null,null,null,null,null,null,null,null,null,null,null,null,null,null,null,null,null,null,null,null,null,null,null,null,null,null,null,null,null,null,null,null,null,null,null,null,null,null,null,null,null,null,null,null,null,null,null,null,null,null,null,null,null,null,null,null,null,null,null,null,null,null,null,null,null,null,null,null,null,null,null,null,null,null,null,null,null,null,null,null,null,null,null,null,null,null,null,null,null,null,null,null,null,null,null,null,null,null,null,null,null,null,null,null,null,null,null,null,null,null,null,null,null,null,null,null,null,null,null,null,null,null,null,null,null,null,null,null,null,null,null,null,null,null,null,null,null,null,null,null,null,null,null,null,null,null,null,null,null,null,null,null,null,null,null,null,null,null,null,null,null,null,null,null,null,null,null,null,null,null,null,null,null,null,null,null,null,null,null,null,null,null,null,null,null,null,null,null,null,null,null,null,null,null,null,null,null,null,null,null,null,null,null,null,null,null,null,null,null,null,null,null,null,null,null,null,null,null,null,null,null,null,null,null,null,null,null,null,null,null,null,null,null,null,null,null,null,null,null,null,null,null,null,null,null,null,null,null,null,null,null,null,null,null,{"$f":"Dateneingabe!N31","v":25},null,{"$f":"Dateneingabe!K31","v":0},{"$f":"Dateneingabe!L31","v":0},{"$f":"Dateneingabe!M31","v":0},{"$f":"COUNTIFS(E29:NF29,\"U\")","v":0},{"$f":"NL29-NM29","v":0}]
[{"$f":"IF(Dateneingabe!A32=0,\"zzz\",Dateneingabe!A32)","v":"zzz"},{"$f":"IF(Dateneingabe!B32=0,\"zzz\",Dateneingabe!B32)","v":"zzz"},{"$f":"IF(Dateneingabe!C32=0,\"zzz\",Dateneingabe!C32)","v":"zzz"},{"$f":"IF($D$3<$E$1,\"<?\",IF($D$3>$NF$1,\">?\",LOOKUP($D$3,$E$1:$NF$1,E30:NF30)))","v":0},null,null,null,null,null,null,null,null,null,null,null,null,null,null,null,null,null,null,null,null,null,null,null,null,null,null,null,null,null,null,null,null,null,null,null,null,null,null,null,null,null,null,null,null,null,null,null,null,null,null,null,null,null,null,null,null,null,null,null,null,null,null,null,null,null,null,null,null,null,null,null,null,null,null,null,null,null,null,null,null,null,null,null,null,null,null,null,null,null,null,null,null,null,null,null,null,null,null,null,null,null,null,null,null,null,null,null,null,null,null,null,null,null,null,null,null,null,null,null,null,null,null,null,null,null,null,null,null,null,null,null,null,null,null,null,null,null,null,null,null,null,null,null,null,null,null,null,null,null,null,null,null,null,null,null,null,null,null,null,null,null,null,null,null,null,null,null,null,null,null,null,null,null,null,null,null,null,null,null,null,null,null,null,null,null,null,null,null,null,null,null,null,null,null,null,null,null,null,null,null,null,null,null,null,null,null,null,null,null,null,null,null,null,null,null,null,null,null,null,null,null,null,null,null,null,null,null,null,null,null,null,null,null,null,null,null,null,null,null,null,null,null,null,null,null,null,null,null,null,null,null,null,null,null,null,null,null,null,null,null,null,null,null,null,null,null,null,null,null,null,null,null,null,null,null,null,null,null,null,null,null,null,null,null,null,null,null,null,null,null,null,null,null,null,null,null,null,null,null,null,null,null,null,null,null,null,null,null,null,null,null,null,null,null,null,null,null,null,null,null,null,null,null,null,null,null,null,null,null,null,null,null,null,null,null,null,null,null,null,null,null,null,null,null,null,null,null,null,null,null,null,null,null,null,null,null,null,null,null,null,null,null,null,null,null,null,null,{"$f":"Dateneingabe!N32","v":26},null,{"$f":"Dateneingabe!K32","v":0},{"$f":"Dateneingabe!L32","v":0},{"$f":"Dateneingabe!M32","v":0},{"$f":"COUNTIFS(E30:NF30,\"U\")","v":0},{"$f":"NL30-NM30","v":0}]
[{"$f":"IF(Dateneingabe!A33=0,\"zzz\",Dateneingabe!A33)","v":"zzz"},{"$f":"IF(Dateneingabe!B33=0,\"zzz\",Dateneingabe!B33)","v":"zzz"},{"$f":"IF(Dateneingabe!C33=0,\"zzz\",Dateneingabe!C33)","v":"zzz"},{"$f":"IF($D$3<$E$1,\"<?\",IF($D$3>$NF$1,\">?\",LOOKUP($D$3,$E$1:$NF$1,E31:NF31)))","v":0},null,null,null,null,null,null,null,null,null,null,null,null,null,null,null,null,null,null,null,null,null,null,null,null,null,null,null,null,null,null,null,null,null,null,null,null,null,null,null,null,null,null,null,null,null,null,null,null,null,null,null,null,null,null,null,null,null,null,null,null,null,null,null,null,null,null,null,null,null,null,null,null,null,null,null,null,null,null,null,null,null,null,null,null,null,null,null,null,null,null,null,null,null,null,null,null,null,null,null,null,null,null,null,null,null,null,null,null,null,null,null,null,null,null,null,null,null,null,null,null,null,null,null,null,null,null,null,null,null,null,null,null,null,null,null,null,null,null,null,null,null,null,null,null,null,null,null,null,null,null,null,null,null,null,null,null,null,null,null,null,null,null,null,null,null,null,null,null,null,null,null,null,null,null,null,null,null,null,null,null,null,null,null,null,null,null,null,null,null,null,null,null,null,null,null,null,null,null,null,null,null,null,null,null,null,null,null,null,null,null,null,null,null,null,null,null,null,null,null,null,null,null,null,null,null,null,null,null,null,null,null,null,null,null,null,null,null,null,null,null,null,null,null,null,null,null,null,null,null,null,null,null,null,null,null,null,null,null,null,null,null,null,null,null,null,null,null,null,null,null,null,null,null,null,null,null,null,null,null,null,null,null,null,null,null,null,null,null,null,null,null,null,null,null,null,null,null,null,null,null,null,null,null,null,null,null,null,null,null,null,null,null,null,null,null,null,null,null,null,null,null,null,null,null,null,null,null,null,null,null,null,null,null,null,null,null,null,null,null,null,null,null,null,null,null,null,null,null,null,null,null,null,null,null,null,null,null,null,null,null,null,null,null,null,null,null,null,{"$f":"Dateneingabe!N33","v":27},null,{"$f":"Dateneingabe!K33","v":0},{"$f":"Dateneingabe!L33","v":0},{"$f":"Dateneingabe!M33","v":0},{"$f":"COUNTIFS(E31:NF31,\"U\")","v":0},{"$f":"NL31-NM31","v":0}]
[{"$f":"IF(Dateneingabe!A34=0,\"zzz\",Dateneingabe!A34)","v":"zzz"},{"$f":"IF(Dateneingabe!B34=0,\"zzz\",Dateneingabe!B34)","v":"zzz"},{"$f":"IF(Dateneingabe!C34=0,\"zzz\",Dateneingabe!C34)","v":"zzz"},{"$f":"IF($D$3<$E$1,\"<?\",IF($D$3>$NF$1,\">?\",LOOKUP($D$3,$E$1:$NF$1,E32:NF32)))","v":0},null,null,null,null,null,null,null,null,null,null,null,null,null,null,null,null,null,null,null,null,null,null,null,null,null,null,null,null,null,null,null,null,null,null,null,null,null,null,null,null,null,null,null,null,null,null,null,null,null,null,null,null,null,null,null,null,null,null,null,null,null,null,null,null,null,null,null,null,null,null,null,null,null,null,null,null,null,null,null,null,null,null,null,null,null,null,null,null,null,null,null,null,null,null,null,null,null,null,null,null,null,null,null,null,null,null,null,null,null,null,null,null,null,null,null,null,null,null,null,null,null,null,null,null,null,null,null,null,null,null,null,null,null,null,null,null,null,null,null,null,null,null,null,null,null,null,null,null,null,null,null,null,null,null,null,null,null,null,null,null,null,null,null,null,null,null,null,null,null,null,null,null,null,null,null,null,null,null,null,null,null,null,null,null,null,null,null,null,null,null,null,null,null,null,null,null,null,null,null,null,null,null,null,null,null,null,null,null,null,null,null,null,null,null,null,null,null,null,null,null,null,null,null,null,null,null,null,null,null,null,null,null,null,null,null,null,null,null,null,null,null,null,null,null,null,null,null,null,null,null,null,null,null,null,null,null,null,null,null,null,null,null,null,null,null,null,null,null,null,null,null,null,null,null,null,null,null,null,null,null,null,null,null,null,null,null,null,null,null,null,null,null,null,null,null,null,null,null,null,null,null,null,null,null,null,null,null,null,null,null,null,null,null,null,null,null,null,null,null,null,null,null,null,null,null,null,null,null,null,null,null,null,null,null,null,null,null,null,null,null,null,null,null,null,null,null,null,null,null,null,null,null,null,null,null,null,null,null,null,null,null,null,null,null,null,null,null,{"$f":"Dateneingabe!N34","v":28},null,{"$f":"Dateneingabe!K34","v":0},{"$f":"Dateneingabe!L34","v":0},{"$f":"Dateneingabe!M34","v":0},{"$f":"COUNTIFS(E32:NF32,\"U\")","v":0},{"$f":"NL32-NM32","v":0}]
[{"$f":"IF(Dateneingabe!A35=0,\"zzz\",Dateneingabe!A35)","v":"zzz"},{"$f":"IF(Dateneingabe!B35=0,\"zzz\",Dateneingabe!B35)","v":"zzz"},{"$f":"IF(Dateneingabe!C35=0,\"zzz\",Dateneingabe!C35)","v":"zzz"},{"$f":"IF($D$3<$E$1,\"<?\",IF($D$3>$NF$1,\">?\",LOOKUP($D$3,$E$1:$NF$1,E33:NF33)))","v":0},null,null,null,null,null,null,null,null,null,null,null,null,null,null,null,null,null,null,null,null,null,null,null,null,null,null,null,null,null,null,null,null,null,null,null,null,null,null,null,null,null,null,null,null,null,null,null,null,null,null,null,null,null,null,null,null,null,null,null,null,null,null,null,null,null,null,null,null,null,null,null,null,null,null,null,null,null,null,null,null,null,null,null,null,null,null,null,null,null,null,null,null,null,null,null,null,null,null,null,null,null,null,null,null,null,null,null,null,null,null,null,null,null,null,null,null,null,null,null,null,null,null,null,null,null,null,null,null,null,null,null,null,null,null,null,null,null,null,null,null,null,null,null,null,null,null,null,null,null,null,null,null,null,null,null,null,null,null,null,null,null,null,null,null,null,null,null,null,null,null,null,null,null,null,null,null,null,null,null,null,null,null,null,null,null,null,null,null,null,null,null,null,null,null,null,null,null,null,null,null,null,null,null,null,null,null,null,null,null,null,null,null,null,null,null,null,null,null,null,null,null,null,null,null,null,null,null,null,null,null,null,null,null,null,null,null,null,null,null,null,null,null,null,null,null,null,null,null,null,null,null,null,null,null,null,null,null,null,null,null,null,null,null,null,null,null,null,null,null,null,null,null,null,null,null,null,null,null,null,null,null,null,null,null,null,null,null,null,null,null,null,null,null,null,null,null,null,null,null,null,null,null,null,null,null,null,null,null,null,null,null,null,null,null,null,null,null,null,null,null,null,null,null,null,null,null,null,null,null,null,null,null,null,null,null,null,null,null,null,null,null,null,null,null,null,null,null,null,null,null,null,null,null,null,null,null,null,null,null,null,null,null,null,null,null,null,null,{"$f":"Dateneingabe!N35","v":29},null,{"$f":"Dateneingabe!K35","v":0},{"$f":"Dateneingabe!L35","v":0},{"$f":"Dateneingabe!M35","v":0},{"$f":"COUNTIFS(E33:NF33,\"U\")","v":0},{"$f":"NL33-NM33","v":0}]
[{"$f":"IF(Dateneingabe!A36=0,\"zzz\",Dateneingabe!A36)","v":"zzz"},{"$f":"IF(Dateneingabe!B36=0,\"zzz\",Dateneingabe!B36)","v":"zzz"},{"$f":"IF(Dateneingabe!C36=0,\"zzz\",Dateneingabe!C36)","v":"zzz"},{"$f":"IF($D$3<$E$1,\"<?\",IF($D$3>$NF$1,\">?\",LOOKUP($D$3,$E$1:$NF$1,E34:NF34)))","v":0},null,null,null,null,null,null,null,null,null,null,null,null,null,null,null,null,null,null,null,null,null,null,null,null,null,null,null,null,null,null,null,null,null,null,null,null,null,null,null,null,null,null,null,null,null,null,null,null,null,null,null,null,null,null,null,null,null,null,null,null,null,null,null,null,null,null,null,null,null,null,null,null,null,null,null,null,null,null,null,null,null,null,null,null,null,null,null,null,null,null,null,null,null,null,null,null,null,null,null,null,null,null,null,null,null,null,null,null,null,null,null,null,null,null,null,null,null,null,null,null,null,null,null,null,null,null,null,null,null,null,null,null,null,null,null,null,null,null,null,null,null,null,null,null,null,null,null,null,null,null,null,null,null,null,null,null,null,null,null,null,null,null,null,null,null,null,null,null,null,null,null,null,null,null,null,null,null,null,null,null,null,null,null,null,null,null,null,null,null,null,null,null,null,null,null,null,null,null,null,null,null,null,null,null,null,null,null,null,null,null,null,null,null,null,null,null,null,null,null,null,null,null,null,null,null,null,null,null,null,null,null,null,null,null,null,null,null,null,null,null,null,null,null,null,null,null,null,null,null,null,null,null,null,null,null,null,null,null,null,null,null,null,null,null,null,null,null,null,null,null,null,null,null,null,null,null,null,null,null,null,null,null,null,null,null,null,null,null,null,null,null,null,null,null,null,null,null,null,null,null,null,null,null,null,null,null,null,null,null,null,null,null,null,null,null,null,null,null,null,null,null,null,null,null,null,null,null,null,null,null,null,null,null,null,null,null,null,null,null,null,null,null,null,null,null,null,null,null,null,null,null,null,null,null,null,null,null,null,null,null,null,null,null,null,null,null,null,{"$f":"Dateneingabe!N36","v":30},null,{"$f":"Dateneingabe!K36","v":0},{"$f":"Dateneingabe!L36","v":0},{"$f":"Dateneingabe!M36","v":0},{"$f":"COUNTIFS(E34:NF34,\"U\")","v":0},{"$f":"NL34-NM34","v":0}]
[{"$f":"IF(Dateneingabe!A37=0,\"zzz\",Dateneingabe!A37)","v":"zzz"},{"$f":"IF(Dateneingabe!B37=0,\"zzz\",Dateneingabe!B37)","v":"zzz"},{"$f":"IF(Dateneingabe!C37=0,\"zzz\",Dateneingabe!C37)","v":"zzz"},{"$f":"IF($D$3<$E$1,\"<?\",IF($D$3>$NF$1,\">?\",LOOKUP($D$3,$E$1:$NF$1,E35:NF35)))","v":0},null,null,null,null,null,null,null,null,null,null,null,null,null,null,null,null,null,null,null,null,null,null,null,null,null,null,null,null,null,null,null,null,null,null,null,null,null,null,null,null,null,null,null,null,null,null,null,null,null,null,null,null,null,null,null,null,null,null,null,null,null,null,null,null,null,null,null,null,null,null,null,null,null,null,null,null,null,null,null,null,null,null,null,null,null,null,null,null,null,null,null,null,null,null,null,null,null,null,null,null,null,null,null,null,null,null,null,null,null,null,null,null,null,null,null,null,null,null,null,null,null,null,null,null,null,null,null,null,null,null,null,null,null,null,null,null,null,null,null,null,null,null,null,null,null,null,null,null,null,null,null,null,null,null,null,null,null,null,null,null,null,null,null,null,null,null,null,null,null,null,null,null,null,null,null,null,null,null,null,null,null,null,null,null,null,null,null,null,null,null,null,null,null,null,null,null,null,null,null,null,null,null,null,null,null,null,null,null,null,null,null,null,null,null,null,null,null,null,null,null,null,null,null,null,null,null,null,null,null,null,null,null,null,null,null,null,null,null,null,null,null,null,null,null,null,null,null,null,null,null,null,null,null,null,null,null,null,null,null,null,null,null,null,null,null,null,null,null,null,null,null,null,null,null,null,null,null,null,null,null,null,null,null,null,null,null,null,null,null,null,null,null,null,null,null,null,null,null,null,null,null,null,null,null,null,null,null,null,null,null,null,null,null,null,null,null,null,null,null,null,null,null,null,null,null,null,null,null,null,null,null,null,null,null,null,null,null,null,null,null,null,null,null,null,null,null,null,null,null,null,null,null,null,null,null,null,null,null,null,null,null,null,null,null,null,null,null,{"$f":"Dateneingabe!N37","v":31},null,{"$f":"Dateneingabe!K37","v":0},{"$f":"Dateneingabe!L37","v":0},{"$f":"Dateneingabe!M37","v":0},{"$f":"COUNTIFS(E35:NF35,\"U\")","v":0},{"$f":"NL35-NM35","v":0}]
[{"$f":"IF(Dateneingabe!A38=0,\"zzz\",Dateneingabe!A38)","v":"zzz"},{"$f":"IF(Dateneingabe!B38=0,\"zzz\",Dateneingabe!B38)","v":"zzz"},{"$f":"IF(Dateneingabe!C38=0,\"zzz\",Dateneingabe!C38)","v":"zzz"},{"$f":"IF($D$3<$E$1,\"<?\",IF($D$3>$NF$1,\">?\",LOOKUP($D$3,$E$1:$NF$1,E36:NF36)))","v":0},null,null,null,null,null,null,null,null,null,null,null,null,null,null,null,null,null,null,null,null,null,null,null,null,null,null,null,null,null,null,null,null,null,null,null,null,null,null,null,null,null,null,null,null,null,null,null,null,null,null,null,null,null,null,null,null,null,null,null,null,null,null,null,null,null,null,null,null,null,null,null,null,null,null,null,null,null,null,null,null,null,null,null,null,null,null,null,null,null,null,null,null,null,null,null,null,null,null,null,null,null,null,null,null,null,null,null,null,null,null,null,null,null,null,null,null,null,null,null,null,null,null,null,null,null,null,null,null,null,null,null,null,null,null,null,null,null,null,null,null,null,null,null,null,null,null,null,null,null,null,null,null,null,null,null,null,null,null,null,null,null,null,null,null,null,null,null,null,null,null,null,null,null,null,null,null,null,null,null,null,null,null,null,null,null,null,null,null,null,null,null,null,null,null,null,null,null,null,null,null,null,null,null,null,null,null,null,null,null,null,null,null,null,null,null,null,null,null,null,null,null,null,null,null,null,null,null,null,null,null,null,null,null,null,null,null,null,null,null,null,null,null,null,null,null,null,null,null,null,null,null,null,null,null,null,null,null,null,null,null,null,null,null,null,null,null,null,null,null,null,null,null,null,null,null,null,null,null,null,null,null,null,null,null,null,null,null,null,null,null,null,null,null,null,null,null,null,null,null,null,null,null,null,null,null,null,null,null,null,null,null,null,null,null,null,null,null,null,null,null,null,null,null,null,null,null,null,null,null,null,null,null,null,null,null,null,null,null,null,null,null,null,null,null,null,null,null,null,null,null,null,null,null,null,null,null,null,null,null,null,null,null,null,null,null,null,null,{"$f":"Dateneingabe!N38","v":32},null,{"$f":"Dateneingabe!K38","v":0},{"$f":"Dateneingabe!L38","v":0},{"$f":"Dateneingabe!M38","v":0},{"$f":"COUNTIFS(E36:NF36,\"U\")","v":0},{"$f":"NL36-NM36","v":0}]
[{"$f":"IF(Dateneingabe!A39=0,\"zzz\",Dateneingabe!A39)","v":"zzz"},{"$f":"IF(Dateneingabe!B39=0,\"zzz\",Dateneingabe!B39)","v":"zzz"},{"$f":"IF(Dateneingabe!C39=0,\"zzz\",Dateneingabe!C39)","v":"zzz"},{"$f":"IF($D$3<$E$1,\"<?\",IF($D$3>$NF$1,\">?\",LOOKUP($D$3,$E$1:$NF$1,E37:NF37)))","v":0},null,null,null,null,null,null,null,null,null,null,null,null,null,null,null,null,null,null,null,null,null,null,null,null,null,null,null,null,null,null,null,null,null,null,null,null,null,null,null,null,null,null,null,null,null,null,null,null,null,null,null,null,null,null,null,null,null,null,null,null,null,null,null,null,null,null,null,null,null,null,null,null,null,null,null,null,null,null,null,null,null,null,null,null,null,null,null,null,null,null,null,null,null,null,null,null,null,null,null,null,null,null,null,null,null,null,null,null,null,null,null,null,null,null,null,null,null,null,null,null,null,null,null,null,null,null,null,null,null,null,null,null,null,null,null,null,null,null,null,null,null,null,null,null,null,null,null,null,null,null,null,null,null,null,null,null,null,null,null,null,null,null,null,null,null,null,null,null,null,null,null,null,null,null,null,null,null,null,null,null,null,null,null,null,null,null,null,null,null,null,null,null,null,null,null,null,null,null,null,null,null,null,null,null,null,null,null,null,null,null,null,null,null,null,null,null,null,null,null,null,null,null,null,null,null,null,null,null,null,null,null,null,null,null,null,null,null,null,null,null,null,null,null,null,null,null,null,null,null,null,null,null,null,null,null,null,null,null,null,null,null,null,null,null,null,null,null,null,null,null,null,null,null,null,null,null,null,null,null,null,null,null,null,null,null,null,null,null,null,null,null,null,null,null,null,null,null,null,null,null,null,null,null,null,null,null,null,null,null,null,null,null,null,null,null,null,null,null,null,null,null,null,null,null,null,null,null,null,null,null,null,null,null,null,null,null,null,null,null,null,null,null,null,null,null,null,null,null,null,null,null,null,null,null,null,null,null,null,null,null,null,null,null,null,null,null,null,{"$f":"Dateneingabe!N39","v":33},null,{"$f":"Dateneingabe!K39","v":0},{"$f":"Dateneingabe!L39","v":0},{"$f":"Dateneingabe!M39","v":0},{"$f":"COUNTIFS(E37:NF37,\"U\")","v":0},{"$f":"NL37-NM37","v":0}]
[{"$f":"IF(Dateneingabe!A40=0,\"zzz\",Dateneingabe!A40)","v":"zzz"},{"$f":"IF(Dateneingabe!B40=0,\"zzz\",Dateneingabe!B40)","v":"zzz"},{"$f":"IF(Dateneingabe!C40=0,\"zzz\",Dateneingabe!C40)","v":"zzz"},{"$f":"IF($D$3<$E$1,\"<?\",IF($D$3>$NF$1,\">?\",LOOKUP($D$3,$E$1:$NF$1,E38:NF38)))","v":0},null,null,null,null,null,null,null,null,null,null,null,null,null,null,null,null,null,null,null,null,null,null,null,null,null,null,null,null,null,null,null,null,null,null,null,null,null,null,null,null,null,null,null,null,null,null,null,null,null,null,null,null,null,null,null,null,null,null,null,null,null,null,null,null,null,null,null,null,null,null,null,null,null,null,null,null,null,null,null,null,null,null,null,null,null,null,null,null,null,null,null,null,null,null,null,null,null,null,null,null,null,null,null,null,null,null,null,null,null,null,null,null,null,null,null,null,null,null,null,null,null,null,null,null,null,null,null,null,null,null,null,null,null,null,null,null,null,null,null,null,null,null,null,null,null,null,null,null,null,null,null,null,null,null,null,null,null,null,null,null,null,null,null,null,null,null,null,null,null,null,null,null,null,null,null,null,null,null,null,null,null,null,null,null,null,null,null,null,null,null,null,null,null,null,null,null,null,null,null,null,null,null,null,null,null,null,null,null,null,null,null,null,null,null,null,null,null,null,null,null,null,null,null,null,null,null,null,null,null,null,null,null,null,null,null,null,null,null,null,null,null,null,null,null,null,null,null,null,null,null,null,null,null,null,null,null,null,null,null,null,null,null,null,null,null,null,null,null,null,null,null,null,null,null,null,null,null,null,null,null,null,null,null,null,null,null,null,null,null,null,null,null,null,null,null,null,null,null,null,null,null,null,null,null,null,null,null,null,null,null,null,null,null,null,null,null,null,null,null,null,null,null,null,null,null,null,null,null,null,null,null,null,null,null,null,null,null,null,null,null,null,null,null,null,null,null,null,null,null,null,null,null,null,null,null,null,null,null,null,null,null,null,null,null,null,null,null,{"$f":"Dateneingabe!N40","v":34},null,{"$f":"Dateneingabe!K40","v":0},{"$f":"Dateneingabe!L40","v":0},{"$f":"Dateneingabe!M40","v":0},{"$f":"COUNTIFS(E38:NF38,\"U\")","v":0},{"$f":"NL38-NM38","v":0}]
[{"$f":"IF(Dateneingabe!A41=0,\"zzz\",Dateneingabe!A41)","v":"zzz"},{"$f":"IF(Dateneingabe!B41=0,\"zzz\",Dateneingabe!B41)","v":"zzz"},{"$f":"IF(Dateneingabe!C41=0,\"zzz\",Dateneingabe!C41)","v":"zzz"},{"$f":"IF($D$3<$E$1,\"<?\",IF($D$3>$NF$1,\">?\",LOOKUP($D$3,$E$1:$NF$1,E39:NF39)))","v":0},null,null,null,null,null,null,null,null,null,null,null,null,null,null,null,null,null,null,null,null,null,null,null,null,null,null,null,null,null,null,null,null,null,null,null,null,null,null,null,null,null,null,null,null,null,null,null,null,null,null,null,null,null,null,null,null,null,null,null,null,null,null,null,null,null,null,null,null,null,null,null,null,null,null,null,null,null,null,null,null,null,null,null,null,null,null,null,null,null,null,null,null,null,null,null,null,null,null,null,null,null,null,null,null,null,null,null,null,null,null,null,null,null,null,null,null,null,null,null,null,null,null,null,null,null,null,null,null,null,null,null,null,null,null,null,null,null,null,null,null,null,null,null,null,null,null,null,null,null,null,null,null,null,null,null,null,null,null,null,null,null,null,null,null,null,null,null,null,null,null,null,null,null,null,null,null,null,null,null,null,null,null,null,null,null,null,null,null,null,null,null,null,null,null,null,null,null,null,null,null,null,null,null,null,null,null,null,null,null,null,null,null,null,null,null,null,null,null,null,null,null,null,null,null,null,null,null,null,null,null,null,null,null,null,null,null,null,null,null,null,null,null,null,null,null,null,null,null,null,null,null,null,null,null,null,null,null,null,null,null,null,null,null,null,null,null,null,null,null,null,null,null,null,null,null,null,null,null,null,null,null,null,null,null,null,null,null,null,null,null,null,null,null,null,null,null,null,null,null,null,null,null,null,null,null,null,null,null,null,null,null,null,null,null,null,null,null,null,null,null,null,null,null,null,null,null,null,null,null,null,null,null,null,null,null,null,null,null,null,null,null,null,null,null,null,null,null,null,null,null,null,null,null,null,null,null,null,null,null,null,null,null,null,null,null,null,null,{"$f":"Dateneingabe!N41","v":35},null,{"$f":"Dateneingabe!K41","v":0},{"$f":"Dateneingabe!L41","v":0},{"$f":"Dateneingabe!M41","v":0},{"$f":"COUNTIFS(E39:NF39,\"U\")","v":0},{"$f":"NL39-NM39","v":0}]
[{"$f":"IF(Dateneingabe!A42=0,\"zzz\",Dateneingabe!A42)","v":"zzz"},{"$f":"IF(Dateneingabe!B42=0,\"zzz\",Dateneingabe!B42)","v":"zzz"},{"$f":"IF(Dateneingabe!C42=0,\"zzz\",Dateneingabe!C42)","v":"zzz"},{"$f":"IF($D$3<$E$1,\"<?\",IF($D$3>$NF$1,\">?\",LOOKUP($D$3,$E$1:$NF$1,E40:NF40)))","v":0},null,null,null,null,null,null,null,null,null,null,null,null,null,null,null,null,null,null,null,null,null,null,null,null,null,null,null,null,null,null,null,null,null,null,null,null,null,null,null,null,null,null,null,null,null,null,null,null,null,null,null,null,null,null,null,null,null,null,null,null,null,null,null,null,null,null,null,null,null,null,null,null,null,null,null,null,null,null,null,null,null,null,null,null,null,null,null,null,null,null,null,null,null,null,null,null,null,null,null,null,null,null,null,null,null,null,null,null,null,null,null,null,null,null,null,null,null,null,null,null,null,null,null,null,null,null,null,null,null,null,null,null,null,null,null,null,null,null,null,null,null,null,null,null,null,null,null,null,null,null,null,null,null,null,null,null,null,null,null,null,null,null,null,null,null,null,null,null,null,null,null,null,null,null,null,null,null,null,null,null,null,null,null,null,null,null,null,null,null,null,null,null,null,null,null,null,null,null,null,null,null,null,null,null,null,null,null,null,null,null,null,null,null,null,null,null,null,null,null,null,null,null,null,null,null,null,null,null,null,null,null,null,null,null,null,null,null,null,null,null,null,null,null,null,null,null,null,null,null,null,null,null,null,null,null,null,null,null,null,null,null,null,null,null,null,null,null,null,null,null,null,null,null,null,null,null,null,null,null,null,null,null,null,null,null,null,null,null,null,null,null,null,null,null,null,null,null,null,null,null,null,null,null,null,null,null,null,null,null,null,null,null,null,null,null,null,null,null,null,null,null,null,null,null,null,null,null,null,null,null,null,null,null,null,null,null,null,null,null,null,null,null,null,null,null,null,null,null,null,null,null,null,null,null,null,null,null,null,null,null,null,null,null,null,null,null,null,{"$f":"Dateneingabe!N42","v":36},null,{"$f":"Dateneingabe!K42","v":0},{"$f":"Dateneingabe!L42","v":0},{"$f":"Dateneingabe!M42","v":0},{"$f":"COUNTIFS(E40:NF40,\"U\")","v":0},{"$f":"NL40-NM40","v":0}]
[{"$f":"IF(Dateneingabe!A43=0,\"zzz\",Dateneingabe!A43)","v":"zzz"},{"$f":"IF(Dateneingabe!B43=0,\"zzz\",Dateneingabe!B43)","v":"zzz"},{"$f":"IF(Dateneingabe!C43=0,\"zzz\",Dateneingabe!C43)","v":"zzz"},{"$f":"IF($D$3<$E$1,\"<?\",IF($D$3>$NF$1,\">?\",LOOKUP($D$3,$E$1:$NF$1,E41:NF41)))","v":0},null,null,null,null,null,null,null,null,null,null,null,null,null,null,null,null,null,null,null,null,null,null,null,null,null,null,null,null,null,null,null,null,null,null,null,null,null,null,null,null,null,null,null,null,null,null,null,null,null,null,null,null,null,null,null,null,null,null,null,null,null,null,null,null,null,null,null,null,null,null,null,null,null,null,null,null,null,null,null,null,null,null,null,null,null,null,null,null,null,null,null,null,null,null,null,null,null,null,null,null,null,null,null,null,null,null,null,null,null,null,null,null,null,null,null,null,null,null,null,null,null,null,null,null,null,null,null,null,null,null,null,null,null,null,null,null,null,null,null,null,null,null,null,null,null,null,null,null,null,null,null,null,null,null,null,null,null,null,null,null,null,null,null,null,null,null,null,null,null,null,null,null,null,null,null,null,null,null,null,null,null,null,null,null,null,null,null,null,null,null,null,null,null,null,null,null,null,null,null,null,null,null,null,null,null,null,null,null,null,null,null,null,null,null,null,null,null,null,null,null,null,null,null,null,null,null,null,null,null,null,null,null,null,null,null,null,null,null,null,null,null,null,null,null,null,null,null,null,null,null,null,null,null,null,null,null,null,null,null,null,null,null,null,null,null,null,null,null,null,null,null,null,null,null,null,null,null,null,null,null,null,null,null,null,null,null,null,null,null,null,null,null,null,null,null,null,null,null,null,null,null,null,null,null,null,null,null,null,null,null,null,null,null,null,null,null,null,null,null,null,null,null,null,null,null,null,null,null,null,null,null,null,null,null,null,null,null,null,null,null,null,null,null,null,null,null,null,null,null,null,null,null,null,null,null,null,null,null,null,null,null,null,null,null,null,null,null,{"$f":"Dateneingabe!N43","v":37},null,{"$f":"Dateneingabe!K43","v":0},{"$f":"Dateneingabe!L43","v":0},{"$f":"Dateneingabe!M43","v":0},{"$f":"COUNTIFS(E41:NF41,\"U\")","v":0},{"$f":"NL41-NM41","v":0}]
[{"$f":"IF(Dateneingabe!A44=0,\"zzz\",Dateneingabe!A44)","v":"zzz"},{"$f":"IF(Dateneingabe!B44=0,\"zzz\",Dateneingabe!B44)","v":"zzz"},{"$f":"IF(Dateneingabe!C44=0,\"zzz\",Dateneingabe!C44)","v":"zzz"},{"$f":"IF($D$3<$E$1,\"<?\",IF($D$3>$NF$1,\">?\",LOOKUP($D$3,$E$1:$NF$1,E42:NF42)))","v":0},null,null,null,null,null,null,null,null,null,null,null,null,null,null,null,null,null,null,null,null,null,null,null,null,null,null,null,null,null,null,null,null,null,null,null,null,null,null,null,null,null,null,null,null,null,null,null,null,null,null,null,null,null,null,null,null,null,null,null,null,null,null,null,null,null,null,null,null,null,null,null,null,null,null,null,null,null,null,null,null,null,null,null,null,null,null,null,null,null,null,null,null,null,null,null,null,null,null,null,null,null,null,null,null,null,null,null,null,null,null,null,null,null,null,null,null,null,null,null,null,null,null,null,null,null,null,null,null,null,null,null,null,null,null,null,null,null,null,null,null,null,null,null,null,null,null,null,null,null,null,null,null,null,null,null,null,null,null,null,null,null,null,null,null,null,null,null,null,null,null,null,null,null,null,null,null,null,null,null,null,null,null,null,null,null,null,null,null,null,null,null,null,null,null,null,null,null,null,null,null,null,null,null,null,null,null,null,null,null,null,null,null,null,null,null,null,null,null,null,null,null,null,null,null,null,null,null,null,null,null,null,null,null,null,null,null,null,null,null,null,null,null,null,null,null,null,null,null,null,null,null,null,null,null,null,null,null,null,null,null,null,null,null,null,null,null,null,null,null,null,null,null,null,null,null,null,null,null,null,null,null,null,null,null,null,null,null,null,null,null,null,null,null,null,null,null,null,null,null,null,null,null,null,null,null,null,null,null,null,null,null,null,null,null,null,null,null,null,null,null,null,null,null,null,null,null,null,null,null,null,null,null,null,null,null,null,null,null,null,null,null,null,null,null,null,null,null,null,null,null,null,null,null,null,null,null,null,null,null,null,null,null,null,null,null,null,null,{"$f":"Dateneingabe!N44","v":38},null,{"$f":"Dateneingabe!K44","v":0},{"$f":"Dateneingabe!L44","v":0},{"$f":"Dateneingabe!M44","v":0},{"$f":"COUNTIFS(E42:NF42,\"U\")","v":0},{"$f":"NL42-NM42","v":0}]
[{"$f":"IF(Dateneingabe!A45=0,\"zzz\",Dateneingabe!A45)","v":"zzz"},{"$f":"IF(Dateneingabe!B45=0,\"zzz\",Dateneingabe!B45)","v":"zzz"},{"$f":"IF(Dateneingabe!C45=0,\"zzz\",Dateneingabe!C45)","v":"zzz"},{"$f":"IF($D$3<$E$1,\"<?\",IF($D$3>$NF$1,\">?\",LOOKUP($D$3,$E$1:$NF$1,E43:NF43)))","v":0},null,null,null,null,null,null,null,null,null,null,null,null,null,null,null,null,null,null,null,null,null,null,null,null,null,null,null,null,null,null,null,null,null,null,null,null,null,null,null,null,null,null,null,null,null,null,null,null,null,null,null,null,null,null,null,null,null,null,null,null,null,null,null,null,null,null,null,null,null,null,null,null,null,null,null,null,null,null,null,null,null,null,null,null,null,null,null,null,null,null,null,null,null,null,null,null,null,null,null,null,null,null,null,null,null,null,null,null,null,null,null,null,null,null,null,null,null,null,null,null,null,null,null,null,null,null,null,null,null,null,null,null,null,null,null,null,null,null,null,null,null,null,null,null,null,null,null,null,null,null,null,null,null,null,null,null,null,null,null,null,null,null,null,null,null,null,null,null,null,null,null,null,null,null,null,null,null,null,null,null,null,null,null,null,null,null,null,null,null,null,null,null,null,null,null,null,null,null,null,null,null,null,null,null,null,null,null,null,null,null,null,null,null,null,null,null,null,null,null,null,null,null,null,null,null,null,null,null,null,null,null,null,null,null,null,null,null,null,null,null,null,null,null,null,null,null,null,null,null,null,null,null,null,null,null,null,null,null,null,null,null,null,null,null,null,null,null,null,null,null,null,null,null,null,null,null,null,null,null,null,null,null,null,null,null,null,null,null,null,null,null,null,null,null,null,null,null,null,null,null,null,null,null,null,null,null,null,null,null,null,null,null,null,null,null,null,null,null,null,null,null,null,null,null,null,null,null,null,null,null,null,null,null,null,null,null,null,null,null,null,null,null,null,null,null,null,null,null,null,null,null,null,null,null,null,null,null,null,null,null,null,null,null,null,null,null,null,{"$f":"Dateneingabe!N45","v":39},null,{"$f":"Dateneingabe!K45","v":0},{"$f":"Dateneingabe!L45","v":0},{"$f":"Dateneingabe!M45","v":0},{"$f":"COUNTIFS(E43:NF43,\"U\")","v":0},{"$f":"NL43-NM43","v":0}]
[{"$f":"IF(Dateneingabe!A46=0,\"zzz\",Dateneingabe!A46)","v":"zzz"},{"$f":"IF(Dateneingabe!B46=0,\"zzz\",Dateneingabe!B46)","v":"zzz"},{"$f":"IF(Dateneingabe!C46=0,\"zzz\",Dateneingabe!C46)","v":"zzz"},{"$f":"IF($D$3<$E$1,\"<?\",IF($D$3>$NF$1,\">?\",LOOKUP($D$3,$E$1:$NF$1,E44:NF44)))","v":0},null,null,null,null,null,null,null,null,null,null,null,null,null,null,null,null,null,null,null,null,null,null,null,null,null,null,null,null,null,null,null,null,null,null,null,null,null,null,null,null,null,null,null,null,null,null,null,null,null,null,null,null,null,null,null,null,null,null,null,null,null,null,null,null,null,null,null,null,null,null,null,null,null,null,null,null,null,null,null,null,null,null,null,null,null,null,null,null,null,null,null,null,null,null,null,null,null,null,null,null,null,null,null,null,null,null,null,null,null,null,null,null,null,null,null,null,null,null,null,null,null,null,null,null,null,null,null,null,null,null,null,null,null,null,null,null,null,null,null,null,null,null,null,null,null,null,null,null,null,null,null,null,null,null,null,null,null,null,null,null,null,null,null,null,null,null,null,null,null,null,null,null,null,null,null,null,null,null,null,null,null,null,null,null,null,null,null,null,null,null,null,null,null,null,null,null,null,null,null,null,null,null,null,null,null,null,null,null,null,null,null,null,null,null,null,null,null,null,null,null,null,null,null,null,null,null,null,null,null,null,null,null,null,null,null,null,null,null,null,null,null,null,null,null,null,null,null,null,null,null,null,null,null,null,null,null,null,null,null,null,null,null,null,null,null,null,null,null,null,null,null,null,null,null,null,null,null,null,null,null,null,null,null,null,null,null,null,null,null,null,null,null,null,null,null,null,null,null,null,null,null,null,null,null,null,null,null,null,null,null,null,null,null,null,null,null,null,null,null,null,null,null,null,null,null,null,null,null,null,null,null,null,null,null,null,null,null,null,null,null,null,null,null,null,null,null,null,null,null,null,null,null,null,null,null,null,null,null,null,null,null,null,null,null,null,null,null,{"$f":"Dateneingabe!N46","v":40},null,{"$f":"Dateneingabe!K46","v":0},{"$f":"Dateneingabe!L46","v":0},{"$f":"Dateneingabe!M46","v":0},{"$f":"COUNTIFS(E44:NF44,\"U\")","v":0},{"$f":"NL44-NM44","v":0}]
[{"$f":"IF(Dateneingabe!A47=0,\"zzz\",Dateneingabe!A47)","v":"zzz"},{"$f":"IF(Dateneingabe!B47=0,\"zzz\",Dateneingabe!B47)","v":"zzz"},{"$f":"IF(Dateneingabe!C47=0,\"zzz\",Dateneingabe!C47)","v":"zzz"},{"$f":"IF($D$3<$E$1,\"<?\",IF($D$3>$NF$1,\">?\",LOOKUP($D$3,$E$1:$NF$1,E45:NF45)))","v":0},null,null,null,null,null,null,null,null,null,null,null,null,null,null,null,null,null,null,null,null,null,null,null,null,null,null,null,null,null,null,null,null,null,null,null,null,null,null,null,null,null,null,null,null,null,null,null,null,null,null,null,null,null,null,null,null,null,null,null,null,null,null,null,null,null,null,null,null,null,null,null,null,null,null,null,null,null,null,null,null,null,null,null,null,null,null,null,null,null,null,null,null,null,null,null,null,null,null,null,null,null,null,null,null,null,null,null,null,null,null,null,null,null,null,null,null,null,null,null,null,null,null,null,null,null,null,null,null,null,null,null,null,null,null,null,null,null,null,null,null,null,null,null,null,null,null,null,null,null,null,null,null,null,null,null,null,null,null,null,null,null,null,null,null,null,null,null,null,null,null,null,null,null,null,null,null,null,null,null,null,null,null,null,null,null,null,null,null,null,null,null,null,null,null,null,null,null,null,null,null,null,null,null,null,null,null,null,null,null,null,null,null,null,null,null,null,null,null,null,null,null,null,null,null,null,null,null,null,null,null,null,null,null,null,null,null,null,null,null,null,null,null,null,null,null,null,null,null,null,null,null,null,null,null,null,null,null,null,null,null,null,null,null,null,null,null,null,null,null,null,null,null,null,null,null,null,null,null,null,null,null,null,null,null,null,null,null,null,null,null,null,null,null,null,null,null,null,null,null,null,null,null,null,null,null,null,null,null,null,null,null,null,null,null,null,null,null,null,null,null,null,null,null,null,null,null,null,null,null,null,null,null,null,null,null,null,null,null,null,null,null,null,null,null,null,null,null,null,null,null,null,null,null,null,null,null,null,null,null,null,null,null,null,null,null,null,null,{"$f":"Dateneingabe!N47","v":41},null,{"$f":"Dateneingabe!K47","v":0},{"$f":"Dateneingabe!L47","v":0},{"$f":"Dateneingabe!M47","v":0},{"$f":"COUNTIFS(E45:NF45,\"U\")","v":0},{"$f":"NL45-NM45","v":0}]
[{"$f":"IF(Dateneingabe!A48=0,\"zzz\",Dateneingabe!A48)","v":"zzz"},{"$f":"IF(Dateneingabe!B48=0,\"zzz\",Dateneingabe!B48)","v":"zzz"},{"$f":"IF(Dateneingabe!C48=0,\"zzz\",Dateneingabe!C48)","v":"zzz"},{"$f":"IF($D$3<$E$1,\"<?\",IF($D$3>$NF$1,\">?\",LOOKUP($D$3,$E$1:$NF$1,E46:NF46)))","v":0},null,null,null,null,null,null,null,null,null,null,null,null,null,null,null,null,null,null,null,null,null,null,null,null,null,null,null,null,null,null,null,null,null,null,null,null,null,null,null,null,null,null,null,null,null,null,null,null,null,null,null,null,null,null,null,null,null,null,null,null,null,null,null,null,null,null,null,null,null,null,null,null,null,null,null,null,null,null,null,null,null,null,null,null,null,null,null,null,null,null,null,null,null,null,null,null,null,null,null,null,null,null,null,null,null,null,null,null,null,null,null,null,null,null,null,null,null,null,null,null,null,null,null,null,null,null,null,null,null,null,null,null,null,null,null,null,null,null,null,null,null,null,null,null,null,null,null,null,null,null,null,null,null,null,null,null,null,null,null,null,null,null,null,null,null,null,null,null,null,null,null,null,null,null,null,null,null,null,null,null,null,null,null,null,null,null,null,null,null,null,null,null,null,null,null,null,null,null,null,null,null,null,null,null,null,null,null,null,null,null,null,null,null,null,null,null,null,null,null,null,null,null,null,null,null,null,null,null,null,null,null,null,null,null,null,null,null,null,null,null,null,null,null,null,null,null,null,null,null,null,null,null,null,null,null,null,null,null,null,null,null,null,null,null,null,null,null,null,null,null,null,null,null,null,null,null,null,null,null,null,null,null,null,null,null,null,null,null,null,null,null,null,null,null,null,null,null,null,null,null,null,null,null,null,null,null,null,null,null,null,null,null,null,null,null,null,null,null,null,null,null,null,null,null,null,null,null,null,null,null,null,null,null,null,null,null,null,null,null,null,null,null,null,null,null,null,null,null,null,null,null,null,null,null,null,null,null,null,null,null,null,null,null,null,null,null,null,{"$f":"Dateneingabe!N48","v":42},null,{"$f":"Dateneingabe!K48","v":0},{"$f":"Dateneingabe!L48","v":0},{"$f":"Dateneingabe!M48","v":0},{"$f":"COUNTIFS(E46:NF46,\"U\")","v":0},{"$f":"NL46-NM46","v":0}]
[{"$f":"IF(Dateneingabe!A49=0,\"zzz\",Dateneingabe!A49)","v":"zzz"},{"$f":"IF(Dateneingabe!B49=0,\"zzz\",Dateneingabe!B49)","v":"zzz"},{"$f":"IF(Dateneingabe!C49=0,\"zzz\",Dateneingabe!C49)","v":"zzz"},{"$f":"IF($D$3<$E$1,\"<?\",IF($D$3>$NF$1,\">?\",LOOKUP($D$3,$E$1:$NF$1,E47:NF47)))","v":0},null,null,null,null,null,null,null,null,null,null,null,null,null,null,null,null,null,null,null,null,null,null,null,null,null,null,null,null,null,null,null,null,null,null,null,null,null,null,null,null,null,null,null,null,null,null,null,null,null,null,null,null,null,null,null,null,null,null,null,null,null,null,null,null,null,null,null,null,null,null,null,null,null,null,null,null,null,null,null,null,null,null,null,null,null,null,null,null,null,null,null,null,null,null,null,null,null,null,null,null,null,null,null,null,null,null,null,null,null,null,null,null,null,null,null,null,null,null,null,null,null,null,null,null,null,null,null,null,null,null,null,null,null,null,null,null,null,null,null,null,null,null,null,null,null,null,null,null,null,null,null,null,null,null,null,null,null,null,null,null,null,null,null,null,null,null,null,null,null,null,null,null,null,null,null,null,null,null,null,null,null,null,null,null,null,null,null,null,null,null,null,null,null,null,null,null,null,null,null,null,null,null,null,null,null,null,null,null,null,null,null,null,null,null,null,null,null,null,null,null,null,null,null,null,null,null,null,null,null,null,null,null,null,null,null,null,null,null,null,null,null,null,null,null,null,null,null,null,null,null,null,null,null,null,null,null,null,null,null,null,null,null,null,null,null,null,null,null,null,null,null,null,null,null,null,null,null,null,null,null,null,null,null,null,null,null,null,null,null,null,null,null,null,null,null,null,null,null,null,null,null,null,null,null,null,null,null,null,null,null,null,null,null,null,null,null,null,null,null,null,null,null,null,null,null,null,null,null,null,null,null,null,null,null,null,null,null,null,null,null,null,null,null,null,null,null,null,null,null,null,null,null,null,null,null,null,null,null,null,null,null,null,null,null,null,null,null,{"$f":"Dateneingabe!N49","v":43},null,{"$f":"Dateneingabe!K49","v":0},{"$f":"Dateneingabe!L49","v":0},{"$f":"Dateneingabe!M49","v":0},{"$f":"COUNTIFS(E47:NF47,\"U\")","v":0},{"$f":"NL47-NM47","v":0}]
[{"$f":"IF(Dateneingabe!A50=0,\"zzz\",Dateneingabe!A50)","v":"zzz"},{"$f":"IF(Dateneingabe!B50=0,\"zzz\",Dateneingabe!B50)","v":"zzz"},{"$f":"IF(Dateneingabe!C50=0,\"zzz\",Dateneingabe!C50)","v":"zzz"},{"$f":"IF($D$3<$E$1,\"<?\",IF($D$3>$NF$1,\">?\",LOOKUP($D$3,$E$1:$NF$1,E48:NF48)))","v":0},null,null,null,null,null,null,null,null,null,null,null,null,null,null,null,null,null,null,null,null,null,null,null,null,null,null,null,null,null,null,null,null,null,null,null,null,null,null,null,null,null,null,null,null,null,null,null,null,null,null,null,null,null,null,null,null,null,null,null,null,null,null,null,null,null,null,null,null,null,null,null,null,null,null,null,null,null,null,null,null,null,null,null,null,null,null,null,null,null,null,null,null,null,null,null,null,null,null,null,null,null,null,null,null,null,null,null,null,null,null,null,null,null,null,null,null,null,null,null,null,null,null,null,null,null,null,null,null,null,null,null,null,null,null,null,null,null,null,null,null,null,null,null,null,null,null,null,null,null,null,null,null,null,null,null,null,null,null,null,null,null,null,null,null,null,null,null,null,null,null,null,null,null,null,null,null,null,null,null,null,null,null,null,null,null,null,null,null,null,null,null,null,null,null,null,null,null,null,null,null,null,null,null,null,null,null,null,null,null,null,null,null,null,null,null,null,null,null,null,null,null,null,null,null,null,null,null,null,null,null,null,null,null,null,null,null,null,null,null,null,null,null,null,null,null,null,null,null,null,null,null,null,null,null,null,null,null,null,null,null,null,null,null,null,null,null,null,null,null,null,null,null,null,null,null,null,null,null,null,null,null,null,null,null,null,null,null,null,null,null,null,null,null,null,null,null,null,null,null,null,null,null,null,null,null,null,null,null,null,null,null,null,null,null,null,null,null,null,null,null,null,null,null,null,null,null,null,null,null,null,null,null,null,null,null,null,null,null,null,null,null,null,null,null,null,null,null,null,null,null,null,null,null,null,null,null,null,null,null,null,null,null,null,null,null,null,null,{"$f":"Dateneingabe!N50","v":44},null,{"$f":"Dateneingabe!K50","v":0},{"$f":"Dateneingabe!L50","v":0},{"$f":"Dateneingabe!M50","v":0},{"$f":"COUNTIFS(E48:NF48,\"U\")","v":0},{"$f":"NL48-NM48","v":0}]
[{"$f":"IF(Dateneingabe!A51=0,\"zzz\",Dateneingabe!A51)","v":"zzz"},{"$f":"IF(Dateneingabe!B51=0,\"zzz\",Dateneingabe!B51)","v":"zzz"},{"$f":"IF(Dateneingabe!C51=0,\"zzz\",Dateneingabe!C51)","v":"zzz"},{"$f":"IF($D$3<$E$1,\"<?\",IF($D$3>$NF$1,\">?\",LOOKUP($D$3,$E$1:$NF$1,E49:NF49)))","v":0},null,null,null,null,null,null,null,null,null,null,null,null,null,null,null,null,null,null,null,null,null,null,null,null,null,null,null,null,null,null,null,null,null,null,null,null,null,null,null,null,null,null,null,null,null,null,null,null,null,null,null,null,null,null,null,null,null,null,null,null,null,null,null,null,null,null,null,null,null,null,null,null,null,null,null,null,null,null,null,null,null,null,null,null,null,null,null,null,null,null,null,null,null,null,null,null,null,null,null,null,null,null,null,null,null,null,null,null,null,null,null,null,null,null,null,null,null,null,null,null,null,null,null,null,null,null,null,null,null,null,null,null,null,null,null,null,null,null,null,null,null,null,null,null,null,null,null,null,null,null,null,null,null,null,null,null,null,null,null,null,null,null,null,null,null,null,null,null,null,null,null,null,null,null,null,null,null,null,null,null,null,null,null,null,null,null,null,null,null,null,null,null,null,null,null,null,null,null,null,null,null,null,null,null,null,null,null,null,null,null,null,null,null,null,null,null,null,null,null,null,null,null,null,null,null,null,null,null,null,null,null,null,null,null,null,null,null,null,null,null,null,null,null,null,null,null,null,null,null,null,null,null,null,null,null,null,null,null,null,null,null,null,null,null,null,null,null,null,null,null,null,null,null,null,null,null,null,null,null,null,null,null,null,null,null,null,null,null,null,null,null,null,null,null,null,null,null,null,null,null,null,null,null,null,null,null,null,null,null,null,null,null,null,null,null,null,null,null,null,null,null,null,null,null,null,null,null,null,null,null,null,null,null,null,null,null,null,null,null,null,null,null,null,null,null,null,null,null,null,null,null,null,null,null,null,null,null,null,null,null,null,null,null,null,null,null,null,{"$f":"Dateneingabe!N51","v":45},null,{"$f":"Dateneingabe!K51","v":0},{"$f":"Dateneingabe!L51","v":0},{"$f":"Dateneingabe!M51","v":0},{"$f":"COUNTIFS(E49:NF49,\"U\")","v":0},{"$f":"NL49-NM49","v":0}]
[{"$f":"IF(Dateneingabe!A52=0,\"zzz\",Dateneingabe!A52)","v":"zzz"},{"$f":"IF(Dateneingabe!B52=0,\"zzz\",Dateneingabe!B52)","v":"zzz"},{"$f":"IF(Dateneingabe!C52=0,\"zzz\",Dateneingabe!C52)","v":"zzz"},{"$f":"IF($D$3<$E$1,\"<?\",IF($D$3>$NF$1,\">?\",LOOKUP($D$3,$E$1:$NF$1,E50:NF50)))","v":0},null,null,null,null,null,null,null,null,null,null,null,null,null,null,null,null,null,null,null,null,null,null,null,null,null,null,null,null,null,null,null,null,null,null,null,null,null,null,null,null,null,null,null,null,null,null,null,null,null,null,null,null,null,null,null,null,null,null,null,null,null,null,null,null,null,null,null,null,null,null,null,null,null,null,null,null,null,null,null,null,null,null,null,null,null,null,null,null,null,null,null,null,null,null,null,null,null,null,null,null,null,null,null,null,null,null,null,null,null,null,null,null,null,null,null,null,null,null,null,null,null,null,null,null,null,null,null,null,null,null,null,null,null,null,null,null,null,null,null,null,null,null,null,null,null,null,null,null,null,null,null,null,null,null,null,null,null,null,null,null,null,null,null,null,null,null,null,null,null,null,null,null,null,null,null,null,null,null,null,null,null,null,null,null,null,null,null,null,null,null,null,null,null,null,null,null,null,null,null,null,null,null,null,null,null,null,null,null,null,null,null,null,null,null,null,null,null,null,null,null,null,null,null,null,null,null,null,null,null,null,null,null,null,null,null,null,null,null,null,null,null,null,null,null,null,null,null,null,null,null,null,null,null,null,null,null,null,null,null,null,null,null,null,null,null,null,null,null,null,null,null,null,null,null,null,null,null,null,null,null,null,null,null,null,null,null,null,null,null,null,null,null,null,null,null,null,null,null,null,null,null,null,null,null,null,null,null,null,null,null,null,null,null,null,null,null,null,null,null,null,null,null,null,null,null,null,null,null,null,null,null,null,null,null,null,null,null,null,null,null,null,null,null,null,null,null,null,null,null,null,null,null,null,null,null,null,null,null,null,null,null,null,null,null,null,null,null,{"$f":"Dateneingabe!N52","v":46},null,{"$f":"Dateneingabe!K52","v":0},{"$f":"Dateneingabe!L52","v":0},{"$f":"Dateneingabe!M52","v":0},{"$f":"COUNTIFS(E50:NF50,\"U\")","v":0},{"$f":"NL50-NM50","v":0}]
[{"$f":"IF(Dateneingabe!A53=0,\"zzz\",Dateneingabe!A53)","v":"zzz"},{"$f":"IF(Dateneingabe!B53=0,\"zzz\",Dateneingabe!B53)","v":"zzz"},{"$f":"IF(Dateneingabe!C53=0,\"zzz\",Dateneingabe!C53)","v":"zzz"},{"$f":"IF($D$3<$E$1,\"<?\",IF($D$3>$NF$1,\">?\",LOOKUP($D$3,$E$1:$NF$1,E51:NF51)))","v":0},null,null,null,null,null,null,null,null,null,null,null,null,null,null,null,null,null,null,null,null,null,null,null,null,null,null,null,null,null,null,null,null,null,null,null,null,null,null,null,null,null,null,null,null,null,null,null,null,null,null,null,null,null,null,null,null,null,null,null,null,null,null,null,null,null,null,null,null,null,null,null,null,null,null,null,null,null,null,null,null,null,null,null,null,null,null,null,null,null,null,null,null,null,null,null,null,null,null,null,null,null,null,null,null,null,null,null,null,null,null,null,null,null,null,null,null,null,null,null,null,null,null,null,null,null,null,null,null,null,null,null,null,null,null,null,null,null,null,null,null,null,null,null,null,null,null,null,null,null,null,null,null,null,null,null,null,null,null,null,null,null,null,null,null,null,null,null,null,null,null,null,null,null,null,null,null,null,null,null,null,null,null,null,null,null,null,null,null,null,null,null,null,null,null,null,null,null,null,null,null,null,null,null,null,null,null,null,null,null,null,null,null,null,null,null,null,null,null,null,null,null,null,null,null,null,null,null,null,null,null,null,null,null,null,null,null,null,null,null,null,null,null,null,null,null,null,null,null,null,null,null,null,null,null,null,null,null,null,null,null,null,null,null,null,null,null,null,null,null,null,null,null,null,null,null,null,null,null,null,null,null,null,null,null,null,null,null,null,null,null,null,null,null,null,null,null,null,null,null,null,null,null,null,null,null,null,null,null,null,null,null,null,null,null,null,null,null,null,null,null,null,null,null,null,null,null,null,null,null,null,null,null,null,null,null,null,null,null,null,null,null,null,null,null,null,null,null,null,null,null,null,null,null,null,null,null,null,null,null,null,null,null,null,null,null,null,null,{"$f":"Dateneingabe!N53","v":47},null,{"$f":"Dateneingabe!K53","v":0},{"$f":"Dateneingabe!L53","v":0},{"$f":"Dateneingabe!M53","v":0},{"$f":"COUNTIFS(E51:NF51,\"U\")","v":0},{"$f":"NL51-NM51","v":0}]
[{"$f":"IF(Dateneingabe!A54=0,\"zzz\",Dateneingabe!A54)","v":"zzz"},{"$f":"IF(Dateneingabe!B54=0,\"zzz\",Dateneingabe!B54)","v":"zzz"},{"$f":"IF(Dateneingabe!C54=0,\"zzz\",Dateneingabe!C54)","v":"zzz"},{"$f":"IF($D$3<$E$1,\"<?\",IF($D$3>$NF$1,\">?\",LOOKUP($D$3,$E$1:$NF$1,E52:NF52)))","v":0},null,null,null,null,null,null,null,null,null,null,null,null,null,null,null,null,null,null,null,null,null,null,null,null,null,null,null,null,null,null,null,null,null,null,null,null,null,null,null,null,null,null,null,null,null,null,null,null,null,null,null,null,null,null,null,null,null,null,null,null,null,null,null,null,null,null,null,null,null,null,null,null,null,null,null,null,null,null,null,null,null,null,null,null,null,null,null,null,null,null,null,null,null,null,null,null,null,null,null,null,null,null,null,null,null,null,null,null,null,null,null,null,null,null,null,null,null,null,null,null,null,null,null,null,null,null,null,null,null,null,null,null,null,null,null,null,null,null,null,null,null,null,null,null,null,null,null,null,null,null,null,null,null,null,null,null,null,null,null,null,null,null,null,null,null,null,null,null,null,null,null,null,null,null,null,null,null,null,null,null,null,null,null,null,null,null,null,null,null,null,null,null,null,null,null,null,null,null,null,null,null,null,null,null,null,null,null,null,null,null,null,null,null,null,null,null,null,null,null,null,null,null,null,null,null,null,null,null,null,null,null,null,null,null,null,null,null,null,null,null,null,null,null,null,null,null,null,null,null,null,null,null,null,null,null,null,null,null,null,null,null,null,null,null,null,null,null,null,null,null,null,null,null,null,null,null,null,null,null,null,null,null,null,null,null,null,null,null,null,null,null,null,null,null,null,null,null,null,null,null,null,null,null,null,null,null,null,null,null,null,null,null,null,null,null,null,null,null,null,null,null,null,null,null,null,null,null,null,null,null,null,null,null,null,null,null,null,null,null,null,null,null,null,null,null,null,null,null,null,null,null,null,null,null,null,null,null,null,null,null,null,null,null,null,null,null,null,{"$f":"Dateneingabe!N54","v":48},null,{"$f":"Dateneingabe!K54","v":0},{"$f":"Dateneingabe!L54","v":0},{"$f":"Dateneingabe!M54","v":0},{"$f":"COUNTIFS(E52:NF52,\"U\")","v":0},{"$f":"NL52-NM52","v":0}]
[{"$f":"IF(Dateneingabe!A55=0,\"zzz\",Dateneingabe!A55)","v":"zzz"},{"$f":"IF(Dateneingabe!B55=0,\"zzz\",Dateneingabe!B55)","v":"zzz"},{"$f":"IF(Dateneingabe!C55=0,\"zzz\",Dateneingabe!C55)","v":"zzz"},{"$f":"IF($D$3<$E$1,\"<?\",IF($D$3>$NF$1,\">?\",LOOKUP($D$3,$E$1:$NF$1,E53:NF53)))","v":0},null,null,null,null,null,null,null,null,null,null,null,null,null,null,null,null,null,null,null,null,null,null,null,null,null,null,null,null,null,null,null,null,null,null,null,null,null,null,null,null,null,null,null,null,null,null,null,null,null,null,null,null,null,null,null,null,null,null,null,null,null,null,null,null,null,null,null,null,null,null,null,null,null,null,null,null,null,null,null,null,null,null,null,null,null,null,null,null,null,null,null,null,null,null,null,null,null,null,null,null,null,null,null,null,null,null,null,null,null,null,null,null,null,null,null,null,null,null,null,null,null,null,null,null,null,null,null,null,null,null,null,null,null,null,null,null,null,null,null,null,null,null,null,null,null,null,null,null,null,null,null,null,null,null,null,null,null,null,null,null,null,null,null,null,null,null,null,null,null,null,null,null,null,null,null,null,null,null,null,null,null,null,null,null,null,null,null,null,null,null,null,null,null,null,null,null,null,null,null,null,null,null,null,null,null,null,null,null,null,null,null,null,null,null,null,null,null,null,null,null,null,null,null,null,null,null,null,null,null,null,null,null,null,null,null,null,null,null,null,null,null,null,null,null,null,null,null,null,null,null,null,null,null,null,null,null,null,null,null,null,null,null,null,null,null,null,null,null,null,null,null,null,null,null,null,null,null,null,null,null,null,null,null,null,null,null,null,null,null,null,null,null,null,null,null,null,null,null,null,null,null,null,null,null,null,null,null,null,null,null,null,null,null,null,null,null,null,null,null,null,null,null,null,null,null,null,null,null,null,null,null,null,null,null,null,null,null,null,null,null,null,null,null,null,null,null,null,null,null,null,null,null,null,null,null,null,null,null,null,null,null,null,null,null,null,null,null,{"$f":"Dateneingabe!N55","v":49},null,{"$f":"Dateneingabe!K55","v":0},{"$f":"Dateneingabe!L55","v":0},{"$f":"Dateneingabe!M55","v":0},{"$f":"COUNTIFS(E53:NF53,\"U\")","v":0},{"$f":"NL53-NM53","v":0}]
[{"$f":"IF(Dateneingabe!A56=0,\"zzz\",Dateneingabe!A56)","v":"zzz"},{"$f":"IF(Dateneingabe!B56=0,\"zzz\",Dateneingabe!B56)","v":"zzz"},{"$f":"IF(Dateneingabe!C56=0,\"zzz\",Dateneingabe!C56)","v":"zzz"},{"$f":"IF($D$3<$E$1,\"<?\",IF($D$3>$NF$1,\">?\",LOOKUP($D$3,$E$1:$NF$1,E54:NF54)))","v":0},null,null,null,null,null,null,null,null,null,null,null,null,null,null,null,null,null,null,null,null,null,null,null,null,null,null,null,null,null,null,null,null,null,null,null,null,null,null,null,null,null,null,null,null,null,null,null,null,null,null,null,null,null,null,null,null,null,null,null,null,null,null,null,null,null,null,null,null,null,null,null,null,null,null,null,null,null,null,null,null,null,null,null,null,null,null,null,null,null,null,null,null,null,null,null,null,null,null,null,null,null,null,null,null,null,null,null,null,null,null,null,null,null,null,null,null,null,null,null,null,null,null,null,null,null,null,null,null,null,null,null,null,null,null,null,null,null,null,null,null,null,null,null,null,null,null,null,null,null,null,null,null,null,null,null,null,null,null,null,null,null,null,null,null,null,null,null,null,null,null,null,null,null,null,null,null,null,null,null,null,null,null,null,null,null,null,null,null,null,null,null,null,null,null,null,null,null,null,null,null,null,null,null,null,null,null,null,null,null,null,null,null,null,null,null,null,null,null,null,null,null,null,null,null,null,null,null,null,null,null,null,null,null,null,null,null,null,null,null,null,null,null,null,null,null,null,null,null,null,null,null,null,null,null,null,null,null,null,null,null,null,null,null,null,null,null,null,null,null,null,null,null,null,null,null,null,null,null,null,null,null,null,null,null,null,null,null,null,null,null,null,null,null,null,null,null,null,null,null,null,null,null,null,null,null,null,null,null,null,null,null,null,null,null,null,null,null,null,null,null,null,null,null,null,null,null,null,null,null,null,null,null,null,null,null,null,null,null,null,null,null,null,null,null,null,null,null,null,null,null,null,null,null,null,null,null,null,null,null,null,null,null,null,null,null,null,null,{"$f":"Dateneingabe!N56","v":50},null,{"$f":"Dateneingabe!K56","v":0},{"$f":"Dateneingabe!L56","v":0},{"$f":"Dateneingabe!M56","v":0},{"$f":"COUNTIFS(E54:NF54,\"U\")","v":0},{"$f":"NL54-NM54","v":0}]
[{"$f":"IF(Dateneingabe!A57=0,\"zzz\",Dateneingabe!A57)","v":"zzz"},{"$f":"IF(Dateneingabe!B57=0,\"zzz\",Dateneingabe!B57)","v":"zzz"},{"$f":"IF(Dateneingabe!C57=0,\"zzz\",Dateneingabe!C57)","v":"zzz"},{"$f":"IF($D$3<$E$1,\"<?\",IF($D$3>$NF$1,\">?\",LOOKUP($D$3,$E$1:$NF$1,E55:NF55)))","v":0},null,null,null,null,null,null,null,null,null,null,null,null,null,null,null,null,null,null,null,null,null,null,null,null,null,null,null,null,null,null,null,null,null,null,null,null,null,null,null,null,null,null,null,null,null,null,null,null,null,null,null,null,null,null,null,null,null,null,null,null,null,null,null,null,null,null,null,null,null,null,null,null,null,null,null,null,null,null,null,null,null,null,null,null,null,null,null,null,null,null,null,null,null,null,null,null,null,null,null,null,null,null,null,null,null,null,null,null,null,null,null,null,null,null,null,null,null,null,null,null,null,null,null,null,null,null,null,null,null,null,null,null,null,null,null,null,null,null,null,null,null,null,null,null,null,null,null,null,null,null,null,null,null,null,null,null,null,null,null,null,null,null,null,null,null,null,null,null,null,null,null,null,null,null,null,null,null,null,null,null,null,null,null,null,null,null,null,null,null,null,null,null,null,null,null,null,null,null,null,null,null,null,null,null,null,null,null,null,null,null,null,null,null,null,null,null,null,null,null,null,null,null,null,null,null,null,null,null,null,null,null,null,null,null,null,null,null,null,null,null,null,null,null,null,null,null,null,null,null,null,null,null,null,null,null,null,null,null,null,null,null,null,null,null,null,null,null,null,null,null,null,null,null,null,null,null,null,null,null,null,null,null,null,null,null,null,null,null,null,null,null,null,null,null,null,null,null,null,null,null,null,null,null,null,null,null,null,null,null,null,null,null,null,null,null,null,null,null,null,null,null,null,null,null,null,null,null,null,null,null,null,null,null,null,null,null,null,null,null,null,null,null,null,null,null,null,null,null,null,null,null,null,null,null,null,null,null,null,null,null,null,null,null,null,null,null,null,{"$f":"Dateneingabe!N57","v":51},null,{"$f":"Dateneingabe!K57","v":0},{"$f":"Dateneingabe!L57","v":0},{"$f":"Dateneingabe!M57","v":0},{"$f":"COUNTIFS(E55:NF55,\"U\")","v":0},{"$f":"NL55-NM55","v":0}]
[{"$f":"IF(Dateneingabe!A58=0,\"zzz\",Dateneingabe!A58)","v":"zzz"},{"$f":"IF(Dateneingabe!B58=0,\"zzz\",Dateneingabe!B58)","v":"zzz"},{"$f":"IF(Dateneingabe!C58=0,\"zzz\",Dateneingabe!C58)","v":"zzz"},{"$f":"IF($D$3<$E$1,\"<?\",IF($D$3>$NF$1,\">?\",LOOKUP($D$3,$E$1:$NF$1,E56:NF56)))","v":0},null,null,null,null,null,null,null,null,null,null,null,null,null,null,null,null,null,null,null,null,null,null,null,null,null,null,null,null,null,null,null,null,null,null,null,null,null,null,null,null,null,null,null,null,null,null,null,null,null,null,null,null,null,null,null,null,null,null,null,null,null,null,null,null,null,null,null,null,null,null,null,null,null,null,null,null,null,null,null,null,null,null,null,null,null,null,null,null,null,null,null,null,null,null,null,null,null,null,null,null,null,null,null,null,null,null,null,null,null,null,null,null,null,null,null,null,null,null,null,null,null,null,null,null,null,null,null,null,null,null,null,null,null,null,null,null,null,null,null,null,null,null,null,null,null,null,null,null,null,null,null,null,null,null,null,null,null,null,null,null,null,null,null,null,null,null,null,null,null,null,null,null,null,null,null,null,null,null,null,null,null,null,null,null,null,null,null,null,null,null,null,null,null,null,null,null,null,null,null,null,null,null,null,null,null,null,null,null,null,null,null,null,null,null,null,null,null,null,null,null,null,null,null,null,null,null,null,null,null,null,null,null,null,null,null,null,null,null,null,null,null,null,null,null,null,null,null,null,null,null,null,null,null,null,null,null,null,null,null,null,null,null,null,null,null,null,null,null,null,null,null,null,null,null,null,null,null,null,null,null,null,null,null,null,null,null,null,null,null,null,null,null,null,null,null,null,null,null,null,null,null,null,null,null,null,null,null,null,null,null,null,null,null,null,null,null,null,null,null,null,null,null,null,null,null,null,null,null,null,null,null,null,null,null,null,null,null,null,null,null,null,null,null,null,null,null,null,null,null,null,null,null,null,null,null,null,null,null,null,null,null,null,null,null,null,null,null,{"$f":"Dateneingabe!N58","v":52},null,{"$f":"Dateneingabe!K58","v":0},{"$f":"Dateneingabe!L58","v":0},{"$f":"Dateneingabe!M58","v":0},{"$f":"COUNTIFS(E56:NF56,\"U\")","v":0},{"$f":"NL56-NM56","v":0}]
[{"$f":"IF(Dateneingabe!A59=0,\"zzz\",Dateneingabe!A59)","v":"zzz"},{"$f":"IF(Dateneingabe!B59=0,\"zzz\",Dateneingabe!B59)","v":"zzz"},{"$f":"IF(Dateneingabe!C59=0,\"zzz\",Dateneingabe!C59)","v":"zzz"},{"$f":"IF($D$3<$E$1,\"<?\",IF($D$3>$NF$1,\">?\",LOOKUP($D$3,$E$1:$NF$1,E57:NF57)))","v":0},null,null,null,null,null,null,null,null,null,null,null,null,null,null,null,null,null,null,null,null,null,null,null,null,null,null,null,null,null,null,null,null,null,null,null,null,null,null,null,null,null,null,null,null,null,null,null,null,null,null,null,null,null,null,null,null,null,null,null,null,null,null,null,null,null,null,null,null,null,null,null,null,null,null,null,null,null,null,null,null,null,null,null,null,null,null,null,null,null,null,null,null,null,null,null,null,null,null,null,null,null,null,null,null,null,null,null,null,null,null,null,null,null,null,null,null,null,null,null,null,null,null,null,null,null,null,null,null,null,null,null,null,null,null,null,null,null,null,null,null,null,null,null,null,null,null,null,null,null,null,null,null,null,null,null,null,null,null,null,null,null,null,null,null,null,null,null,null,null,null,null,null,null,null,null,null,null,null,null,null,null,null,null,null,null,null,null,null,null,null,null,null,null,null,null,null,null,null,null,null,null,null,null,null,null,null,null,null,null,null,null,null,null,null,null,null,null,null,null,null,null,null,null,null,null,null,null,null,null,null,null,null,null,null,null,null,null,null,null,null,null,null,null,null,null,null,null,null,null,null,null,null,null,null,null,null,null,null,null,null,null,null,null,null,null,null,null,null,null,null,null,null,null,null,null,null,null,null,null,null,null,null,null,null,null,null,null,null,null,null,null,null,null,null,null,null,null,null,null,null,null,null,null,null,null,null,null,null,null,null,null,null,null,null,null,null,null,null,null,null,null,null,null,null,null,null,null,null,null,null,null,null,null,null,null,null,null,null,null,null,null,null,null,null,null,null,null,null,null,null,null,null,null,null,null,null,null,null,null,null,null,null,null,null,null,null,null,{"$f":"Dateneingabe!N59","v":53},null,{"$f":"Dateneingabe!K59","v":0},{"$f":"Dateneingabe!L59","v":0},{"$f":"Dateneingabe!M59","v":0},{"$f":"COUNTIFS(E57:NF57,\"U\")","v":0},{"$f":"NL57-NM57","v":0}]
[{"$f":"IF(Dateneingabe!A60=0,\"zzz\",Dateneingabe!A60)","v":"zzz"},{"$f":"IF(Dateneingabe!B60=0,\"zzz\",Dateneingabe!B60)","v":"zzz"},{"$f":"IF(Dateneingabe!C60=0,\"zzz\",Dateneingabe!C60)","v":"zzz"},{"$f":"IF($D$3<$E$1,\"<?\",IF($D$3>$NF$1,\">?\",LOOKUP($D$3,$E$1:$NF$1,E58:NF58)))","v":0},null,null,null,null,null,null,null,null,null,null,null,null,null,null,null,null,null,null,null,null,null,null,null,null,null,null,null,null,null,null,null,null,null,null,null,null,null,null,null,null,null,null,null,null,null,null,null,null,null,null,null,null,null,null,null,null,null,null,null,null,null,null,null,null,null,null,null,null,null,null,null,null,null,null,null,null,null,null,null,null,null,null,null,null,null,null,null,null,null,null,null,null,null,null,null,null,null,null,null,null,null,null,null,null,null,null,null,null,null,null,null,null,null,null,null,null,null,null,null,null,null,null,null,null,null,null,null,null,null,null,null,null,null,null,null,null,null,null,null,null,null,null,null,null,null,null,null,null,null,null,null,null,null,null,null,null,null,null,null,null,null,null,null,null,null,null,null,null,null,null,null,null,null,null,null,null,null,null,null,null,null,null,null,null,null,null,null,null,null,null,null,null,null,null,null,null,null,null,null,null,null,null,null,null,null,null,null,null,null,null,null,null,null,null,null,null,null,null,null,null,null,null,null,null,null,null,null,null,null,null,null,null,null,null,null,null,null,null,null,null,null,null,null,null,null,null,null,null,null,null,null,null,null,null,null,null,null,null,null,null,null,null,null,null,null,null,null,null,null,null,null,null,null,null,null,null,null,null,null,null,null,null,null,null,null,null,null,null,null,null,null,null,null,null,null,null,null,null,null,null,null,null,null,null,null,null,null,null,null,null,null,null,null,null,null,null,null,null,null,null,null,null,null,null,null,null,null,null,null,null,null,null,null,null,null,null,null,null,null,null,null,null,null,null,null,null,null,null,null,null,null,null,null,null,null,null,null,null,null,null,null,null,null,null,null,null,null,{"$f":"Dateneingabe!N60","v":54},null,{"$f":"Dateneingabe!K60","v":0},{"$f":"Dateneingabe!L60","v":0},{"$f":"Dateneingabe!M60","v":0},{"$f":"COUNTIFS(E58:NF58,\"U\")","v":0},{"$f":"NL58-NM58","v":0}]
[{"$f":"IF(Dateneingabe!A61=0,\"zzz\",Dateneingabe!A61)","v":"zzz"},{"$f":"IF(Dateneingabe!B61=0,\"zzz\",Dateneingabe!B61)","v":"zzz"},{"$f":"IF(Dateneingabe!C61=0,\"zzz\",Dateneingabe!C61)","v":"zzz"},{"$f":"IF($D$3<$E$1,\"<?\",IF($D$3>$NF$1,\">?\",LOOKUP($D$3,$E$1:$NF$1,E59:NF59)))","v":0},null,null,null,null,null,null,null,null,null,null,null,null,null,null,null,null,null,null,null,null,null,null,null,null,null,null,null,null,null,null,null,null,null,null,null,null,null,null,null,null,null,null,null,null,null,null,null,null,null,null,null,null,null,null,null,null,null,null,null,null,null,null,null,null,null,null,null,null,null,null,null,null,null,null,null,null,null,null,null,null,null,null,null,null,null,null,null,null,null,null,null,null,null,null,null,null,null,null,null,null,null,null,null,null,null,null,null,null,null,null,null,null,null,null,null,null,null,null,null,null,null,null,null,null,null,null,null,null,null,null,null,null,null,null,null,null,null,null,null,null,null,null,null,null,null,null,null,null,null,null,null,null,null,null,null,null,null,null,null,null,null,null,null,null,null,null,null,null,null,null,null,null,null,null,null,null,null,null,null,null,null,null,null,null,null,null,null,null,null,null,null,null,null,null,null,null,null,null,null,null,null,null,null,null,null,null,null,null,null,null,null,null,null,null,null,null,null,null,null,null,null,null,null,null,null,null,null,null,null,null,null,null,null,null,null,null,null,null,null,null,null,null,null,null,null,null,null,null,null,null,null,null,null,null,null,null,null,null,null,null,null,null,null,null,null,null,null,null,null,null,null,null,null,null,null,null,null,null,null,null,null,null,null,null,null,null,null,null,null,null,null,null,null,null,null,null,null,null,null,null,null,null,null,null,null,null,null,null,null,null,null,null,null,null,null,null,null,null,null,null,null,null,null,null,null,null,null,null,null,null,null,null,null,null,null,null,null,null,null,null,null,null,null,null,null,null,null,null,null,null,null,null,null,null,null,null,null,null,null,null,null,null,null,null,null,null,null,{"$f":"Dateneingabe!N61","v":55},null,{"$f":"Dateneingabe!K61","v":0},{"$f":"Dateneingabe!L61","v":0},{"$f":"Dateneingabe!M61","v":0},{"$f":"COUNTIFS(E59:NF59,\"U\")","v":0},{"$f":"NL59-NM59","v":0}]
[{"$f":"IF(Dateneingabe!A62=0,\"zzz\",Dateneingabe!A62)","v":"zzz"},{"$f":"IF(Dateneingabe!B62=0,\"zzz\",Dateneingabe!B62)","v":"zzz"},{"$f":"IF(Dateneingabe!C62=0,\"zzz\",Dateneingabe!C62)","v":"zzz"},{"$f":"IF($D$3<$E$1,\"<?\",IF($D$3>$NF$1,\">?\",LOOKUP($D$3,$E$1:$NF$1,E60:NF60)))","v":0},null,null,null,null,null,null,null,null,null,null,null,null,null,null,null,null,null,null,null,null,null,null,null,null,null,null,null,null,null,null,null,null,null,null,null,null,null,null,null,null,null,null,null,null,null,null,null,null,null,null,null,null,null,null,null,null,null,null,null,null,null,null,null,null,null,null,null,null,null,null,null,null,null,null,null,null,null,null,null,null,null,null,null,null,null,null,null,null,null,null,null,null,null,null,null,null,null,null,null,null,null,null,null,null,null,null,null,null,null,null,null,null,null,null,null,null,null,null,null,null,null,null,null,null,null,null,null,null,null,null,null,null,null,null,null,null,null,null,null,null,null,null,null,null,null,null,null,null,null,null,null,null,null,null,null,null,null,null,null,null,null,null,null,null,null,null,null,null,null,null,null,null,null,null,null,null,null,null,null,null,null,null,null,null,null,null,null,null,null,null,null,null,null,null,null,null,null,null,null,null,null,null,null,null,null,null,null,null,null,null,null,null,null,null,null,null,null,null,null,null,null,null,null,null,null,null,null,null,null,null,null,null,null,null,null,null,null,null,null,null,null,null,null,null,null,null,null,null,null,null,null,null,null,null,null,null,null,null,null,null,null,null,null,null,null,null,null,null,null,null,null,null,null,null,null,null,null,null,null,null,null,null,null,null,null,null,null,null,null,null,null,null,null,null,null,null,null,null,null,null,null,null,null,null,null,null,null,null,null,null,null,null,null,null,null,null,null,null,null,null,null,null,null,null,null,null,null,null,null,null,null,null,null,null,null,null,null,null,null,null,null,null,null,null,null,null,null,null,null,null,null,null,null,null,null,null,null,null,null,null,null,null,null,null,null,null,null,{"$f":"Dateneingabe!N62","v":56},null,{"$f":"Dateneingabe!K62","v":0},{"$f":"Dateneingabe!L62","v":0},{"$f":"Dateneingabe!M62","v":0},{"$f":"COUNTIFS(E60:NF60,\"U\")","v":0},{"$f":"NL60-NM60","v":0}]
[{"$f":"IF(Dateneingabe!A63=0,\"zzz\",Dateneingabe!A63)","v":"zzz"},{"$f":"IF(Dateneingabe!B63=0,\"zzz\",Dateneingabe!B63)","v":"zzz"},{"$f":"IF(Dateneingabe!C63=0,\"zzz\",Dateneingabe!C63)","v":"zzz"},{"$f":"IF($D$3<$E$1,\"<?\",IF($D$3>$NF$1,\">?\",LOOKUP($D$3,$E$1:$NF$1,E61:NF61)))","v":0},null,null,null,null,null,null,null,null,null,null,null,null,null,null,null,null,null,null,null,null,null,null,null,null,null,null,null,null,null,null,null,null,null,null,null,null,null,null,null,null,null,null,null,null,null,null,null,null,null,null,null,null,null,null,null,null,null,null,null,null,null,null,null,null,null,null,null,null,null,null,null,null,null,null,null,null,null,null,null,null,null,null,null,null,null,null,null,null,null,null,null,null,null,null,null,null,null,null,null,null,null,null,null,null,null,null,null,null,null,null,null,null,null,null,null,null,null,null,null,null,null,null,null,null,null,null,null,null,null,null,null,null,null,null,null,null,null,null,null,null,null,null,null,null,null,null,null,null,null,null,null,null,null,null,null,null,null,null,null,null,null,null,null,null,null,null,null,null,null,null,null,null,null,null,null,null,null,null,null,null,null,null,null,null,null,null,null,null,null,null,null,null,null,null,null,null,null,null,null,null,null,null,null,null,null,null,null,null,null,null,null,null,null,null,null,null,null,null,null,null,null,null,null,null,null,null,null,null,null,null,null,null,null,null,null,null,null,null,null,null,null,null,null,null,null,null,null,null,null,null,null,null,null,null,null,null,null,null,null,null,null,null,null,null,null,null,null,null,null,null,null,null,null,null,null,null,null,null,null,null,null,null,null,null,null,null,null,null,null,null,null,null,null,null,null,null,null,null,null,null,null,null,null,null,null,null,null,null,null,null,null,null,null,null,null,null,null,null,null,null,null,null,null,null,null,null,null,null,null,null,null,null,null,null,null,null,null,null,null,null,null,null,null,null,null,null,null,null,null,null,null,null,null,null,null,null,null,null,null,null,null,null,null,null,null,null,null,{"$f":"Dateneingabe!N63","v":57},null,{"$f":"Dateneingabe!K63","v":0},{"$f":"Dateneingabe!L63","v":0},{"$f":"Dateneingabe!M63","v":0},{"$f":"COUNTIFS(E61:NF61,\"U\")","v":0},{"$f":"NL61-NM61","v":0}]
[{"$f":"IF(Dateneingabe!A64=0,\"zzz\",Dateneingabe!A64)","v":"zzz"},{"$f":"IF(Dateneingabe!B64=0,\"zzz\",Dateneingabe!B64)","v":"zzz"},{"$f":"IF(Dateneingabe!C64=0,\"zzz\",Dateneingabe!C64)","v":"zzz"},{"$f":"IF($D$3<$E$1,\"<?\",IF($D$3>$NF$1,\">?\",LOOKUP($D$3,$E$1:$NF$1,E62:NF62)))","v":0},null,null,null,null,null,null,null,null,null,null,null,null,null,null,null,null,null,null,null,null,null,null,null,null,null,null,null,null,null,null,null,null,null,null,null,null,null,null,null,null,null,null,null,null,null,null,null,null,null,null,null,null,null,null,null,null,null,null,null,null,null,null,null,null,null,null,null,null,null,null,null,null,null,null,null,null,null,null,null,null,null,null,null,null,null,null,null,null,null,null,null,null,null,null,null,null,null,null,null,null,null,null,null,null,null,null,null,null,null,null,null,null,null,null,null,null,null,null,null,null,null,null,null,null,null,null,null,null,null,null,null,null,null,null,null,null,null,null,null,null,null,null,null,null,null,null,null,null,null,null,null,null,null,null,null,null,null,null,null,null,null,null,null,null,null,null,null,null,null,null,null,null,null,null,null,null,null,null,null,null,null,null,null,null,null,null,null,null,null,null,null,null,null,null,null,null,null,null,null,null,null,null,null,null,null,null,null,null,null,null,null,null,null,null,null,null,null,null,null,null,null,null,null,null,null,null,null,null,null,null,null,null,null,null,null,null,null,null,null,null,null,null,null,null,null,null,null,null,null,null,null,null,null,null,null,null,null,null,null,null,null,null,null,null,null,null,null,null,null,null,null,null,null,null,null,null,null,null,null,null,null,null,null,null,null,null,null,null,null,null,null,null,null,null,null,null,null,null,null,null,null,null,null,null,null,null,null,null,null,null,null,null,null,null,null,null,null,null,null,null,null,null,null,null,null,null,null,null,null,null,null,null,null,null,null,null,null,null,null,null,null,null,null,null,null,null,null,null,null,null,null,null,null,null,null,null,null,null,null,null,null,null,null,null,null,null,null,{"$f":"Dateneingabe!N64","v":58},null,{"$f":"Dateneingabe!K64","v":0},{"$f":"Dateneingabe!L64","v":0},{"$f":"Dateneingabe!M64","v":0},{"$f":"COUNTIFS(E62:NF62,\"U\")","v":0},{"$f":"NL62-NM62","v":0}]
[{"$f":"IF(Dateneingabe!A65=0,\"zzz\",Dateneingabe!A65)","v":"zzz"},{"$f":"IF(Dateneingabe!B65=0,\"zzz\",Dateneingabe!B65)","v":"zzz"},{"$f":"IF(Dateneingabe!C65=0,\"zzz\",Dateneingabe!C65)","v":"zzz"},{"$f":"IF($D$3<$E$1,\"<?\",IF($D$3>$NF$1,\">?\",LOOKUP($D$3,$E$1:$NF$1,E63:NF63)))","v":0},null,null,null,null,null,null,null,null,null,null,null,null,null,null,null,null,null,null,null,null,null,null,null,null,null,null,null,null,null,null,null,null,null,null,null,null,null,null,null,null,null,null,null,null,null,null,null,null,null,null,null,null,null,null,null,null,null,null,null,null,null,null,null,null,null,null,null,null,null,null,null,null,null,null,null,null,null,null,null,null,null,null,null,null,null,null,null,null,null,null,null,null,null,null,null,null,null,null,null,null,null,null,null,null,null,null,null,null,null,null,null,null,null,null,null,null,null,null,null,null,null,null,null,null,null,null,null,null,null,null,null,null,null,null,null,null,null,null,null,null,null,null,null,null,null,null,null,null,null,null,null,null,null,null,null,null,null,null,null,null,null,null,null,null,null,null,null,null,null,null,null,null,null,null,null,null,null,null,null,null,null,null,null,null,null,null,null,null,null,null,null,null,null,null,null,null,null,null,null,null,null,null,null,null,null,null,null,null,null,null,null,null,null,null,null,null,null,null,null,null,null,null,null,null,null,null,null,null,null,null,null,null,null,null,null,null,null,null,null,null,null,null,null,null,null,null,null,null,null,null,null,null,null,null,null,null,null,null,null,null,null,null,null,null,null,null,null,null,null,null,null,null,null,null,null,null,null,null,null,null,null,null,null,null,null,null,null,null,null,null,null,null,null,null,null,null,null,null,null,null,null,null,null,null,null,null,null,null,null,null,null,null,null,null,null,null,null,null,null,null,null,null,null,null,null,null,null,null,null,null,null,null,null,null,null,null,null,null,null,null,null,null,null,null,null,null,null,null,null,null,null,null,null,null,null,null,null,null,null,null,null,null,null,null,null,null,null,{"$f":"Dateneingabe!N65","v":59},null,{"$f":"Dateneingabe!K65","v":0},{"$f":"Dateneingabe!L65","v":0},{"$f":"Dateneingabe!M65","v":0},{"$f":"COUNTIFS(E63:NF63,\"U\")","v":0},{"$f":"NL63-NM63","v":0}]
[{"$f":"IF(Dateneingabe!A66=0,\"zzz\",Dateneingabe!A66)","v":"zzz"},{"$f":"IF(Dateneingabe!B66=0,\"zzz\",Dateneingabe!B66)","v":"zzz"},{"$f":"IF(Dateneingabe!C66=0,\"zzz\",Dateneingabe!C66)","v":"zzz"},{"$f":"IF($D$3<$E$1,\"<?\",IF($D$3>$NF$1,\">?\",LOOKUP($D$3,$E$1:$NF$1,E64:NF64)))","v":0},null,null,null,null,null,null,null,null,null,null,null,null,null,null,null,null,null,null,null,null,null,null,null,null,null,null,null,null,null,null,null,null,null,null,null,null,null,null,null,null,null,null,null,null,null,null,null,null,null,null,null,null,null,null,null,null,null,null,null,null,null,null,null,null,null,null,null,null,null,null,null,null,null,null,null,null,null,null,null,null,null,null,null,null,null,null,null,null,null,null,null,null,null,null,null,null,null,null,null,null,null,null,null,null,null,null,null,null,null,null,null,null,null,null,null,null,null,null,null,null,null,null,null,null,null,null,null,null,null,null,null,null,null,null,null,null,null,null,null,null,null,null,null,null,null,null,null,null,null,null,null,null,null,null,null,null,null,null,null,null,null,null,null,null,null,null,null,null,null,null,null,null,null,null,null,null,null,null,null,null,null,null,null,null,null,null,null,null,null,null,null,null,null,null,null,null,null,null,null,null,null,null,null,null,null,null,null,null,null,null,null,null,null,null,null,null,null,null,null,null,null,null,null,null,null,null,null,null,null,null,null,null,null,null,null,null,null,null,null,null,null,null,null,null,null,null,null,null,null,null,null,null,null,null,null,null,null,null,null,null,null,null,null,null,null,null,null,null,null,null,null,null,null,null,null,null,null,null,null,null,null,null,null,null,null,null,null,null,null,null,null,null,null,null,null,null,null,null,null,null,null,null,null,null,null,null,null,null,null,null,null,null,null,null,null,null,null,null,null,null,null,null,null,null,null,null,null,null,null,null,null,null,null,null,null,null,null,null,null,null,null,null,null,null,null,null,null,null,null,null,null,null,null,null,null,null,null,null,null,null,null,null,null,null,null,null,null,{"$f":"Dateneingabe!N66","v":60},null,{"$f":"Dateneingabe!K66","v":0},{"$f":"Dateneingabe!L66","v":0},{"$f":"Dateneingabe!M66","v":0},{"$f":"COUNTIFS(E64:NF64,\"U\")","v":0},{"$f":"NL64-NM64","v":0}]
[{"$f":"IF(Dateneingabe!A67=0,\"zzz\",Dateneingabe!A67)","v":"zzz"},{"$f":"IF(Dateneingabe!B67=0,\"zzz\",Dateneingabe!B67)","v":"zzz"},{"$f":"IF(Dateneingabe!C67=0,\"zzz\",Dateneingabe!C67)","v":"zzz"},{"$f":"IF($D$3<$E$1,\"<?\",IF($D$3>$NF$1,\">?\",LOOKUP($D$3,$E$1:$NF$1,E65:NF65)))","v":0},null,null,null,null,null,null,null,null,null,null,null,null,null,null,null,null,null,null,null,null,null,null,null,null,null,null,null,null,null,null,null,null,null,null,null,null,null,null,null,null,null,null,null,null,null,null,null,null,null,null,null,null,null,null,null,null,null,null,null,null,null,null,null,null,null,null,null,null,null,null,null,null,null,null,null,null,null,null,null,null,null,null,null,null,null,null,null,null,null,null,null,null,null,null,null,null,null,null,null,null,null,null,null,null,null,null,null,null,null,null,null,null,null,null,null,null,null,null,null,null,null,null,null,null,null,null,null,null,null,null,null,null,null,null,null,null,null,null,null,null,null,null,null,null,null,null,null,null,null,null,null,null,null,null,null,null,null,null,null,null,null,null,null,null,null,null,null,null,null,null,null,null,null,null,null,null,null,null,null,null,null,null,null,null,null,null,null,null,null,null,null,null,null,null,null,null,null,null,null,null,null,null,null,null,null,null,null,null,null,null,null,null,null,null,null,null,null,null,null,null,null,null,null,null,null,null,null,null,null,null,null,null,null,null,null,null,null,null,null,null,null,null,null,null,null,null,null,null,null,null,null,null,null,null,null,null,null,null,null,null,null,null,null,null,null,null,null,null,null,null,null,null,null,null,null,null,null,null,null,null,null,null,null,null,null,null,null,null,null,null,null,null,null,null,null,null,null,null,null,null,null,null,null,null,null,null,null,null,null,null,null,null,null,null,null,null,null,null,null,null,null,null,null,null,null,null,null,null,null,null,null,null,null,null,null,null,null,null,null,null,null,null,null,null,null,null,null,null,null,null,null,null,null,null,null,null,null,null,null,null,null,null,null,null,null,null,null,{"$f":"Dateneingabe!N67","v":61},null,{"$f":"Dateneingabe!K67","v":0},{"$f":"Dateneingabe!L67","v":0},{"$f":"Dateneingabe!M67","v":0},{"$f":"COUNTIFS(E65:NF65,\"U\")","v":0},{"$f":"NL65-NM65","v":0}]
[{"$f":"IF(Dateneingabe!A68=0,\"zzz\",Dateneingabe!A68)","v":"zzz"},{"$f":"IF(Dateneingabe!B68=0,\"zzz\",Dateneingabe!B68)","v":"zzz"},{"$f":"IF(Dateneingabe!C68=0,\"zzz\",Dateneingabe!C68)","v":"zzz"},{"$f":"IF($D$3<$E$1,\"<?\",IF($D$3>$NF$1,\">?\",LOOKUP($D$3,$E$1:$NF$1,E66:NF66)))","v":0},null,null,null,null,null,null,null,null,null,null,null,null,null,null,null,null,null,null,null,null,null,null,null,null,null,null,null,null,null,null,null,null,null,null,null,null,null,null,null,null,null,null,null,null,null,null,null,null,null,null,null,null,null,null,null,null,null,null,null,null,null,null,null,null,null,null,null,null,null,null,null,null,null,null,null,null,null,null,null,null,null,null,null,null,null,null,null,null,null,null,null,null,null,null,null,null,null,null,null,null,null,null,null,null,null,null,null,null,null,null,null,null,null,null,null,null,null,null,null,null,null,null,null,null,null,null,null,null,null,null,null,null,null,null,null,null,null,null,null,null,null,null,null,null,null,null,null,null,null,null,null,null,null,null,null,null,null,null,null,null,null,null,null,null,null,null,null,null,null,null,null,null,null,null,null,null,null,null,null,null,null,null,null,null,null,null,null,null,null,null,null,null,null,null,null,null,null,null,null,null,null,null,null,null,null,null,null,null,null,null,null,null,null,null,null,null,null,null,null,null,null,null,null,null,null,null,null,null,null,null,null,null,null,null,null,null,null,null,null,null,null,null,null,null,null,null,null,null,null,null,null,null,null,null,null,null,null,null,null,null,null,null,null,null,null,null,null,null,null,null,null,null,null,null,null,null,null,null,null,null,null,null,null,null,null,null,null,null,null,null,null,null,null,null,null,null,null,null,null,null,null,null,null,null,null,null,null,null,null,null,null,null,null,null,null,null,null,null,null,null,null,null,null,null,null,null,null,null,null,null,null,null,null,null,null,null,null,null,null,null,null,null,null,null,null,null,null,null,null,null,null,null,null,null,null,null,null,null,null,null,null,null,null,null,null,null,null,{"$f":"Dateneingabe!N68","v":62},null,{"$f":"Dateneingabe!K68","v":0},{"$f":"Dateneingabe!L68","v":0},{"$f":"Dateneingabe!M68","v":0},{"$f":"COUNTIFS(E66:NF66,\"U\")","v":0},{"$f":"NL66-NM66","v":0}]
[{"$f":"IF(Dateneingabe!A69=0,\"zzz\",Dateneingabe!A69)","v":"zzz"},{"$f":"IF(Dateneingabe!B69=0,\"zzz\",Dateneingabe!B69)","v":"zzz"},{"$f":"IF(Dateneingabe!C69=0,\"zzz\",Dateneingabe!C69)","v":"zzz"},{"$f":"IF($D$3<$E$1,\"<?\",IF($D$3>$NF$1,\">?\",LOOKUP($D$3,$E$1:$NF$1,E67:NF67)))","v":0},null,null,null,null,null,null,null,null,null,null,null,null,null,null,null,null,null,null,null,null,null,null,null,null,null,null,null,null,null,null,null,null,null,null,null,null,null,null,null,null,null,null,null,null,null,null,null,null,null,null,null,null,null,null,null,null,null,null,null,null,null,null,null,null,null,null,null,null,null,null,null,null,null,null,null,null,null,null,null,null,null,null,null,null,null,null,null,null,null,null,null,null,null,null,null,null,null,null,null,null,null,null,null,null,null,null,null,null,null,null,null,null,null,null,null,null,null,null,null,null,null,null,null,null,null,null,null,null,null,null,null,null,null,null,null,null,null,null,null,null,null,null,null,null,null,null,null,null,null,null,null,null,null,null,null,null,null,null,null,null,null,null,null,null,null,null,null,null,null,null,null,null,null,null,null,null,null,null,null,null,null,null,null,null,null,null,null,null,null,null,null,null,null,null,null,null,null,null,null,null,null,null,null,null,null,null,null,null,null,null,null,null,null,null,null,null,null,null,null,null,null,null,null,null,null,null,null,null,null,null,null,null,null,null,null,null,null,null,null,null,null,null,null,null,null,null,null,null,null,null,null,null,null,null,null,null,null,null,null,null,null,null,null,null,null,null,null,null,null,null,null,null,null,null,null,null,null,null,null,null,null,null,null,null,null,null,null,null,null,null,null,null,null,null,null,null,null,null,null,null,null,null,null,null,null,null,null,null,null,null,null,null,null,null,null,null,null,null,null,null,null,null,null,null,null,null,null,null,null,null,null,null,null,null,null,null,null,null,null,null,null,null,null,null,null,null,null,null,null,null,null,null,null,null,null,null,null,null,null,null,null,null,null,null,null,null,null,{"$f":"Dateneingabe!N69","v":63},null,{"$f":"Dateneingabe!K69","v":0},{"$f":"Dateneingabe!L69","v":0},{"$f":"Dateneingabe!M69","v":0},{"$f":"COUNTIFS(E67:NF67,\"U\")","v":0},{"$f":"NL67-NM67","v":0}]
[{"$f":"IF(Dateneingabe!A70=0,\"zzz\",Dateneingabe!A70)","v":"zzz"},{"$f":"IF(Dateneingabe!B70=0,\"zzz\",Dateneingabe!B70)","v":"zzz"},{"$f":"IF(Dateneingabe!C70=0,\"zzz\",Dateneingabe!C70)","v":"zzz"},{"$f":"IF($D$3<$E$1,\"<?\",IF($D$3>$NF$1,\">?\",LOOKUP($D$3,$E$1:$NF$1,E68:NF68)))","v":0},null,null,null,null,null,null,null,null,null,null,null,null,null,null,null,null,null,null,null,null,null,null,null,null,null,null,null,null,null,null,null,null,null,null,null,null,null,null,null,null,null,null,null,null,null,null,null,null,null,null,null,null,null,null,null,null,null,null,null,null,null,null,null,null,null,null,null,null,null,null,null,null,null,null,null,null,null,null,null,null,null,null,null,null,null,null,null,null,null,null,null,null,null,null,null,null,null,null,null,null,null,null,null,null,null,null,null,null,null,null,null,null,null,null,null,null,null,null,null,null,null,null,null,null,null,null,null,null,null,null,null,null,null,null,null,null,null,null,null,null,null,null,null,null,null,null,null,null,null,null,null,null,null,null,null,null,null,null,null,null,null,null,null,null,null,null,null,null,null,null,null,null,null,null,null,null,null,null,null,null,null,null,null,null,null,null,null,null,null,null,null,null,null,null,null,null,null,null,null,null,null,null,null,null,null,null,null,null,null,null,null,null,null,null,null,null,null,null,null,null,null,null,null,null,null,null,null,null,null,null,null,null,null,null,null,null,null,null,null,null,null,null,null,null,null,null,null,null,null,null,null,null,null,null,null,null,null,null,null,null,null,null,null,null,null,null,null,null,null,null,null,null,null,null,null,null,null,null,null,null,null,null,null,null,null,null,null,null,null,null,null,null,null,null,null,null,null,null,null,null,null,null,null,null,null,null,null,null,null,null,null,null,null,null,null,null,null,null,null,null,null,null,null,null,null,null,null,null,null,null,null,null,null,null,null,null,null,null,null,null,null,null,null,null,null,null,null,null,null,null,null,null,null,null,null,null,null,null,null,null,null,null,null,null,null,null,null,{"$f":"Dateneingabe!N70","v":64},null,{"$f":"Dateneingabe!K70","v":0},{"$f":"Dateneingabe!L70","v":0},{"$f":"Dateneingabe!M70","v":0},{"$f":"COUNTIFS(E68:NF68,\"U\")","v":0},{"$f":"NL68-NM68","v":0}]
[{"$f":"IF(Dateneingabe!A71=0,\"zzz\",Dateneingabe!A71)","v":"zzz"},{"$f":"IF(Dateneingabe!B71=0,\"zzz\",Dateneingabe!B71)","v":"zzz"},{"$f":"IF(Dateneingabe!C71=0,\"zzz\",Dateneingabe!C71)","v":"zzz"},{"$f":"IF($D$3<$E$1,\"<?\",IF($D$3>$NF$1,\">?\",LOOKUP($D$3,$E$1:$NF$1,E69:NF69)))","v":0},null,null,null,null,null,null,null,null,null,null,null,null,null,null,null,null,null,null,null,null,null,null,null,null,null,null,null,null,null,null,null,null,null,null,null,null,null,null,null,null,null,null,null,null,null,null,null,null,null,null,null,null,null,null,null,null,null,null,null,null,null,null,null,null,null,null,null,null,null,null,null,null,null,null,null,null,null,null,null,null,null,null,null,null,null,null,null,null,null,null,null,null,null,null,null,null,null,null,null,null,null,null,null,null,null,null,null,null,null,null,null,null,null,null,null,null,null,null,null,null,null,null,null,null,null,null,null,null,null,null,null,null,null,null,null,null,null,null,null,null,null,null,null,null,null,null,null,null,null,null,null,null,null,null,null,null,null,null,null,null,null,null,null,null,null,null,null,null,null,null,null,null,null,null,null,null,null,null,null,null,null,null,null,null,null,null,null,null,null,null,null,null,null,null,null,null,null,null,null,null,null,null,null,null,null,null,null,null,null,null,null,null,null,null,null,null,null,null,null,null,null,null,null,null,null,null,null,null,null,null,null,null,null,null,null,null,null,null,null,null,null,null,null,null,null,null,null,null,null,null,null,null,null,null,null,null,null,null,null,null,null,null,null,null,null,null,null,null,null,null,null,null,null,null,null,null,null,null,null,null,null,null,null,null,null,null,null,null,null,null,null,null,null,null,null,null,null,null,null,null,null,null,null,null,null,null,null,null,null,null,null,null,null,null,null,null,null,null,null,null,null,null,null,null,null,null,null,null,null,null,null,null,null,null,null,null,null,null,null,null,null,null,null,null,null,null,null,null,null,null,null,null,null,null,null,null,null,null,null,null,null,null,null,null,null,null,null,{"$f":"Dateneingabe!N71","v":65},null,{"$f":"Dateneingabe!K71","v":0},{"$f":"Dateneingabe!L71","v":0},{"$f":"Dateneingabe!M71","v":0},{"$f":"COUNTIFS(E69:NF69,\"U\")","v":0},{"$f":"NL69-NM69","v":0}]
[{"$f":"IF(Dateneingabe!A72=0,\"zzz\",Dateneingabe!A72)","v":"zzz"},{"$f":"IF(Dateneingabe!B72=0,\"zzz\",Dateneingabe!B72)","v":"zzz"},{"$f":"IF(Dateneingabe!C72=0,\"zzz\",Dateneingabe!C72)","v":"zzz"},{"$f":"IF($D$3<$E$1,\"<?\",IF($D$3>$NF$1,\">?\",LOOKUP($D$3,$E$1:$NF$1,E70:NF70)))","v":0},null,null,null,null,null,null,null,null,null,null,null,null,null,null,null,null,null,null,null,null,null,null,null,null,null,null,null,null,null,null,null,null,null,null,null,null,null,null,null,null,null,null,null,null,null,null,null,null,null,null,null,null,null,null,null,null,null,null,null,null,null,null,null,null,null,null,null,null,null,null,null,null,null,null,null,null,null,null,null,null,null,null,null,null,null,null,null,null,null,null,null,null,null,null,null,null,null,null,null,null,null,null,null,null,null,null,null,null,null,null,null,null,null,null,null,null,null,null,null,null,null,null,null,null,null,null,null,null,null,null,null,null,null,null,null,null,null,null,null,null,null,null,null,null,null,null,null,null,null,null,null,null,null,null,null,null,null,null,null,null,null,null,null,null,null,null,null,null,null,null,null,null,null,null,null,null,null,null,null,null,null,null,null,null,null,null,null,null,null,null,null,null,null,null,null,null,null,null,null,null,null,null,null,null,null,null,null,null,null,null,null,null,null,null,null,null,null,null,null,null,null,null,null,null,null,null,null,null,null,null,null,null,null,null,null,null,null,null,null,null,null,null,null,null,null,null,null,null,null,null,null,null,null,null,null,null,null,null,null,null,null,null,null,null,null,null,null,null,null,null,null,null,null,null,null,null,null,null,null,null,null,null,null,null,null,null,null,null,null,null,null,null,null,null,null,null,null,null,null,null,null,null,null,null,null,null,null,null,null,null,null,null,null,null,null,null,null,null,null,null,null,null,null,null,null,null,null,null,null,null,null,null,null,null,null,null,null,null,null,null,null,null,null,null,null,null,null,null,null,null,null,null,null,null,null,null,null,null,null,null,null,null,null,null,null,null,null,{"$f":"Dateneingabe!N72","v":66},null,{"$f":"Dateneingabe!K72","v":0},{"$f":"Dateneingabe!L72","v":0},{"$f":"Dateneingabe!M72","v":0},{"$f":"COUNTIFS(E70:NF70,\"U\")","v":0},{"$f":"NL70-NM70","v":0}]
[{"$f":"IF(Dateneingabe!A73=0,\"zzz\",Dateneingabe!A73)","v":"zzz"},{"$f":"IF(Dateneingabe!B73=0,\"zzz\",Dateneingabe!B73)","v":"zzz"},{"$f":"IF(Dateneingabe!C73=0,\"zzz\",Dateneingabe!C73)","v":"zzz"},{"$f":"IF($D$3<$E$1,\"<?\",IF($D$3>$NF$1,\">?\",LOOKUP($D$3,$E$1:$NF$1,E71:NF71)))","v":0},null,null,null,null,null,null,null,null,null,null,null,null,null,null,null,null,null,null,null,null,null,null,null,null,null,null,null,null,null,null,null,null,null,null,null,null,null,null,null,null,null,null,null,null,null,null,null,null,null,null,null,null,null,null,null,null,null,null,null,null,null,null,null,null,null,null,null,null,null,null,null,null,null,null,null,null,null,null,null,null,null,null,null,null,null,null,null,null,null,null,null,null,null,null,null,null,null,null,null,null,null,null,null,null,null,null,null,null,null,null,null,null,null,null,null,null,null,null,null,null,null,null,null,null,null,null,null,null,null,null,null,null,null,null,null,null,null,null,null,null,null,null,null,null,null,null,null,null,null,null,null,null,null,null,null,null,null,null,null,null,null,null,null,null,null,null,null,null,null,null,null,null,null,null,null,null,null,null,null,null,null,null,null,null,null,null,null,null,null,null,null,null,null,null,null,null,null,null,null,null,null,null,null,null,null,null,null,null,null,null,null,null,null,null,null,null,null,null,null,null,null,null,null,null,null,null,null,null,null,null,null,null,null,null,null,null,null,null,null,null,null,null,null,null,null,null,null,null,null,null,null,null,null,null,null,null,null,null,null,null,null,null,null,null,null,null,null,null,null,null,null,null,null,null,null,null,null,null,null,null,null,null,null,null,null,null,null,null,null,null,null,null,null,null,null,null,null,null,null,null,null,null,null,null,null,null,null,null,null,null,null,null,null,null,null,null,null,null,null,null,null,null,null,null,null,null,null,null,null,null,null,null,null,null,null,null,null,null,null,null,null,null,null,null,null,null,null,null,null,null,null,null,null,null,null,null,null,null,null,null,null,null,null,null,null,null,null,{"$f":"Dateneingabe!N73","v":67},null,{"$f":"Dateneingabe!K73","v":0},{"$f":"Dateneingabe!L73","v":0},{"$f":"Dateneingabe!M73","v":0},{"$f":"COUNTIFS(E71:NF71,\"U\")","v":0},{"$f":"NL71-NM71","v":0}]
[{"$f":"IF(Dateneingabe!A74=0,\"zzz\",Dateneingabe!A74)","v":"zzz"},{"$f":"IF(Dateneingabe!B74=0,\"zzz\",Dateneingabe!B74)","v":"zzz"},{"$f":"IF(Dateneingabe!C74=0,\"zzz\",Dateneingabe!C74)","v":"zzz"},{"$f":"IF($D$3<$E$1,\"<?\",IF($D$3>$NF$1,\">?\",LOOKUP($D$3,$E$1:$NF$1,E72:NF72)))","v":0},null,null,null,null,null,null,null,null,null,null,null,null,null,null,null,null,null,null,null,null,null,null,null,null,null,null,null,null,null,null,null,null,null,null,null,null,null,null,null,null,null,null,null,null,null,null,null,null,null,null,null,null,null,null,null,null,null,null,null,null,null,null,null,null,null,null,null,null,null,null,null,null,null,null,null,null,null,null,null,null,null,null,null,null,null,null,null,null,null,null,null,null,null,null,null,null,null,null,null,null,null,null,null,null,null,null,null,null,null,null,null,null,null,null,null,null,null,null,null,null,null,null,null,null,null,null,null,null,null,null,null,null,null,null,null,null,null,null,null,null,null,null,null,null,null,null,null,null,null,null,null,null,null,null,null,null,null,null,null,null,null,null,null,null,null,null,null,null,null,null,null,null,null,null,null,null,null,null,null,null,null,null,null,null,null,null,null,null,null,null,null,null,null,null,null,null,null,null,null,null,null,null,null,null,null,null,null,null,null,null,null,null,null,null,null,null,null,null,null,null,null,null,null,null,null,null,null,null,null,null,null,null,null,null,null,null,null,null,null,null,null,null,null,null,null,null,null,null,null,null,null,null,null,null,null,null,null,null,null,null,null,null,null,null,null,null,null,null,null,null,null,null,null,null,null,null,null,null,null,null,null,null,null,null,null,null,null,null,null,null,null,null,null,null,null,null,null,null,null,null,null,null,null,null,null,null,null,null,null,null,null,null,null,null,null,null,null,null,null,null,null,null,null,null,null,null,null,null,null,null,null,null,null,null,null,null,null,null,null,null,null,null,null,null,null,null,null,null,null,null,null,null,null,null,null,null,null,null,null,null,null,null,null,null,null,null,null,{"$f":"Dateneingabe!N74","v":68},null,{"$f":"Dateneingabe!K74","v":0},{"$f":"Dateneingabe!L74","v":0},{"$f":"Dateneingabe!M74","v":0},{"$f":"COUNTIFS(E72:NF72,\"U\")","v":0},{"$f":"NL72-NM72","v":0}]
[{"$f":"IF(Dateneingabe!A75=0,\"zzz\",Dateneingabe!A75)","v":"zzz"},{"$f":"IF(Dateneingabe!B75=0,\"zzz\",Dateneingabe!B75)","v":"zzz"},{"$f":"IF(Dateneingabe!C75=0,\"zzz\",Dateneingabe!C75)","v":"zzz"},{"$f":"IF($D$3<$E$1,\"<?\",IF($D$3>$NF$1,\">?\",LOOKUP($D$3,$E$1:$NF$1,E73:NF73)))","v":0},null,null,null,null,null,null,null,null,null,null,null,null,null,null,null,null,null,null,null,null,null,null,null,null,null,null,null,null,null,null,null,null,null,null,null,null,null,null,null,null,null,null,null,null,null,null,null,null,null,null,null,null,null,null,null,null,null,null,null,null,null,null,null,null,null,null,null,null,null,null,null,null,null,null,null,null,null,null,null,null,null,null,null,null,null,null,null,null,null,null,null,null,null,null,null,null,null,null,null,null,null,null,null,null,null,null,null,null,null,null,null,null,null,null,null,null,null,null,null,null,null,null,null,null,null,null,null,null,null,null,null,null,null,null,null,null,null,null,null,null,null,null,null,null,null,null,null,null,null,null,null,null,null,null,null,null,null,null,null,null,null,null,null,null,null,null,null,null,null,null,null,null,null,null,null,null,null,null,null,null,null,null,null,null,null,null,null,null,null,null,null,null,null,null,null,null,null,null,null,null,null,null,null,null,null,null,null,null,null,null,null,null,null,null,null,null,null,null,null,null,null,null,null,null,null,null,null,null,null,null,null,null,null,null,null,null,null,null,null,null,null,null,null,null,null,null,null,null,null,null,null,null,null,null,null,null,null,null,null,null,null,null,null,null,null,null,null,null,null,null,null,null,null,null,null,null,null,null,null,null,null,null,null,null,null,null,null,null,null,null,null,null,null,null,null,null,null,null,null,null,null,null,null,null,null,null,null,null,null,null,null,null,null,null,null,null,null,null,null,null,null,null,null,null,null,null,null,null,null,null,null,null,null,null,null,null,null,null,null,null,null,null,null,null,null,null,null,null,null,null,null,null,null,null,null,null,null,null,null,null,null,null,null,null,null,null,null,{"$f":"Dateneingabe!N75","v":69},null,{"$f":"Dateneingabe!K75","v":0},{"$f":"Dateneingabe!L75","v":0},{"$f":"Dateneingabe!M75","v":0},{"$f":"COUNTIFS(E73:NF73,\"U\")","v":0},{"$f":"NL73-NM73","v":0}]
[{"$f":"IF(Dateneingabe!A76=0,\"zzz\",Dateneingabe!A76)","v":"zzz"},{"$f":"IF(Dateneingabe!B76=0,\"zzz\",Dateneingabe!B76)","v":"zzz"},{"$f":"IF(Dateneingabe!C76=0,\"zzz\",Dateneingabe!C76)","v":"zzz"},{"$f":"IF($D$3<$E$1,\"<?\",IF($D$3>$NF$1,\">?\",LOOKUP($D$3,$E$1:$NF$1,E74:NF74)))","v":0},null,null,null,null,null,null,null,null,null,null,null,null,null,null,null,null,null,null,null,null,null,null,null,null,null,null,null,null,null,null,null,null,null,null,null,null,null,null,null,null,null,null,null,null,null,null,null,null,null,null,null,null,null,null,null,null,null,null,null,null,null,null,null,null,null,null,null,null,null,null,null,null,null,null,null,null,null,null,null,null,null,null,null,null,null,null,null,null,null,null,null,null,null,null,null,null,null,null,null,null,null,null,null,null,null,null,null,null,null,null,null,null,null,null,null,null,null,null,null,null,null,null,null,null,null,null,null,null,null,null,null,null,null,null,null,null,null,null,null,null,null,null,null,null,null,null,null,null,null,null,null,null,null,null,null,null,null,null,null,null,null,null,null,null,null,null,null,null,null,null,null,null,null,null,null,null,null,null,null,null,null,null,null,null,null,null,null,null,null,null,null,null,null,null,null,null,null,null,null,null,null,null,null,null,null,null,null,null,null,null,null,null,null,null,null,null,null,null,null,null,null,null,null,null,null,null,null,null,null,null,null,null,null,null,null,null,null,null,null,null,null,null,null,null,null,null,null,null,null,null,null,null,null,null,null,null,null,null,null,null,null,null,null,null,null,null,null,null,null,null,null,null,null,null,null,null,null,null,null,null,null,null,null,null,null,null,null,null,null,null,null,null,null,null,null,null,null,null,null,null,null,null,null,null,null,null,null,null,null,null,null,null,null,null,null,null,null,null,null,null,null,null,null,null,null,null,null,null,null,null,null,null,null,null,null,null,null,null,null,null,null,null,null,null,null,null,null,null,null,null,null,null,null,null,null,null,null,null,null,null,null,null,null,null,null,null,null,{"$f":"Dateneingabe!N76","v":70},null,{"$f":"Dateneingabe!K76","v":0},{"$f":"Dateneingabe!L76","v":0},{"$f":"Dateneingabe!M76","v":0},{"$f":"COUNTIFS(E74:NF74,\"U\")","v":0},{"$f":"NL74-NM74","v":0}]
[{"$f":"IF(Dateneingabe!A77=0,\"zzz\",Dateneingabe!A77)","v":"zzz"},{"$f":"IF(Dateneingabe!B77=0,\"zzz\",Dateneingabe!B77)","v":"zzz"},{"$f":"IF(Dateneingabe!C77=0,\"zzz\",Dateneingabe!C77)","v":"zzz"},{"$f":"IF($D$3<$E$1,\"<?\",IF($D$3>$NF$1,\">?\",LOOKUP($D$3,$E$1:$NF$1,E75:NF75)))","v":0},null,null,null,null,null,null,null,null,null,null,null,null,null,null,null,null,null,null,null,null,null,null,null,null,null,null,null,null,null,null,null,null,null,null,null,null,null,null,null,null,null,null,null,null,null,null,null,null,null,null,null,null,null,null,null,null,null,null,null,null,null,null,null,null,null,null,null,null,null,null,null,null,null,null,null,null,null,null,null,null,null,null,null,null,null,null,null,null,null,null,null,null,null,null,null,null,null,null,null,null,null,null,null,null,null,null,null,null,null,null,null,null,null,null,null,null,null,null,null,null,null,null,null,null,null,null,null,null,null,null,null,null,null,null,null,null,null,null,null,null,null,null,null,null,null,null,null,null,null,null,null,null,null,null,null,null,null,null,null,null,null,null,null,null,null,null,null,null,null,null,null,null,null,null,null,null,null,null,null,null,null,null,null,null,null,null,null,null,null,null,null,null,null,null,null,null,null,null,null,null,null,null,null,null,null,null,null,null,null,null,null,null,null,null,null,null,null,null,null,null,null,null,null,null,null,null,null,null,null,null,null,null,null,null,null,null,null,null,null,null,null,null,null,null,null,null,null,null,null,null,null,null,null,null,null,null,null,null,null,null,null,null,null,null,null,null,null,null,null,null,null,null,null,null,null,null,null,null,null,null,null,null,null,null,null,null,null,null,null,null,null,null,null,null,null,null,null,null,null,null,null,null,null,null,null,null,null,null,null,null,null,null,null,null,null,null,null,null,null,null,null,null,null,null,null,null,null,null,null,null,null,null,null,null,null,null,null,null,null,null,null,null,null,null,null,null,null,null,null,null,null,null,null,null,null,null,null,null,null,null,null,null,null,null,null,null,null,{"$f":"Dateneingabe!N77","v":71},null,{"$f":"Dateneingabe!K77","v":0},{"$f":"Dateneingabe!L77","v":0},{"$f":"Dateneingabe!M77","v":0},{"$f":"COUNTIFS(E75:NF75,\"U\")","v":0},{"$f":"NL75-NM75","v":0}]
[{"$f":"IF(Dateneingabe!A78=0,\"zzz\",Dateneingabe!A78)","v":"zzz"},{"$f":"IF(Dateneingabe!B78=0,\"zzz\",Dateneingabe!B78)","v":"zzz"},{"$f":"IF(Dateneingabe!C78=0,\"zzz\",Dateneingabe!C78)","v":"zzz"},{"$f":"IF($D$3<$E$1,\"<?\",IF($D$3>$NF$1,\">?\",LOOKUP($D$3,$E$1:$NF$1,E76:NF76)))","v":0},null,null,null,null,null,null,null,null,null,null,null,null,null,null,null,null,null,null,null,null,null,null,null,null,null,null,null,null,null,null,null,null,null,null,null,null,null,null,null,null,null,null,null,null,null,null,null,null,null,null,null,null,null,null,null,null,null,null,null,null,null,null,null,null,null,null,null,null,null,null,null,null,null,null,null,null,null,null,null,null,null,null,null,null,null,null,null,null,null,null,null,null,null,null,null,null,null,null,null,null,null,null,null,null,null,null,null,null,null,null,null,null,null,null,null,null,null,null,null,null,null,null,null,null,null,null,null,null,null,null,null,null,null,null,null,null,null,null,null,null,null,null,null,null,null,null,null,null,null,null,null,null,null,null,null,null,null,null,null,null,null,null,null,null,null,null,null,null,null,null,null,null,null,null,null,null,null,null,null,null,null,null,null,null,null,null,null,null,null,null,null,null,null,null,null,null,null,null,null,null,null,null,null,null,null,null,null,null,null,null,null,null,null,null,null,null,null,null,null,null,null,null,null,null,null,null,null,null,null,null,null,null,null,null,null,null,null,null,null,null,null,null,null,null,null,null,null,null,null,null,null,null,null,null,null,null,null,null,null,null,null,null,null,null,null,null,null,null,null,null,null,null,null,null,null,null,null,null,null,null,null,null,null,null,null,null,null,null,null,null,null,null,null,null,null,null,null,null,null,null,null,null,null,null,null,null,null,null,null,null,null,null,null,null,null,null,null,null,null,null,null,null,null,null,null,null,null,null,null,null,null,null,null,null,null,null,null,null,null,null,null,null,null,null,null,null,null,null,null,null,null,null,null,null,null,null,null,null,null,null,null,null,null,null,null,null,null,{"$f":"Dateneingabe!N78","v":72},null,{"$f":"Dateneingabe!K78","v":0},{"$f":"Dateneingabe!L78","v":0},{"$f":"Dateneingabe!M78","v":0},{"$f":"COUNTIFS(E76:NF76,\"U\")","v":0},{"$f":"NL76-NM76","v":0}]
[{"$f":"IF(Dateneingabe!A79=0,\"zzz\",Dateneingabe!A79)","v":"zzz"},{"$f":"IF(Dateneingabe!B79=0,\"zzz\",Dateneingabe!B79)","v":"zzz"},{"$f":"IF(Dateneingabe!C79=0,\"zzz\",Dateneingabe!C79)","v":"zzz"},{"$f":"IF($D$3<$E$1,\"<?\",IF($D$3>$NF$1,\">?\",LOOKUP($D$3,$E$1:$NF$1,E77:NF77)))","v":0},null,null,null,null,null,null,null,null,null,null,null,null,null,null,null,null,null,null,null,null,null,null,null,null,null,null,null,null,null,null,null,null,null,null,null,null,null,null,null,null,null,null,null,null,null,null,null,null,null,null,null,null,null,null,null,null,null,null,null,null,null,null,null,null,null,null,null,null,null,null,null,null,null,null,null,null,null,null,null,null,null,null,null,null,null,null,null,null,null,null,null,null,null,null,null,null,null,null,null,null,null,null,null,null,null,null,null,null,null,null,null,null,null,null,null,null,null,null,null,null,null,null,null,null,null,null,null,null,null,null,null,null,null,null,null,null,null,null,null,null,null,null,null,null,null,null,null,null,null,null,null,null,null,null,null,null,null,null,null,null,null,null,null,null,null,null,null,null,null,null,null,null,null,null,null,null,null,null,null,null,null,null,null,null,null,null,null,null,null,null,null,null,null,null,null,null,null,null,null,null,null,null,null,null,null,null,null,null,null,null,null,null,null,null,null,null,null,null,null,null,null,null,null,null,null,null,null,null,null,null,null,null,null,null,null,null,null,null,null,null,null,null,null,null,null,null,null,null,null,null,null,null,null,null,null,null,null,null,null,null,null,null,null,null,null,null,null,null,null,null,null,null,null,null,null,null,null,null,null,null,null,null,null,null,null,null,null,null,null,null,null,null,null,null,null,null,null,null,null,null,null,null,null,null,null,null,null,null,null,null,null,null,null,null,null,null,null,null,null,null,null,null,null,null,null,null,null,null,null,null,null,null,null,null,null,null,null,null,null,null,null,null,null,null,null,null,null,null,null,null,null,null,null,null,null,null,null,null,null,null,null,null,null,null,null,null,null,{"$f":"Dateneingabe!N79","v":73},null,{"$f":"Dateneingabe!K79","v":0},{"$f":"Dateneingabe!L79","v":0},{"$f":"Dateneingabe!M79","v":0},{"$f":"COUNTIFS(E77:NF77,\"U\")","v":0},{"$f":"NL77-NM77","v":0}]
[{"$f":"IF(Dateneingabe!A80=0,\"zzz\",Dateneingabe!A80)","v":"zzz"},{"$f":"IF(Dateneingabe!B80=0,\"zzz\",Dateneingabe!B80)","v":"zzz"},{"$f":"IF(Dateneingabe!C80=0,\"zzz\",Dateneingabe!C80)","v":"zzz"},{"$f":"IF($D$3<$E$1,\"<?\",IF($D$3>$NF$1,\">?\",LOOKUP($D$3,$E$1:$NF$1,E78:NF78)))","v":0},null,null,null,null,null,null,null,null,null,null,null,null,null,null,null,null,null,null,null,null,null,null,null,null,null,null,null,null,null,null,null,null,null,null,null,null,null,null,null,null,null,null,null,null,null,null,null,null,null,null,null,null,null,null,null,null,null,null,null,null,null,null,null,null,null,null,null,null,null,null,null,null,null,null,null,null,null,null,null,null,null,null,null,null,null,null,null,null,null,null,null,null,null,null,null,null,null,null,null,null,null,null,null,null,null,null,null,null,null,null,null,null,null,null,null,null,null,null,null,null,null,null,null,null,null,null,null,null,null,null,null,null,null,null,null,null,null,null,null,null,null,null,null,null,null,null,null,null,null,null,null,null,null,null,null,null,null,null,null,null,null,null,null,null,null,null,null,null,null,null,null,null,null,null,null,null,null,null,null,null,null,null,null,null,null,null,null,null,null,null,null,null,null,null,null,null,null,null,null,null,null,null,null,null,null,null,null,null,null,null,null,null,null,null,null,null,null,null,null,null,null,null,null,null,null,null,null,null,null,null,null,null,null,null,null,null,null,null,null,null,null,null,null,null,null,null,null,null,null,null,null,null,null,null,null,null,null,null,null,null,null,null,null,null,null,null,null,null,null,null,null,null,null,null,null,null,null,null,null,null,null,null,null,null,null,null,null,null,null,null,null,null,null,null,null,null,null,null,null,null,null,null,null,null,null,null,null,null,null,null,null,null,null,null,null,null,null,null,null,null,null,null,null,null,null,null,null,null,null,null,null,null,null,null,null,null,null,null,null,null,null,null,null,null,null,null,null,null,null,null,null,null,null,null,null,null,null,null,null,null,null,null,null,null,null,null,null,{"$f":"Dateneingabe!N80","v":74},null,{"$f":"Dateneingabe!K80","v":0},{"$f":"Dateneingabe!L80","v":0},{"$f":"Dateneingabe!M80","v":0},{"$f":"COUNTIFS(E78:NF78,\"U\")","v":0},{"$f":"NL78-NM78","v":0}]
[{"$f":"IF(Dateneingabe!A81=0,\"zzz\",Dateneingabe!A81)","v":"zzz"},{"$f":"IF(Dateneingabe!B81=0,\"zzz\",Dateneingabe!B81)","v":"zzz"},{"$f":"IF(Dateneingabe!C81=0,\"zzz\",Dateneingabe!C81)","v":"zzz"},{"$f":"IF($D$3<$E$1,\"<?\",IF($D$3>$NF$1,\">?\",LOOKUP($D$3,$E$1:$NF$1,E79:NF79)))","v":0},null,null,null,null,null,null,null,null,null,null,null,null,null,null,null,null,null,null,null,null,null,null,null,null,null,null,null,null,null,null,null,null,null,null,null,null,null,null,null,null,null,null,null,null,null,null,null,null,null,null,null,null,null,null,null,null,null,null,null,null,null,null,null,null,null,null,null,null,null,null,null,null,null,null,null,null,null,null,null,null,null,null,null,null,null,null,null,null,null,null,null,null,null,null,null,null,null,null,null,null,null,null,null,null,null,null,null,null,null,null,null,null,null,null,null,null,null,null,null,null,null,null,null,null,null,null,null,null,null,null,null,null,null,null,null,null,null,null,null,null,null,null,null,null,null,null,null,null,null,null,null,null,null,null,null,null,null,null,null,null,null,null,null,null,null,null,null,null,null,null,null,null,null,null,null,null,null,null,null,null,null,null,null,null,null,null,null,null,null,null,null,null,null,null,null,null,null,null,null,null,null,null,null,null,null,null,null,null,null,null,null,null,null,null,null,null,null,null,null,null,null,null,null,null,null,null,null,null,null,null,null,null,null,null,null,null,null,null,null,null,null,null,null,null,null,null,null,null,null,null,null,null,null,null,null,null,null,null,null,null,null,null,null,null,null,null,null,null,null,null,null,null,null,null,null,null,null,null,null,null,null,null,null,null,null,null,null,null,null,null,null,null,null,null,null,null,null,null,null,null,null,null,null,null,null,null,null,null,null,null,null,null,null,null,null,null,null,null,null,null,null,null,null,null,null,null,null,null,null,null,null,null,null,null,null,null,null,null,null,null,null,null,null,null,null,null,null,null,null,null,null,null,null,null,null,null,null,null,null,null,null,null,null,null,null,null,null,{"$f":"Dateneingabe!N81","v":75},null,{"$f":"Dateneingabe!K81","v":0},{"$f":"Dateneingabe!L81","v":0},{"$f":"Dateneingabe!M81","v":0},{"$f":"COUNTIFS(E79:NF79,\"U\")","v":0},{"$f":"NL79-NM79","v":0}]
[{"$f":"IF(Dateneingabe!A82=0,\"zzz\",Dateneingabe!A82)","v":"zzz"},{"$f":"IF(Dateneingabe!B82=0,\"zzz\",Dateneingabe!B82)","v":"zzz"},{"$f":"IF(Dateneingabe!C82=0,\"zzz\",Dateneingabe!C82)","v":"zzz"},{"$f":"IF($D$3<$E$1,\"<?\",IF($D$3>$NF$1,\">?\",LOOKUP($D$3,$E$1:$NF$1,E80:NF80)))","v":0},null,null,null,null,null,null,null,null,null,null,null,null,null,null,null,null,null,null,null,null,null,null,null,null,null,null,null,null,null,null,null,null,null,null,null,null,null,null,null,null,null,null,null,null,null,null,null,null,null,null,null,null,null,null,null,null,null,null,null,null,null,null,null,null,null,null,null,null,null,null,null,null,null,null,null,null,null,null,null,null,null,null,null,null,null,null,null,null,null,null,null,null,null,null,null,null,null,null,null,null,null,null,null,null,null,null,null,null,null,null,null,null,null,null,null,null,null,null,null,null,null,null,null,null,null,null,null,null,null,null,null,null,null,null,null,null,null,null,null,null,null,null,null,null,null,null,null,null,null,null,null,null,null,null,null,null,null,null,null,null,null,null,null,null,null,null,null,null,null,null,null,null,null,null,null,null,null,null,null,null,null,null,null,null,null,null,null,null,null,null,null,null,null,null,null,null,null,null,null,null,null,null,null,null,null,null,null,null,null,null,null,null,null,null,null,null,null,null,null,null,null,null,null,null,null,null,null,null,null,null,null,null,null,null,null,null,null,null,null,null,null,null,null,null,null,null,null,null,null,null,null,null,null,null,null,null,null,null,null,null,null,null,null,null,null,null,null,null,null,null,null,null,null,null,null,null,null,null,null,null,null,null,null,null,null,null,null,null,null,null,null,null,null,null,null,null,null,null,null,null,null,null,null,null,null,null,null,null,null,null,null,null,null,null,null,null,null,null,null,null,null,null,null,null,null,null,null,null,null,null,null,null,null,null,null,null,null,null,null,null,null,null,null,null,null,null,null,null,null,null,null,null,null,null,null,null,null,null,null,null,null,null,null,null,null,null,null,{"$f":"Dateneingabe!N82","v":76},null,{"$f":"Dateneingabe!K82","v":0},{"$f":"Dateneingabe!L82","v":0},{"$f":"Dateneingabe!M82","v":0},{"$f":"COUNTIFS(E80:NF80,\"U\")","v":0},{"$f":"NL80-NM80","v":0}]
[{"$f":"IF(Dateneingabe!A83=0,\"zzz\",Dateneingabe!A83)","v":"zzz"},{"$f":"IF(Dateneingabe!B83=0,\"zzz\",Dateneingabe!B83)","v":"zzz"},{"$f":"IF(Dateneingabe!C83=0,\"zzz\",Dateneingabe!C83)","v":"zzz"},{"$f":"IF($D$3<$E$1,\"<?\",IF($D$3>$NF$1,\">?\",LOOKUP($D$3,$E$1:$NF$1,E81:NF81)))","v":0},null,null,null,null,null,null,null,null,null,null,null,null,null,null,null,null,null,null,null,null,null,null,null,null,null,null,null,null,null,null,null,null,null,null,null,null,null,null,null,null,null,null,null,null,null,null,null,null,null,null,null,null,null,null,null,null,null,null,null,null,null,null,null,null,null,null,null,null,null,null,null,null,null,null,null,null,null,null,null,null,null,null,null,null,null,null,null,null,null,null,null,null,null,null,null,null,null,null,null,null,null,null,null,null,null,null,null,null,null,null,null,null,null,null,null,null,null,null,null,null,null,null,null,null,null,null,null,null,null,null,null,null,null,null,null,null,null,null,null,null,null,null,null,null,null,null,null,null,null,null,null,null,null,null,null,null,null,null,null,null,null,null,null,null,null,null,null,null,null,null,null,null,null,null,null,null,null,null,null,null,null,null,null,null,null,null,null,null,null,null,null,null,null,null,null,null,null,null,null,null,null,null,null,null,null,null,null,null,null,null,null,null,null,null,null,null,null,null,null,null,null,null,null,null,null,null,null,null,null,null,null,null,null,null,null,null,null,null,null,null,null,null,null,null,null,null,null,null,null,null,null,null,null,null,null,null,null,null,null,null,null,null,null,null,null,null,null,null,null,null,null,null,null,null,null,null,null,null,null,null,null,null,null,null,null,null,null,null,null,null,null,null,null,null,null,null,null,null,null,null,null,null,null,null,null,null,null,null,null,null,null,null,null,null,null,null,null,null,null,null,null,null,null,null,null,null,null,null,null,null,null,null,null,null,null,null,null,null,null,null,null,null,null,null,null,null,null,null,null,null,null,null,null,null,null,null,null,null,null,null,null,null,null,null,null,null,null,{"$f":"Dateneingabe!N83","v":77},null,{"$f":"Dateneingabe!K83","v":0},{"$f":"Dateneingabe!L83","v":0},{"$f":"Dateneingabe!M83","v":0},{"$f":"COUNTIFS(E81:NF81,\"U\")","v":0},{"$f":"NL81-NM81","v":0}]
[{"$f":"IF(Dateneingabe!A84=0,\"zzz\",Dateneingabe!A84)","v":"zzz"},{"$f":"IF(Dateneingabe!B84=0,\"zzz\",Dateneingabe!B84)","v":"zzz"},{"$f":"IF(Dateneingabe!C84=0,\"zzz\",Dateneingabe!C84)","v":"zzz"},{"$f":"IF($D$3<$E$1,\"<?\",IF($D$3>$NF$1,\">?\",LOOKUP($D$3,$E$1:$NF$1,E82:NF82)))","v":0},null,null,null,null,null,null,null,null,null,null,null,null,null,null,null,null,null,null,null,null,null,null,null,null,null,null,null,null,null,null,null,null,null,null,null,null,null,null,null,null,null,null,null,null,null,null,null,null,null,null,null,null,null,null,null,null,null,null,null,null,null,null,null,null,null,null,null,null,null,null,null,null,null,null,null,null,null,null,null,null,null,null,null,null,null,null,null,null,null,null,null,null,null,null,null,null,null,null,null,null,null,null,null,null,null,null,null,null,null,null,null,null,null,null,null,null,null,null,null,null,null,null,null,null,null,null,null,null,null,null,null,null,null,null,null,null,null,null,null,null,null,null,null,null,null,null,null,null,null,null,null,null,null,null,null,null,null,null,null,null,null,null,null,null,null,null,null,null,null,null,null,null,null,null,null,null,null,null,null,null,null,null,null,null,null,null,null,null,null,null,null,null,null,null,null,null,null,null,null,null,null,null,null,null,null,null,null,null,null,null,null,null,null,null,null,null,null,null,null,null,null,null,null,null,null,null,null,null,null,null,null,null,null,null,null,null,null,null,null,null,null,null,null,null,null,null,null,null,null,null,null,null,null,null,null,null,null,null,null,null,null,null,null,null,null,null,null,null,null,null,null,null,null,null,null,null,null,null,null,null,null,null,null,null,null,null,null,null,null,null,null,null,null,null,null,null,null,null,null,null,null,null,null,null,null,null,null,null,null,null,null,null,null,null,null,null,null,null,null,null,null,null,null,null,null,null,null,null,null,null,null,null,null,null,null,null,null,null,null,null,null,null,null,null,null,null,null,null,null,null,null,null,null,null,null,null,null,null,null,null,null,null,null,null,null,null,null,{"$f":"Dateneingabe!N84","v":78},null,{"$f":"Dateneingabe!K84","v":0},{"$f":"Dateneingabe!L84","v":0},{"$f":"Dateneingabe!M84","v":0},{"$f":"COUNTIFS(E82:NF82,\"U\")","v":0},{"$f":"NL82-NM82","v":0}]
[{"$f":"IF(Dateneingabe!A85=0,\"zzz\",Dateneingabe!A85)","v":"zzz"},{"$f":"IF(Dateneingabe!B85=0,\"zzz\",Dateneingabe!B85)","v":"zzz"},{"$f":"IF(Dateneingabe!C85=0,\"zzz\",Dateneingabe!C85)","v":"zzz"},{"$f":"IF($D$3<$E$1,\"<?\",IF($D$3>$NF$1,\">?\",LOOKUP($D$3,$E$1:$NF$1,E83:NF83)))","v":0},null,null,null,null,null,null,null,null,null,null,null,null,null,null,null,null,null,null,null,null,null,null,null,null,null,null,null,null,null,null,null,null,null,null,null,null,null,null,null,null,null,null,null,null,null,null,null,null,null,null,null,null,null,null,null,null,null,null,null,null,null,null,null,null,null,null,null,null,null,null,null,null,null,null,null,null,null,null,null,null,null,null,null,null,null,null,null,null,null,null,null,null,null,null,null,null,null,null,null,null,null,null,null,null,null,null,null,null,null,null,null,null,null,null,null,null,null,null,null,null,null,null,null,null,null,null,null,null,null,null,null,null,null,null,null,null,null,null,null,null,null,null,null,null,null,null,null,null,null,null,null,null,null,null,null,null,null,null,null,null,null,null,null,null,null,null,null,null,null,null,null,null,null,null,null,null,null,null,null,null,null,null,null,null,null,null,null,null,null,null,null,null,null,null,null,null,null,null,null,null,null,null,null,null,null,null,null,null,null,null,null,null,null,null,null,null,null,null,null,null,null,null,null,null,null,null,null,null,null,null,null,null,null,null,null,null,null,null,null,null,null,null,null,null,null,null,null,null,null,null,null,null,null,null,null,null,null,null,null,null,null,null,null,null,null,null,null,null,null,null,null,null,null,null,null,null,null,null,null,null,null,null,null,null,null,null,null,null,null,null,null,null,null,null,null,null,null,null,null,null,null,null,null,null,null,null,null,null,null,null,null,null,null,null,null,null,null,null,null,null,null,null,null,null,null,null,null,null,null,null,null,null,null,null,null,null,null,null,null,null,null,null,null,null,null,null,null,null,null,null,null,null,null,null,null,null,null,null,null,null,null,null,null,null,null,null,null,{"$f":"Dateneingabe!N85","v":79},null,{"$f":"Dateneingabe!K85","v":0},{"$f":"Dateneingabe!L85","v":0},{"$f":"Dateneingabe!M85","v":0},{"$f":"COUNTIFS(E83:NF83,\"U\")","v":0},{"$f":"NL83-NM83","v":0}]
[{"$f":"IF(Dateneingabe!A86=0,\"zzz\",Dateneingabe!A86)","v":"zzz"},{"$f":"IF(Dateneingabe!B86=0,\"zzz\",Dateneingabe!B86)","v":"zzz"},{"$f":"IF(Dateneingabe!C86=0,\"zzz\",Dateneingabe!C86)","v":"zzz"},{"$f":"IF($D$3<$E$1,\"<?\",IF($D$3>$NF$1,\">?\",LOOKUP($D$3,$E$1:$NF$1,E84:NF84)))","v":0},null,null,null,null,null,null,null,null,null,null,null,null,null,null,null,null,null,null,null,null,null,null,null,null,null,null,null,null,null,null,null,null,null,null,null,null,null,null,null,null,null,null,null,null,null,null,null,null,null,null,null,null,null,null,null,null,null,null,null,null,null,null,null,null,null,null,null,null,null,null,null,null,null,null,null,null,null,null,null,null,null,null,null,null,null,null,null,null,null,null,null,null,null,null,null,null,null,null,null,null,null,null,null,null,null,null,null,null,null,null,null,null,null,null,null,null,null,null,null,null,null,null,null,null,null,null,null,null,null,null,null,null,null,null,null,null,null,null,null,null,null,null,null,null,null,null,null,null,null,null,null,null,null,null,null,null,null,null,null,null,null,null,null,null,null,null,null,null,null,null,null,null,null,null,null,null,null,null,null,null,null,null,null,null,null,null,null,null,null,null,null,null,null,null,null,null,null,null,null,null,null,null,null,null,null,null,null,null,null,null,null,null,null,null,null,null,null,null,null,null,null,null,null,null,null,null,null,null,null,null,null,null,null,null,null,null,null,null,null,null,null,null,null,null,null,null,null,null,null,null,null,null,null,null,null,null,null,null,null,null,null,null,null,null,null,null,null,null,null,null,null,null,null,null,null,null,null,null,null,null,null,null,null,null,null,null,null,null,null,null,null,null,null,null,null,null,null,null,null,null,null,null,null,null,null,null,null,null,null,null,null,null,null,null,null,null,null,null,null,null,null,null,null,null,null,null,null,null,null,null,null,null,null,null,null,null,null,null,null,null,null,null,null,null,null,null,null,null,null,null,null,null,null,null,null,null,null,null,null,null,null,null,null,null,null,null,null,{"$f":"Dateneingabe!N86","v":80},null,{"$f":"Dateneingabe!K86","v":0},{"$f":"Dateneingabe!L86","v":0},{"$f":"Dateneingabe!M86","v":0},{"$f":"COUNTIFS(E84:NF84,\"U\")","v":0},{"$f":"NL84-NM84","v":0}]
[{"$f":"IF(Dateneingabe!A87=0,\"zzz\",Dateneingabe!A87)","v":"zzz"},{"$f":"IF(Dateneingabe!B87=0,\"zzz\",Dateneingabe!B87)","v":"zzz"},{"$f":"IF(Dateneingabe!C87=0,\"zzz\",Dateneingabe!C87)","v":"zzz"},{"$f":"IF($D$3<$E$1,\"<?\",IF($D$3>$NF$1,\">?\",LOOKUP($D$3,$E$1:$NF$1,E85:NF85)))","v":0},null,null,null,null,null,null,null,null,null,null,null,null,null,null,null,null,null,null,null,null,null,null,null,null,null,null,null,null,null,null,null,null,null,null,null,null,null,null,null,null,null,null,null,null,null,null,null,null,null,null,null,null,null,null,null,null,null,null,null,null,null,null,null,null,null,null,null,null,null,null,null,null,null,null,null,null,null,null,null,null,null,null,null,null,null,null,null,null,null,null,null,null,null,null,null,null,null,null,null,null,null,null,null,null,null,null,null,null,null,null,null,null,null,null,null,null,null,null,null,null,null,null,null,null,null,null,null,null,null,null,null,null,null,null,null,null,null,null,null,null,null,null,null,null,null,null,null,null,null,null,null,null,null,null,null,null,null,null,null,null,null,null,null,null,null,null,null,null,null,null,null,null,null,null,null,null,null,null,null,null,null,null,null,null,null,null,null,null,null,null,null,null,null,null,null,null,null,null,null,null,null,null,null,null,null,null,null,null,null,null,null,null,null,null,null,null,null,null,null,null,null,null,null,null,null,null,null,null,null,null,null,null,null,null,null,null,null,null,null,null,null,null,null,null,null,null,null,null,null,null,null,null,null,null,null,null,null,null,null,null,null,null,null,null,null,null,null,null,null,null,null,null,null,null,null,null,null,null,null,null,null,null,null,null,null,null,null,null,null,null,null,null,null,null,null,null,null,null,null,null,null,null,null,null,null,null,null,null,null,null,null,null,null,null,null,null,null,null,null,null,null,null,null,null,null,null,null,null,null,null,null,null,null,null,null,null,null,null,null,null,null,null,null,null,null,null,null,null,null,null,null,null,null,null,null,null,null,null,null,null,null,null,null,null,null,null,null,{"$f":"Dateneingabe!N87","v":81},null,{"$f":"Dateneingabe!K87","v":0},{"$f":"Dateneingabe!L87","v":0},{"$f":"Dateneingabe!M87","v":0},{"$f":"COUNTIFS(E85:NF85,\"U\")","v":0},{"$f":"NL85-NM85","v":0}]
[{"$f":"IF(Dateneingabe!A88=0,\"zzz\",Dateneingabe!A88)","v":"zzz"},{"$f":"IF(Dateneingabe!B88=0,\"zzz\",Dateneingabe!B88)","v":"zzz"},{"$f":"IF(Dateneingabe!C88=0,\"zzz\",Dateneingabe!C88)","v":"zzz"},{"$f":"IF($D$3<$E$1,\"<?\",IF($D$3>$NF$1,\">?\",LOOKUP($D$3,$E$1:$NF$1,E86:NF86)))","v":0},null,null,null,null,null,null,null,null,null,null,null,null,null,null,null,null,null,null,null,null,null,null,null,null,null,null,null,null,null,null,null,null,null,null,null,null,null,null,null,null,null,null,null,null,null,null,null,null,null,null,null,null,null,null,null,null,null,null,null,null,null,null,null,null,null,null,null,null,null,null,null,null,null,null,null,null,null,null,null,null,null,null,null,null,null,null,null,null,null,null,null,null,null,null,null,null,null,null,null,null,null,null,null,null,null,null,null,null,null,null,null,null,null,null,null,null,null,null,null,null,null,null,null,null,null,null,null,null,null,null,null,null,null,null,null,null,null,null,null,null,null,null,null,null,null,null,null,null,null,null,null,null,null,null,null,null,null,null,null,null,null,null,null,null,null,null,null,null,null,null,null,null,null,null,null,null,null,null,null,null,null,null,null,null,null,null,null,null,null,null,null,null,null,null,null,null,null,null,null,null,null,null,null,null,null,null,null,null,null,null,null,null,null,null,null,null,null,null,null,null,null,null,null,null,null,null,null,null,null,null,null,null,null,null,null,null,null,null,null,null,null,null,null,null,null,null,null,null,null,null,null,null,null,null,null,null,null,null,null,null,null,null,null,null,null,null,null,null,null,null,null,null,null,null,null,null,null,null,null,null,null,null,null,null,null,null,null,null,null,null,null,null,null,null,null,null,null,null,null,null,null,null,null,null,null,null,null,null,null,null,null,null,null,null,null,null,null,null,null,null,null,null,null,null,null,null,null,null,null,null,null,null,null,null,null,null,null,null,null,null,null,null,null,null,null,null,null,null,null,null,null,null,null,null,null,null,null,null,null,null,null,null,null,null,null,null,null,{"$f":"Dateneingabe!N88","v":82},null,{"$f":"Dateneingabe!K88","v":0},{"$f":"Dateneingabe!L88","v":0},{"$f":"Dateneingabe!M88","v":0},{"$f":"COUNTIFS(E86:NF86,\"U\")","v":0},{"$f":"NL86-NM86","v":0}]
[{"$f":"IF(Dateneingabe!A89=0,\"zzz\",Dateneingabe!A89)","v":"zzz"},{"$f":"IF(Dateneingabe!B89=0,\"zzz\",Dateneingabe!B89)","v":"zzz"},{"$f":"IF(Dateneingabe!C89=0,\"zzz\",Dateneingabe!C89)","v":"zzz"},{"$f":"IF($D$3<$E$1,\"<?\",IF($D$3>$NF$1,\">?\",LOOKUP($D$3,$E$1:$NF$1,E87:NF87)))","v":0},null,null,null,null,null,null,null,null,null,null,null,null,null,null,null,null,null,null,null,null,null,null,null,null,null,null,null,null,null,null,null,null,null,null,null,null,null,null,null,null,null,null,null,null,null,null,null,null,null,null,null,null,null,null,null,null,null,null,null,null,null,null,null,null,null,null,null,null,null,null,null,null,null,null,null,null,null,null,null,null,null,null,null,null,null,null,null,null,null,null,null,null,null,null,null,null,null,null,null,null,null,null,null,null,null,null,null,null,null,null,null,null,null,null,null,null,null,null,null,null,null,null,null,null,null,null,null,null,null,null,null,null,null,null,null,null,null,null,null,null,null,null,null,null,null,null,null,null,null,null,null,null,null,null,null,null,null,null,null,null,null,null,null,null,null,null,null,null,null,null,null,null,null,null,null,null,null,null,null,null,null,null,null,null,null,null,null,null,null,null,null,null,null,null,null,null,null,null,null,null,null,null,null,null,null,null,null,null,null,null,null,null,null,null,null,null,null,null,null,null,null,null,null,null,null,null,null,null,null,null,null,null,null,null,null,null,null,null,null,null,null,null,null,null,null,null,null,null,null,null,null,null,null,null,null,null,null,null,null,null,null,null,null,null,null,null,null,null,null,null,null,null,null,null,null,null,null,null,null,null,null,null,null,null,null,null,null,null,null,null,null,null,null,null,null,null,null,null,null,null,null,null,null,null,null,null,null,null,null,null,null,null,null,null,null,null,null,null,null,null,null,null,null,null,null,null,null,null,null,null,null,null,null,null,null,null,null,null,null,null,null,null,null,null,null,null,null,null,null,null,null,null,null,null,null,null,null,null,null,null,null,null,null,null,null,null,null,{"$f":"Dateneingabe!N89","v":83},null,{"$f":"Dateneingabe!K89","v":0},{"$f":"Dateneingabe!L89","v":0},{"$f":"Dateneingabe!M89","v":0},{"$f":"COUNTIFS(E87:NF87,\"U\")","v":0},{"$f":"NL87-NM87","v":0}]
[{"$f":"IF(Dateneingabe!A90=0,\"zzz\",Dateneingabe!A90)","v":"zzz"},{"$f":"IF(Dateneingabe!B90=0,\"zzz\",Dateneingabe!B90)","v":"zzz"},{"$f":"IF(Dateneingabe!C90=0,\"zzz\",Dateneingabe!C90)","v":"zzz"},{"$f":"IF($D$3<$E$1,\"<?\",IF($D$3>$NF$1,\">?\",LOOKUP($D$3,$E$1:$NF$1,E88:NF88)))","v":0},null,null,null,null,null,null,null,null,null,null,null,null,null,null,null,null,null,null,null,null,null,null,null,null,null,null,null,null,null,null,null,null,null,null,null,null,null,null,null,null,null,null,null,null,null,null,null,null,null,null,null,null,null,null,null,null,null,null,null,null,null,null,null,null,null,null,null,null,null,null,null,null,null,null,null,null,null,null,null,null,null,null,null,null,null,null,null,null,null,null,null,null,null,null,null,null,null,null,null,null,null,null,null,null,null,null,null,null,null,null,null,null,null,null,null,null,null,null,null,null,null,null,null,null,null,null,null,null,null,null,null,null,null,null,null,null,null,null,null,null,null,null,null,null,null,null,null,null,null,null,null,null,null,null,null,null,null,null,null,null,null,null,null,null,null,null,null,null,null,null,null,null,null,null,null,null,null,null,null,null,null,null,null,null,null,null,null,null,null,null,null,null,null,null,null,null,null,null,null,null,null,null,null,null,null,null,null,null,null,null,null,null,null,null,null,null,null,null,null,null,null,null,null,null,null,null,null,null,null,null,null,null,null,null,null,null,null,null,null,null,null,null,null,null,null,null,null,null,null,null,null,null,null,null,null,null,null,null,null,null,null,null,null,null,null,null,null,null,null,null,null,null,null,null,null,null,null,null,null,null,null,null,null,null,null,null,null,null,null,null,null,null,null,null,null,null,null,null,null,null,null,null,null,null,null,null,null,null,null,null,null,null,null,null,null,null,null,null,null,null,null,null,null,null,null,null,null,null,null,null,null,null,null,null,null,null,null,null,null,null,null,null,null,null,null,null,null,null,null,null,null,null,null,null,null,null,null,null,null,null,null,null,null,null,null,null,null,{"$f":"Dateneingabe!N90","v":84},null,{"$f":"Dateneingabe!K90","v":0},{"$f":"Dateneingabe!L90","v":0},{"$f":"Dateneingabe!M90","v":0},{"$f":"COUNTIFS(E88:NF88,\"U\")","v":0},{"$f":"NL88-NM88","v":0}]
[{"$f":"IF(Dateneingabe!A91=0,\"zzz\",Dateneingabe!A91)","v":"zzz"},{"$f":"IF(Dateneingabe!B91=0,\"zzz\",Dateneingabe!B91)","v":"zzz"},{"$f":"IF(Dateneingabe!C91=0,\"zzz\",Dateneingabe!C91)","v":"zzz"},{"$f":"IF($D$3<$E$1,\"<?\",IF($D$3>$NF$1,\">?\",LOOKUP($D$3,$E$1:$NF$1,E89:NF89)))","v":0},null,null,null,null,null,null,null,null,null,null,null,null,null,null,null,null,null,null,null,null,null,null,null,null,null,null,null,null,null,null,null,null,null,null,null,null,null,null,null,null,null,null,null,null,null,null,null,null,null,null,null,null,null,null,null,null,null,null,null,null,null,null,null,null,null,null,null,null,null,null,null,null,null,null,null,null,null,null,null,null,null,null,null,null,null,null,null,null,null,null,null,null,null,null,null,null,null,null,null,null,null,null,null,null,null,null,null,null,null,null,null,null,null,null,null,null,null,null,null,null,null,null,null,null,null,null,null,null,null,null,null,null,null,null,null,null,null,null,null,null,null,null,null,null,null,null,null,null,null,null,null,null,null,null,null,null,null,null,null,null,null,null,null,null,null,null,null,null,null,null,null,null,null,null,null,null,null,null,null,null,null,null,null,null,null,null,null,null,null,null,null,null,null,null,null,null,null,null,null,null,null,null,null,null,null,null,null,null,null,null,null,null,null,null,null,null,null,null,null,null,null,null,null,null,null,null,null,null,null,null,null,null,null,null,null,null,null,null,null,null,null,null,null,null,null,null,null,null,null,null,null,null,null,null,null,null,null,null,null,null,null,null,null,null,null,null,null,null,null,null,null,null,null,null,null,null,null,null,null,null,null,null,null,null,null,null,null,null,null,null,null,null,null,null,null,null,null,null,null,null,null,null,null,null,null,null,null,null,null,null,null,null,null,null,null,null,null,null,null,null,null,null,null,null,null,null,null,null,null,null,null,null,null,null,null,null,null,null,null,null,null,null,null,null,null,null,null,null,null,null,null,null,null,null,null,null,null,null,null,null,null,null,null,null,null,null,null,{"$f":"Dateneingabe!N91","v":85},null,{"$f":"Dateneingabe!K91","v":0},{"$f":"Dateneingabe!L91","v":0},{"$f":"Dateneingabe!M91","v":0},{"$f":"COUNTIFS(E89:NF89,\"U\")","v":0},{"$f":"NL89-NM89","v":0}]
[{"$f":"IF(Dateneingabe!A92=0,\"zzz\",Dateneingabe!A92)","v":"zzz"},{"$f":"IF(Dateneingabe!B92=0,\"zzz\",Dateneingabe!B92)","v":"zzz"},{"$f":"IF(Dateneingabe!C92=0,\"zzz\",Dateneingabe!C92)","v":"zzz"},{"$f":"IF($D$3<$E$1,\"<?\",IF($D$3>$NF$1,\">?\",LOOKUP($D$3,$E$1:$NF$1,E90:NF90)))","v":0},null,null,null,null,null,null,null,null,null,null,null,null,null,null,null,null,null,null,null,null,null,null,null,null,null,null,null,null,null,null,null,null,null,null,null,null,null,null,null,null,null,null,null,null,null,null,null,null,null,null,null,null,null,null,null,null,null,null,null,null,null,null,null,null,null,null,null,null,null,null,null,null,null,null,null,null,null,null,null,null,null,null,null,null,null,null,null,null,null,null,null,null,null,null,null,null,null,null,null,null,null,null,null,null,null,null,null,null,null,null,null,null,null,null,null,null,null,null,null,null,null,null,null,null,null,null,null,null,null,null,null,null,null,null,null,null,null,null,null,null,null,null,null,null,null,null,null,null,null,null,null,null,null,null,null,null,null,null,null,null,null,null,null,null,null,null,null,null,null,null,null,null,null,null,null,null,null,null,null,null,null,null,null,null,null,null,null,null,null,null,null,null,null,null,null,null,null,null,null,null,null,null,null,null,null,null,null,null,null,null,null,null,null,null,null,null,null,null,null,null,null,null,null,null,null,null,null,null,null,null,null,null,null,null,null,null,null,null,null,null,null,null,null,null,null,null,null,null,null,null,null,null,null,null,null,null,null,null,null,null,null,null,null,null,null,null,null,null,null,null,null,null,null,null,null,null,null,null,null,null,null,null,null,null,null,null,null,null,null,null,null,null,null,null,null,null,null,null,null,null,null,null,null,null,null,null,null,null,null,null,null,null,null,null,null,null,null,null,null,null,null,null,null,null,null,null,null,null,null,null,null,null,null,null,null,null,null,null,null,null,null,null,null,null,null,null,null,null,null,null,null,null,null,null,null,null,null,null,null,null,null,null,null,null,null,null,null,{"$f":"Dateneingabe!N92","v":86},null,{"$f":"Dateneingabe!K92","v":0},{"$f":"Dateneingabe!L92","v":0},{"$f":"Dateneingabe!M92","v":0},{"$f":"COUNTIFS(E90:NF90,\"U\")","v":0},{"$f":"NL90-NM90","v":0}]
[{"$f":"IF(Dateneingabe!A93=0,\"zzz\",Dateneingabe!A93)","v":"zzz"},{"$f":"IF(Dateneingabe!B93=0,\"zzz\",Dateneingabe!B93)","v":"zzz"},{"$f":"IF(Dateneingabe!C93=0,\"zzz\",Dateneingabe!C93)","v":"zzz"},{"$f":"IF($D$3<$E$1,\"<?\",IF($D$3>$NF$1,\">?\",LOOKUP($D$3,$E$1:$NF$1,E91:NF91)))","v":0},null,null,null,null,null,null,null,null,null,null,null,null,null,null,null,null,null,null,null,null,null,null,null,null,null,null,null,null,null,null,null,null,null,null,null,null,null,null,null,null,null,null,null,null,null,null,null,null,null,null,null,null,null,null,null,null,null,null,null,null,null,null,null,null,null,null,null,null,null,null,null,null,null,null,null,null,null,null,null,null,null,null,null,null,null,null,null,null,null,null,null,null,null,null,null,null,null,null,null,null,null,null,null,null,null,null,null,null,null,null,null,null,null,null,null,null,null,null,null,null,null,null,null,null,null,null,null,null,null,null,null,null,null,null,null,null,null,null,null,null,null,null,null,null,null,null,null,null,null,null,null,null,null,null,null,null,null,null,null,null,null,null,null,null,null,null,null,null,null,null,null,null,null,null,null,null,null,null,null,null,null,null,null,null,null,null,null,null,null,null,null,null,null,null,null,null,null,null,null,null,null,null,null,null,null,null,null,null,null,null,null,null,null,null,null,null,null,null,null,null,null,null,null,null,null,null,null,null,null,null,null,null,null,null,null,null,null,null,null,null,null,null,null,null,null,null,null,null,null,null,null,null,null,null,null,null,null,null,null,null,null,null,null,null,null,null,null,null,null,null,null,null,null,null,null,null,null,null,null,null,null,null,null,null,null,null,null,null,null,null,null,null,null,null,null,null,null,null,null,null,null,null,null,null,null,null,null,null,null,null,null,null,null,null,null,null,null,null,null,null,null,null,null,null,null,null,null,null,null,null,null,null,null,null,null,null,null,null,null,null,null,null,null,null,null,null,null,null,null,null,null,null,null,null,null,null,null,null,null,null,null,null,null,null,null,null,null,{"$f":"Dateneingabe!N93","v":87},null,{"$f":"Dateneingabe!K93","v":0},{"$f":"Dateneingabe!L93","v":0},{"$f":"Dateneingabe!M93","v":0},{"$f":"COUNTIFS(E91:NF91,\"U\")","v":0},{"$f":"NL91-NM91","v":0}]
[{"$f":"IF(Dateneingabe!A94=0,\"zzz\",Dateneingabe!A94)","v":"zzz"},{"$f":"IF(Dateneingabe!B94=0,\"zzz\",Dateneingabe!B94)","v":"zzz"},{"$f":"IF(Dateneingabe!C94=0,\"zzz\",Dateneingabe!C94)","v":"zzz"},{"$f":"IF($D$3<$E$1,\"<?\",IF($D$3>$NF$1,\">?\",LOOKUP($D$3,$E$1:$NF$1,E92:NF92)))","v":0},null,null,null,null,null,null,null,null,null,null,null,null,null,null,null,null,null,null,null,null,null,null,null,null,null,null,null,null,null,null,null,null,null,null,null,null,null,null,null,null,null,null,null,null,null,null,null,null,null,null,null,null,null,null,null,null,null,null,null,null,null,null,null,null,null,null,null,null,null,null,null,null,null,null,null,null,null,null,null,null,null,null,null,null,null,null,null,null,null,null,null,null,null,null,null,null,null,null,null,null,null,null,null,null,null,null,null,null,null,null,null,null,null,null,null,null,null,null,null,null,null,null,null,null,null,null,null,null,null,null,null,null,null,null,null,null,null,null,null,null,null,null,null,null,null,null,null,null,null,null,null,null,null,null,null,null,null,null,null,null,null,null,null,null,null,null,null,null,null,null,null,null,null,null,null,null,null,null,null,null,null,null,null,null,null,null,null,null,null,null,null,null,null,null,null,null,null,null,null,null,null,null,null,null,null,null,null,null,null,null,null,null,null,null,null,null,null,null,null,null,null,null,null,null,null,null,null,null,null,null,null,null,null,null,null,null,null,null,null,null,null,null,null,null,null,null,null,null,null,null,null,null,null,null,null,null,null,null,null,null,null,null,null,null,null,null,null,null,null,null,null,null,null,null,null,null,null,null,null,null,null,null,null,null,null,null,null,null,null,null,null,null,null,null,null,null,null,null,null,null,null,null,null,null,null,null,null,null,null,null,null,null,null,null,null,null,null,null,null,null,null,null,null,null,null,null,null,null,null,null,null,null,null,null,null,null,null,null,null,null,null,null,null,null,null,null,null,null,null,null,null,null,null,null,null,null,null,null,null,null,null,null,null,null,null,null,null,{"$f":"Dateneingabe!N94","v":88},null,{"$f":"Dateneingabe!K94","v":0},{"$f":"Dateneingabe!L94","v":0},{"$f":"Dateneingabe!M94","v":0},{"$f":"COUNTIFS(E92:NF92,\"U\")","v":0},{"$f":"NL92-NM92","v":0}]
[{"$f":"IF(Dateneingabe!A95=0,\"zzz\",Dateneingabe!A95)","v":"zzz"},{"$f":"IF(Dateneingabe!B95=0,\"zzz\",Dateneingabe!B95)","v":"zzz"},{"$f":"IF(Dateneingabe!C95=0,\"zzz\",Dateneingabe!C95)","v":"zzz"},{"$f":"IF($D$3<$E$1,\"<?\",IF($D$3>$NF$1,\">?\",LOOKUP($D$3,$E$1:$NF$1,E93:NF93)))","v":0},null,null,null,null,null,null,null,null,null,null,null,null,null,null,null,null,null,null,null,null,null,null,null,null,null,null,null,null,null,null,null,null,null,null,null,null,null,null,null,null,null,null,null,null,null,null,null,null,null,null,null,null,null,null,null,null,null,null,null,null,null,null,null,null,null,null,null,null,null,null,null,null,null,null,null,null,null,null,null,null,null,null,null,null,null,null,null,null,null,null,null,null,null,null,null,null,null,null,null,null,null,null,null,null,null,null,null,null,null,null,null,null,null,null,null,null,null,null,null,null,null,null,null,null,null,null,null,null,null,null,null,null,null,null,null,null,null,null,null,null,null,null,null,null,null,null,null,null,null,null,null,null,null,null,null,null,null,null,null,null,null,null,null,null,null,null,null,null,null,null,null,null,null,null,null,null,null,null,null,null,null,null,null,null,null,null,null,null,null,null,null,null,null,null,null,null,null,null,null,null,null,null,null,null,null,null,null,null,null,null,null,null,null,null,null,null,null,null,null,null,null,null,null,null,null,null,null,null,null,null,null,null,null,null,null,null,null,null,null,null,null,null,null,null,null,null,null,null,null,null,null,null,null,null,null,null,null,null,null,null,null,null,null,null,null,null,null,null,null,null,null,null,null,null,null,null,null,null,null,null,null,null,null,null,null,null,null,null,null,null,null,null,null,null,null,null,null,null,null,null,null,null,null,null,null,null,null,null,null,null,null,null,null,null,null,null,null,null,null,null,null,null,null,null,null,null,null,null,null,null,null,null,null,null,null,null,null,null,null,null,null,null,null,null,null,null,null,null,null,null,null,null,null,null,null,null,null,null,null,null,null,null,null,null,null,null,null,{"$f":"Dateneingabe!N95","v":89},null,{"$f":"Dateneingabe!K95","v":0},{"$f":"Dateneingabe!L95","v":0},{"$f":"Dateneingabe!M95","v":0},{"$f":"COUNTIFS(E93:NF93,\"U\")","v":0},{"$f":"NL93-NM93","v":0}]
[{"$f":"IF(Dateneingabe!A96=0,\"zzz\",Dateneingabe!A96)","v":"zzz"},{"$f":"IF(Dateneingabe!B96=0,\"zzz\",Dateneingabe!B96)","v":"zzz"},{"$f":"IF(Dateneingabe!C96=0,\"zzz\",Dateneingabe!C96)","v":"zzz"},{"$f":"IF($D$3<$E$1,\"<?\",IF($D$3>$NF$1,\">?\",LOOKUP($D$3,$E$1:$NF$1,E94:NF94)))","v":0},null,null,null,null,null,null,null,null,null,null,null,null,null,null,null,null,null,null,null,null,null,null,null,null,null,null,null,null,null,null,null,null,null,null,null,null,null,null,null,null,null,null,null,null,null,null,null,null,null,null,null,null,null,null,null,null,null,null,null,null,null,null,null,null,null,null,null,null,null,null,null,null,null,null,null,null,null,null,null,null,null,null,null,null,null,null,null,null,null,null,null,null,null,null,null,null,null,null,null,null,null,null,null,null,null,null,null,null,null,null,null,null,null,null,null,null,null,null,null,null,null,null,null,null,null,null,null,null,null,null,null,null,null,null,null,null,null,null,null,null,null,null,null,null,null,null,null,null,null,null,null,null,null,null,null,null,null,null,null,null,null,null,null,null,null,null,null,null,null,null,null,null,null,null,null,null,null,null,null,null,null,null,null,null,null,null,null,null,null,null,null,null,null,null,null,null,null,null,null,null,null,null,null,null,null,null,null,null,null,null,null,null,null,null,null,null,null,null,null,null,null,null,null,null,null,null,null,null,null,null,null,null,null,null,null,null,null,null,null,null,null,null,null,null,null,null,null,null,null,null,null,null,null,null,null,null,null,null,null,null,null,null,null,null,null,null,null,null,null,null,null,null,null,null,null,null,null,null,null,null,null,null,null,null,null,null,null,null,null,null,null,null,null,null,null,null,null,null,null,null,null,null,null,null,null,null,null,null,null,null,null,null,null,null,null,null,null,null,null,null,null,null,null,null,null,null,null,null,null,null,null,null,null,null,null,null,null,null,null,null,null,null,null,null,null,null,null,null,null,null,null,null,null,null,null,null,null,null,null,null,null,null,null,null,null,null,null,{"$f":"Dateneingabe!N96","v":90},null,{"$f":"Dateneingabe!K96","v":0},{"$f":"Dateneingabe!L96","v":0},{"$f":"Dateneingabe!M96","v":0},{"$f":"COUNTIFS(E94:NF94,\"U\")","v":0},{"$f":"NL94-NM94","v":0}]
[{"$f":"IF(Dateneingabe!A97=0,\"zzz\",Dateneingabe!A97)","v":"zzz"},{"$f":"IF(Dateneingabe!B97=0,\"zzz\",Dateneingabe!B97)","v":"zzz"},{"$f":"IF(Dateneingabe!C97=0,\"zzz\",Dateneingabe!C97)","v":"zzz"},{"$f":"IF($D$3<$E$1,\"<?\",IF($D$3>$NF$1,\">?\",LOOKUP($D$3,$E$1:$NF$1,E95:NF95)))","v":0},null,null,null,null,null,null,null,null,null,null,null,null,null,null,null,null,null,null,null,null,null,null,null,null,null,null,null,null,null,null,null,null,null,null,null,null,null,null,null,null,null,null,null,null,null,null,null,null,null,null,null,null,null,null,null,null,null,null,null,null,null,null,null,null,null,null,null,null,null,null,null,null,null,null,null,null,null,null,null,null,null,null,null,null,null,null,null,null,null,null,null,null,null,null,null,null,null,null,null,null,null,null,null,null,null,null,null,null,null,null,null,null,null,null,null,null,null,null,null,null,null,null,null,null,null,null,null,null,null,null,null,null,null,null,null,null,null,null,null,null,null,null,null,null,null,null,null,null,null,null,null,null,null,null,null,null,null,null,null,null,null,null,null,null,null,null,null,null,null,null,null,null,null,null,null,null,null,null,null,null,null,null,null,null,null,null,null,null,null,null,null,null,null,null,null,null,null,null,null,null,null,null,null,null,null,null,null,null,null,null,null,null,null,null,null,null,null,null,null,null,null,null,null,null,null,null,null,null,null,null,null,null,null,null,null,null,null,null,null,null,null,null,null,null,null,null,null,null,null,null,null,null,null,null,null,null,null,null,null,null,null,null,null,null,null,null,null,null,null,null,null,null,null,null,null,null,null,null,null,null,null,null,null,null,null,null,null,null,null,null,null,null,null,null,null,null,null,null,null,null,null,null,null,null,null,null,null,null,null,null,null,null,null,null,null,null,null,null,null,null,null,null,null,null,null,null,null,null,null,null,null,null,null,null,null,null,null,null,null,null,null,null,null,null,null,null,null,null,null,null,null,null,null,null,null,null,null,null,null,null,null,null,null,null,null,null,null,{"$f":"Dateneingabe!N97","v":91},null,{"$f":"Dateneingabe!K97","v":0},{"$f":"Dateneingabe!L97","v":0},{"$f":"Dateneingabe!M97","v":0},{"$f":"COUNTIFS(E95:NF95,\"U\")","v":0},{"$f":"NL95-NM95","v":0}]
[{"$f":"IF(Dateneingabe!A98=0,\"zzz\",Dateneingabe!A98)","v":"zzz"},{"$f":"IF(Dateneingabe!B98=0,\"zzz\",Dateneingabe!B98)","v":"zzz"},{"$f":"IF(Dateneingabe!C98=0,\"zzz\",Dateneingabe!C98)","v":"zzz"},{"$f":"IF($D$3<$E$1,\"<?\",IF($D$3>$NF$1,\">?\",LOOKUP($D$3,$E$1:$NF$1,E96:NF96)))","v":0},null,null,null,null,null,null,null,null,null,null,null,null,null,null,null,null,null,null,null,null,null,null,null,null,null,null,null,null,null,null,null,null,null,null,null,null,null,null,null,null,null,null,null,null,null,null,null,null,null,null,null,null,null,null,null,null,null,null,null,null,null,null,null,null,null,null,null,null,null,null,null,null,null,null,null,null,null,null,null,null,null,null,null,null,null,null,null,null,null,null,null,null,null,null,null,null,null,null,null,null,null,null,null,null,null,null,null,null,null,null,null,null,null,null,null,null,null,null,null,null,null,null,null,null,null,null,null,null,null,null,null,null,null,null,null,null,null,null,null,null,null,null,null,null,null,null,null,null,null,null,null,null,null,null,null,null,null,null,null,null,null,null,null,null,null,null,null,null,null,null,null,null,null,null,null,null,null,null,null,null,null,null,null,null,null,null,null,null,null,null,null,null,null,null,null,null,null,null,null,null,null,null,null,null,null,null,null,null,null,null,null,null,null,null,null,null,null,null,null,null,null,null,null,null,null,null,null,null,null,null,null,null,null,null,null,null,null,null,null,null,null,null,null,null,null,null,null,null,null,null,null,null,null,null,null,null,null,null,null,null,null,null,null,null,null,null,null,null,null,null,null,null,null,null,null,null,null,null,null,null,null,null,null,null,null,null,null,null,null,null,null,null,null,null,null,null,null,null,null,null,null,null,null,null,null,null,null,null,null,null,null,null,null,null,null,null,null,null,null,null,null,null,null,null,null,null,null,null,null,null,null,null,null,null,null,null,null,null,null,null,null,null,null,null,null,null,null,null,null,null,null,null,null,null,null,null,null,null,null,null,null,null,null,null,null,null,null,{"$f":"Dateneingabe!N98","v":92},null,{"$f":"Dateneingabe!K98","v":0},{"$f":"Dateneingabe!L98","v":0},{"$f":"Dateneingabe!M98","v":0},{"$f":"COUNTIFS(E96:NF96,\"U\")","v":0},{"$f":"NL96-NM96","v":0}]
[{"$f":"IF(Dateneingabe!A99=0,\"zzz\",Dateneingabe!A99)","v":"zzz"},{"$f":"IF(Dateneingabe!B99=0,\"zzz\",Dateneingabe!B99)","v":"zzz"},{"$f":"IF(Dateneingabe!C99=0,\"zzz\",Dateneingabe!C99)","v":"zzz"},{"$f":"IF($D$3<$E$1,\"<?\",IF($D$3>$NF$1,\">?\",LOOKUP($D$3,$E$1:$NF$1,E97:NF97)))","v":0},null,null,null,null,null,null,null,null,null,null,null,null,null,null,null,null,null,null,null,null,null,null,null,null,null,null,null,null,null,null,null,null,null,null,null,null,null,null,null,null,null,null,null,null,null,null,null,null,null,null,null,null,null,null,null,null,null,null,null,null,null,null,null,null,null,null,null,null,null,null,null,null,null,null,null,null,null,null,null,null,null,null,null,null,null,null,null,null,null,null,null,null,null,null,null,null,null,null,null,null,null,null,null,null,null,null,null,null,null,null,null,null,null,null,null,null,null,null,null,null,null,null,null,null,null,null,null,null,null,null,null,null,null,null,null,null,null,null,null,null,null,null,null,null,null,null,null,null,null,null,null,null,null,null,null,null,null,null,null,null,null,null,null,null,null,null,null,null,null,null,null,null,null,null,null,null,null,null,null,null,null,null,null,null,null,null,null,null,null,null,null,null,null,null,null,null,null,null,null,null,null,null,null,null,null,null,null,null,null,null,null,null,null,null,null,null,null,null,null,null,null,null,null,null,null,null,null,null,null,null,null,null,null,null,null,null,null,null,null,null,null,null,null,null,null,null,null,null,null,null,null,null,null,null,null,null,null,null,null,null,null,null,null,null,null,null,null,null,null,null,null,null,null,null,null,null,null,null,null,null,null,null,null,null,null,null,null,null,null,null,null,null,null,null,null,null,null,null,null,null,null,null,null,null,null,null,null,null,null,null,null,null,null,null,null,null,null,null,null,null,null,null,null,null,null,null,null,null,null,null,null,null,null,null,null,null,null,null,null,null,null,null,null,null,null,null,null,null,null,null,null,null,null,null,null,null,null,null,null,null,null,null,null,null,null,null,null,{"$f":"Dateneingabe!N99","v":93},null,{"$f":"Dateneingabe!K99","v":0},{"$f":"Dateneingabe!L99","v":0},{"$f":"Dateneingabe!M99","v":0},{"$f":"COUNTIFS(E97:NF97,\"U\")","v":0},{"$f":"NL97-NM97","v":0}]
[{"$f":"IF(Dateneingabe!A100=0,\"zzz\",Dateneingabe!A100)","v":"zzz"},{"$f":"IF(Dateneingabe!B100=0,\"zzz\",Dateneingabe!B100)","v":"zzz"},{"$f":"IF(Dateneingabe!C100=0,\"zzz\",Dateneingabe!C100)","v":"zzz"},{"$f":"IF($D$3<$E$1,\"<?\",IF($D$3>$NF$1,\">?\",LOOKUP($D$3,$E$1:$NF$1,E98:NF98)))","v":0},null,null,null,null,null,null,null,null,null,null,null,null,null,null,null,null,null,null,null,null,null,null,null,null,null,null,null,null,null,null,null,null,null,null,null,null,null,null,null,null,null,null,null,null,null,null,null,null,null,null,null,null,null,null,null,null,null,null,null,null,null,null,null,null,null,null,null,null,null,null,null,null,null,null,null,null,null,null,null,null,null,null,null,null,null,null,null,null,null,null,null,null,null,null,null,null,null,null,null,null,null,null,null,null,null,null,null,null,null,null,null,null,null,null,null,null,null,null,null,null,null,null,null,null,null,null,null,null,null,null,null,null,null,null,null,null,null,null,null,null,null,null,null,null,null,null,null,null,null,null,null,null,null,null,null,null,null,null,null,null,null,null,null,null,null,null,null,null,null,null,null,null,null,null,null,null,null,null,null,null,null,null,null,null,null,null,null,null,null,null,null,null,null,null,null,null,null,null,null,null,null,null,null,null,null,null,null,null,null,null,null,null,null,null,null,null,null,null,null,null,null,null,null,null,null,null,null,null,null,null,null,null,null,null,null,null,null,null,null,null,null,null,null,null,null,null,null,null,null,null,null,null,null,null,null,null,null,null,null,null,null,null,null,null,null,null,null,null,null,null,null,null,null,null,null,null,null,null,null,null,null,null,null,null,null,null,null,null,null,null,null,null,null,null,null,null,null,null,null,null,null,null,null,null,null,null,null,null,null,null,null,null,null,null,null,null,null,null,null,null,null,null,null,null,null,null,null,null,null,null,null,null,null,null,null,null,null,null,null,null,null,null,null,null,null,null,null,null,null,null,null,null,null,null,null,null,null,null,null,null,null,null,null,null,null,null,null,{"$f":"Dateneingabe!N100","v":94},null,{"$f":"Dateneingabe!K100","v":0},{"$f":"Dateneingabe!L100","v":0},{"$f":"Dateneingabe!M100","v":0},{"$f":"COUNTIFS(E98:NF98,\"U\")","v":0},{"$f":"NL98-NM98","v":0}]
[{"$f":"IF(Dateneingabe!A101=0,\"zzz\",Dateneingabe!A101)","v":"zzz"},{"$f":"IF(Dateneingabe!B101=0,\"zzz\",Dateneingabe!B101)","v":"zzz"},{"$f":"IF(Dateneingabe!C101=0,\"zzz\",Dateneingabe!C101)","v":"zzz"},{"$f":"IF($D$3<$E$1,\"<?\",IF($D$3>$NF$1,\">?\",LOOKUP($D$3,$E$1:$NF$1,E99:NF99)))","v":0},null,null,null,null,null,null,null,null,null,null,null,null,null,null,null,null,null,null,null,null,null,null,null,null,null,null,null,null,null,null,null,null,null,null,null,null,null,null,null,null,null,null,null,null,null,null,null,null,null,null,null,null,null,null,null,null,null,null,null,null,null,null,null,null,null,null,null,null,null,null,null,null,null,null,null,null,null,null,null,null,null,null,null,null,null,null,null,null,null,null,null,null,null,null,null,null,null,null,null,null,null,null,null,null,null,null,null,null,null,null,null,null,null,null,null,null,null,null,null,null,null,null,null,null,null,null,null,null,null,null,null,null,null,null,null,null,null,null,null,null,null,null,null,null,null,null,null,null,null,null,null,null,null,null,null,null,null,null,null,null,null,null,null,null,null,null,null,null,null,null,null,null,null,null,null,null,null,null,null,null,null,null,null,null,null,null,null,null,null,null,null,null,null,null,null,null,null,null,null,null,null,null,null,null,null,null,null,null,null,null,null,null,null,null,null,null,null,null,null,null,null,null,null,null,null,null,null,null,null,null,null,null,null,null,null,null,null,null,null,null,null,null,null,null,null,null,null,null,null,null,null,null,null,null,null,null,null,null,null,null,null,null,null,null,null,null,null,null,null,null,null,null,null,null,null,null,null,null,null,null,null,null,null,null,null,null,null,null,null,null,null,null,null,null,null,null,null,null,null,null,null,null,null,null,null,null,null,null,null,null,null,null,null,null,null,null,null,null,null,null,null,null,null,null,null,null,null,null,null,null,null,null,null,null,null,null,null,null,null,null,null,null,null,null,null,null,null,null,null,null,null,null,null,null,null,null,null,null,null,null,null,null,null,null,null,null,null,{"$f":"Dateneingabe!N101","v":95},null,{"$f":"Dateneingabe!K101","v":0},{"$f":"Dateneingabe!L101","v":0},{"$f":"Dateneingabe!M101","v":0},{"$f":"COUNTIFS(E99:NF99,\"U\")","v":0},{"$f":"NL99-NM99","v":0}]
[{"$f":"IF(Dateneingabe!A102=0,\"zzz\",Dateneingabe!A102)","v":"zzz"},{"$f":"IF(Dateneingabe!B102=0,\"zzz\",Dateneingabe!B102)","v":"zzz"},{"$f":"IF(Dateneingabe!C102=0,\"zzz\",Dateneingabe!C102)","v":"zzz"},{"$f":"IF($D$3<$E$1,\"<?\",IF($D$3>$NF$1,\">?\",LOOKUP($D$3,$E$1:$NF$1,E100:NF100)))","v":0},null,null,null,null,null,null,null,null,null,null,null,null,null,null,null,null,null,null,null,null,null,null,null,null,null,null,null,null,null,null,null,null,null,null,null,null,null,null,null,null,null,null,null,null,null,null,null,null,null,null,null,null,null,null,null,null,null,null,null,null,null,null,null,null,null,null,null,null,null,null,null,null,null,null,null,null,null,null,null,null,null,null,null,null,null,null,null,null,null,null,null,null,null,null,null,null,null,null,null,null,null,null,null,null,null,null,null,null,null,null,null,null,null,null,null,null,null,null,null,null,null,null,null,null,null,null,null,null,null,null,null,null,null,null,null,null,null,null,null,null,null,null,null,null,null,null,null,null,null,null,null,null,null,null,null,null,null,null,null,null,null,null,null,null,null,null,null,null,null,null,null,null,null,null,null,null,null,null,null,null,null,null,null,null,null,null,null,null,null,null,null,null,null,null,null,null,null,null,null,null,null,null,null,null,null,null,null,null,null,null,null,null,null,null,null,null,null,null,null,null,null,null,null,null,null,null,null,null,null,null,null,null,null,null,null,null,null,null,null,null,null,null,null,null,null,null,null,null,null,null,null,null,null,null,null,null,null,null,null,null,null,null,null,null,null,null,null,null,null,null,null,null,null,null,null,null,null,null,null,null,null,null,null,null,null,null,null,null,null,null,null,null,null,null,null,null,null,null,null,null,null,null,null,null,null,null,null,null,null,null,null,null,null,null,null,null,null,null,null,null,null,null,null,null,null,null,null,null,null,null,null,null,null,null,null,null,null,null,null,null,null,null,null,null,null,null,null,null,null,null,null,null,null,null,null,null,null,null,null,null,null,null,null,null,null,null,null,{"$f":"Dateneingabe!N102","v":96},null,{"$f":"Dateneingabe!K102","v":0},{"$f":"Dateneingabe!L102","v":0},{"$f":"Dateneingabe!M102","v":0},{"$f":"COUNTIFS(E100:NF100,\"U\")","v":0},{"$f":"NL100-NM100","v":0}]
[{"$f":"IF(Dateneingabe!A103=0,\"zzz\",Dateneingabe!A103)","v":"zzz"},{"$f":"IF(Dateneingabe!B103=0,\"zzz\",Dateneingabe!B103)","v":"zzz"},{"$f":"IF(Dateneingabe!C103=0,\"zzz\",Dateneingabe!C103)","v":"zzz"},{"$f":"IF($D$3<$E$1,\"<?\",IF($D$3>$NF$1,\">?\",LOOKUP($D$3,$E$1:$NF$1,E101:NF101)))","v":0},null,null,null,null,null,null,null,null,null,null,null,null,null,null,null,null,null,null,null,null,null,null,null,null,null,null,null,null,null,null,null,null,null,null,null,null,null,null,null,null,null,null,null,null,null,null,null,null,null,null,null,null,null,null,null,null,null,null,null,null,null,null,null,null,null,null,null,null,null,null,null,null,null,null,null,null,null,null,null,null,null,null,null,null,null,null,null,null,null,null,null,null,null,null,null,null,null,null,null,null,null,null,null,null,null,null,null,null,null,null,null,null,null,null,null,null,null,null,null,null,null,null,null,null,null,null,null,null,null,null,null,null,null,null,null,null,null,null,null,null,null,null,null,null,null,null,null,null,null,null,null,null,null,null,null,null,null,null,null,null,null,null,null,null,null,null,null,null,null,null,null,null,null,null,null,null,null,null,null,null,null,null,null,null,null,null,null,null,null,null,null,null,null,null,null,null,null,null,null,null,null,null,null,null,null,null,null,null,null,null,null,null,null,null,null,null,null,null,null,null,null,null,null,null,null,null,null,null,null,null,null,null,null,null,null,null,null,null,null,null,null,null,null,null,null,null,null,null,null,null,null,null,null,null,null,null,null,null,null,null,null,null,null,null,null,null,null,null,null,null,null,null,null,null,null,null,null,null,null,null,null,null,null,null,null,null,null,null,null,null,null,null,null,null,null,null,null,null,null,null,null,null,null,null,null,null,null,null,null,null,null,null,null,null,null,null,null,null,null,null,null,null,null,null,null,null,null,null,null,null,null,null,null,null,null,null,null,null,null,null,null,null,null,null,null,null,null,null,null,null,null,null,null,null,null,null,null,null,null,null,null,null,null,null,null,null,null,{"$f":"Dateneingabe!N103","v":97},null,{"$f":"Dateneingabe!K103","v":0},{"$f":"Dateneingabe!L103","v":0},{"$f":"Dateneingabe!M103","v":0},{"$f":"COUNTIFS(E101:NF101,\"U\")","v":0},{"$f":"NL101-NM101","v":0}]
[{"$f":"IF(Dateneingabe!A104=0,\"zzz\",Dateneingabe!A104)","v":"zzz"},{"$f":"IF(Dateneingabe!B104=0,\"zzz\",Dateneingabe!B104)","v":"zzz"},{"$f":"IF(Dateneingabe!C104=0,\"zzz\",Dateneingabe!C104)","v":"zzz"},{"$f":"IF($D$3<$E$1,\"<?\",IF($D$3>$NF$1,\">?\",LOOKUP($D$3,$E$1:$NF$1,E102:NF102)))","v":0},null,null,null,null,null,null,null,null,null,null,null,null,null,null,null,null,null,null,null,null,null,null,null,null,null,null,null,null,null,null,null,null,null,null,null,null,null,null,null,null,null,null,null,null,null,null,null,null,null,null,null,null,null,null,null,null,null,null,null,null,null,null,null,null,null,null,null,null,null,null,null,null,null,null,null,null,null,null,null,null,null,null,null,null,null,null,null,null,null,null,null,null,null,null,null,null,null,null,null,null,null,null,null,null,null,null,null,null,null,null,null,null,null,null,null,null,null,null,null,null,null,null,null,null,null,null,null,null,null,null,null,null,null,null,null,null,null,null,null,null,null,null,null,null,null,null,null,null,null,null,null,null,null,null,null,null,null,null,null,null,null,null,null,null,null,null,null,null,null,null,null,null,null,null,null,null,null,null,null,null,null,null,null,null,null,null,null,null,null,null,null,null,null,null,null,null,null,null,null,null,null,null,null,null,null,null,null,null,null,null,null,null,null,null,null,null,null,null,null,null,null,null,null,null,null,null,null,null,null,null,null,null,null,null,null,null,null,null,null,null,null,null,null,null,null,null,null,null,null,null,null,null,null,null,null,null,null,null,null,null,null,null,null,null,null,null,null,null,null,null,null,null,null,null,null,null,null,null,null,null,null,null,null,null,null,null,null,null,null,null,null,null,null,null,null,null,null,null,null,null,null,null,null,null,null,null,null,null,null,null,null,null,null,null,null,null,null,null,null,null,null,null,null,null,null,null,null,null,null,null,null,null,null,null,null,null,null,null,null,null,null,null,null,null,null,null,null,null,null,null,null,null,null,null,null,null,null,null,null,null,null,null,null,null,null,null,null,{"$f":"Dateneingabe!N104","v":98},null,{"$f":"Dateneingabe!K104","v":0},{"$f":"Dateneingabe!L104","v":0},{"$f":"Dateneingabe!M104","v":0},{"$f":"COUNTIFS(E102:NF102,\"U\")","v":0},{"$f":"NL102-NM102","v":0}]
[{"$f":"IF(Dateneingabe!A105=0,\"zzz\",Dateneingabe!A105)","v":"zzz"},{"$f":"IF(Dateneingabe!B105=0,\"zzz\",Dateneingabe!B105)","v":"zzz"},{"$f":"IF(Dateneingabe!C105=0,\"zzz\",Dateneingabe!C105)","v":"zzz"},{"$f":"IF($D$3<$E$1,\"<?\",IF($D$3>$NF$1,\">?\",LOOKUP($D$3,$E$1:$NF$1,E103:NF103)))","v":0},null,null,null,null,null,null,null,null,null,null,null,null,null,null,null,null,null,null,null,null,null,null,null,null,null,null,null,null,null,null,null,null,null,null,null,null,null,null,null,null,null,null,null,null,null,null,null,null,null,null,null,null,null,null,null,null,null,null,null,null,null,null,null,null,null,null,null,null,null,null,null,null,null,null,null,null,null,null,null,null,null,null,null,null,null,null,null,null,null,null,null,null,null,null,null,null,null,null,null,null,null,null,null,null,null,null,null,null,null,null,null,null,null,null,null,null,null,null,null,null,null,null,null,null,null,null,null,null,null,null,null,null,null,null,null,null,null,null,null,null,null,null,null,null,null,null,null,null,null,null,null,null,null,null,null,null,null,null,null,null,null,null,null,null,null,null,null,null,null,null,null,null,null,null,null,null,null,null,null,null,null,null,null,null,null,null,null,null,null,null,null,null,null,null,null,null,null,null,null,null,null,null,null,null,null,null,null,null,null,null,null,null,null,null,null,null,null,null,null,null,null,null,null,null,null,null,null,null,null,null,null,null,null,null,null,null,null,null,null,null,null,null,null,null,null,null,null,null,null,null,null,null,null,null,null,null,null,null,null,null,null,null,null,null,null,null,null,null,null,null,null,null,null,null,null,null,null,null,null,null,null,null,null,null,null,null,null,null,null,null,null,null,null,null,null,null,null,null,null,null,null,null,null,null,null,null,null,null,null,null,null,null,null,null,null,null,null,null,null,null,null,null,null,null,null,null,null,null,null,null,null,null,null,null,null,null,null,null,null,null,null,null,null,null,null,null,null,null,null,null,null,null,null,null,null,null,null,null,null,null,null,null,null,null,null,null,null,{"$f":"Dateneingabe!N105","v":99},null,{"$f":"Dateneingabe!K105","v":0},{"$f":"Dateneingabe!L105","v":0},{"$f":"Dateneingabe!M105","v":0},{"$f":"COUNTIFS(E103:NF103,\"U\")","v":0},{"$f":"NL103-NM103","v":0}]
[{"$f":"IF(Dateneingabe!A106=0,\"zzz\",Dateneingabe!A106)","v":"zzz"},{"$f":"IF(Dateneingabe!B106=0,\"zzz\",Dateneingabe!B106)","v":"zzz"},{"$f":"IF(Dateneingabe!C106=0,\"zzz\",Dateneingabe!C106)","v":"zzz"},{"$f":"IF($D$3<$E$1,\"<?\",IF($D$3>$NF$1,\">?\",LOOKUP($D$3,$E$1:$NF$1,E104:NF104)))","v":0},null,null,null,null,null,null,null,null,null,null,null,null,null,null,null,null,null,null,null,null,null,null,null,null,null,null,null,null,null,null,null,null,null,null,null,null,null,null,null,null,null,null,null,null,null,null,null,null,null,null,null,null,null,null,null,null,null,null,null,null,null,null,null,null,null,null,null,null,null,null,null,null,null,null,null,null,null,null,null,null,null,null,null,null,null,null,null,null,null,null,null,null,null,null,null,null,null,null,null,null,null,null,null,null,null,null,null,null,null,null,null,null,null,null,null,null,null,null,null,null,null,null,null,null,null,null,null,null,null,null,null,null,null,null,null,null,null,null,null,null,null,null,null,null,null,null,null,null,null,null,null,null,null,null,null,null,null,null,null,null,null,null,null,null,null,null,null,null,null,null,null,null,null,null,null,null,null,null,null,null,null,null,null,null,null,null,null,null,null,null,null,null,null,null,null,null,null,null,null,null,null,null,null,null,null,null,null,null,null,null,null,null,null,null,null,null,null,null,null,null,null,null,null,null,null,null,null,null,null,null,null,null,null,null,null,null,null,null,null,null,null,null,null,null,null,null,null,null,null,null,null,null,null,null,null,null,null,null,null,null,null,null,null,null,null,null,null,null,null,null,null,null,null,null,null,null,null,null,null,null,null,null,null,null,null,null,null,null,null,null,null,null,null,null,null,null,null,null,null,null,null,null,null,null,null,null,null,null,null,null,null,null,null,null,null,null,null,null,null,null,null,null,null,null,null,null,null,null,null,null,null,null,null,null,null,null,null,null,null,null,null,null,null,null,null,null,null,null,null,null,null,null,null,null,null,null,null,null,null,null,null,null,null,null,null,null,null,{"$f":"Dateneingabe!N106","v":100},null,{"$f":"Dateneingabe!K106","v":0},{"$f":"Dateneingabe!L106","v":0},{"$f":"Dateneingabe!M106","v":0},{"$f":"COUNTIFS(E104:NF104,\"U\")","v":0},{"$f":"NL104-NM104","v":0}]
[{"$f":"IF(Dateneingabe!A107=0,\"zzz\",Dateneingabe!A107)","v":"zzz"},{"$f":"IF(Dateneingabe!B107=0,\"zzz\",Dateneingabe!B107)","v":"zzz"},{"$f":"IF(Dateneingabe!C107=0,\"zzz\",Dateneingabe!C107)","v":"zzz"},{"$f":"IF($D$3<$E$1,\"<?\",IF($D$3>$NF$1,\">?\",LOOKUP($D$3,$E$1:$NF$1,E105:NF105)))","v":0},null,null,null,null,null,null,null,null,null,null,null,null,null,null,null,null,null,null,null,null,null,null,null,null,null,null,null,null,null,null,null,null,null,null,null,null,null,null,null,null,null,null,null,null,null,null,null,null,null,null,null,null,null,null,null,null,null,null,null,null,null,null,null,null,null,null,null,null,null,null,null,null,null,null,null,null,null,null,null,null,null,null,null,null,null,null,null,null,null,null,null,null,null,null,null,null,null,null,null,null,null,null,null,null,null,null,null,null,null,null,null,null,null,null,null,null,null,null,null,null,null,null,null,null,null,null,null,null,null,null,null,null,null,null,null,null,null,null,null,null,null,null,null,null,null,null,null,null,null,null,null,null,null,null,null,null,null,null,null,null,null,null,null,null,null,null,null,null,null,null,null,null,null,null,null,null,null,null,null,null,null,null,null,null,null,null,null,null,null,null,null,null,null,null,null,null,null,null,null,null,null,null,null,null,null,null,null,null,null,null,null,null,null,null,null,null,null,null,null,null,null,null,null,null,null,null,null,null,null,null,null,null,null,null,null,null,null,null,null,null,null,null,null,null,null,null,null,null,null,null,null,null,null,null,null,null,null,null,null,null,null,null,null,null,null,null,null,null,null,null,null,null,null,null,null,null,null,null,null,null,null,null,null,null,null,null,null,null,null,null,null,null,null,null,null,null,null,null,null,null,null,null,null,null,null,null,null,null,null,null,null,null,null,null,null,null,null,null,null,null,null,null,null,null,null,null,null,null,null,null,null,null,null,null,null,null,null,null,null,null,null,null,null,null,null,null,null,null,null,null,null,null,null,null,null,null,null,null,null,null,null,null,null,null,null,null,null,{"$f":"Dateneingabe!N107","v":101},null,{"$f":"Dateneingabe!K107","v":0},{"$f":"Dateneingabe!L107","v":0},{"$f":"Dateneingabe!M107","v":0},{"$f":"COUNTIFS(E105:NF105,\"U\")","v":0},{"$f":"NL105-NM105","v":0}]
[{"$f":"IF(Dateneingabe!A108=0,\"zzz\",Dateneingabe!A108)","v":"zzz"},{"$f":"IF(Dateneingabe!B108=0,\"zzz\",Dateneingabe!B108)","v":"zzz"},{"$f":"IF(Dateneingabe!C108=0,\"zzz\",Dateneingabe!C108)","v":"zzz"},{"$f":"IF($D$3<$E$1,\"<?\",IF($D$3>$NF$1,\">?\",LOOKUP($D$3,$E$1:$NF$1,E106:NF106)))","v":0},null,null,null,null,null,null,null,null,null,null,null,null,null,null,null,null,null,null,null,null,null,null,null,null,null,null,null,null,null,null,null,null,null,null,null,null,null,null,null,null,null,null,null,null,null,null,null,null,null,null,null,null,null,null,null,null,null,null,null,null,null,null,null,null,null,null,null,null,null,null,null,null,null,null,null,null,null,null,null,null,null,null,null,null,null,null,null,null,null,null,null,null,null,null,null,null,null,null,null,null,null,null,null,null,null,null,null,null,null,null,null,null,null,null,null,null,null,null,null,null,null,null,null,null,null,null,null,null,null,null,null,null,null,null,null,null,null,null,null,null,null,null,null,null,null,null,null,null,null,null,null,null,null,null,null,null,null,null,null,null,null,null,null,null,null,null,null,null,null,null,null,null,null,null,null,null,null,null,null,null,null,null,null,null,null,null,null,null,null,null,null,null,null,null,null,null,null,null,null,null,null,null,null,null,null,null,null,null,null,null,null,null,null,null,null,null,null,null,null,null,null,null,null,null,null,null,null,null,null,null,null,null,null,null,null,null,null,null,null,null,null,null,null,null,null,null,null,null,null,null,null,null,null,null,null,null,null,null,null,null,null,null,null,null,null,null,null,null,null,null,null,null,null,null,null,null,null,null,null,null,null,null,null,null,null,null,null,null,null,null,null,null,null,null,null,null,null,null,null,null,null,null,null,null,null,null,null,null,null,null,null,null,null,null,null,null,null,null,null,null,null,null,null,null,null,null,null,null,null,null,null,null,null,null,null,null,null,null,null,null,null,null,null,null,null,null,null,null,null,null,null,null,null,null,null,null,null,null,null,null,null,null,null,null,null,null,null,{"$f":"Dateneingabe!N108","v":102},null,{"$f":"Dateneingabe!K108","v":0},{"$f":"Dateneingabe!L108","v":0},{"$f":"Dateneingabe!M108","v":0},{"$f":"COUNTIFS(E106:NF106,\"U\")","v":0},{"$f":"NL106-NM106","v":0}]
[{"$f":"IF(Dateneingabe!A109=0,\"zzz\",Dateneingabe!A109)","v":"zzz"},{"$f":"IF(Dateneingabe!B109=0,\"zzz\",Dateneingabe!B109)","v":"zzz"},{"$f":"IF(Dateneingabe!C109=0,\"zzz\",Dateneingabe!C109)","v":"zzz"},{"$f":"IF($D$3<$E$1,\"<?\",IF($D$3>$NF$1,\">?\",LOOKUP($D$3,$E$1:$NF$1,E107:NF107)))","v":0},null,null,null,null,null,null,null,null,null,null,null,null,null,null,null,null,null,null,null,null,null,null,null,null,null,null,null,null,null,null,null,null,null,null,null,null,null,null,null,null,null,null,null,null,null,null,null,null,null,null,null,null,null,null,null,null,null,null,null,null,null,null,null,null,null,null,null,null,null,null,null,null,null,null,null,null,null,null,null,null,null,null,null,null,null,null,null,null,null,null,null,null,null,null,null,null,null,null,null,null,null,null,null,null,null,null,null,null,null,null,null,null,null,null,null,null,null,null,null,null,null,null,null,null,null,null,null,null,null,null,null,null,null,null,null,null,null,null,null,null,null,null,null,null,null,null,null,null,null,null,null,null,null,null,null,null,null,null,null,null,null,null,null,null,null,null,null,null,null,null,null,null,null,null,null,null,null,null,null,null,null,null,null,null,null,null,null,null,null,null,null,null,null,null,null,null,null,null,null,null,null,null,null,null,null,null,null,null,null,null,null,null,null,null,null,null,null,null,null,null,null,null,null,null,null,null,null,null,null,null,null,null,null,null,null,null,null,null,null,null,null,null,null,null,null,null,null,null,null,null,null,null,null,null,null,null,null,null,null,null,null,null,null,null,null,null,null,null,null,null,null,null,null,null,null,null,null,null,null,null,null,null,null,null,null,null,null,null,null,null,null,null,null,null,null,null,null,null,null,null,null,null,null,null,null,null,null,null,null,null,null,null,null,null,null,null,null,null,null,null,null,null,null,null,null,null,null,null,null,null,null,null,null,null,null,null,null,null,null,null,null,null,null,null,null,null,null,null,null,null,null,null,null,null,null,null,null,null,null,null,null,null,null,null,null,null,null,{"$f":"Dateneingabe!N109","v":103},null,{"$f":"Dateneingabe!K109","v":0},{"$f":"Dateneingabe!L109","v":0},{"$f":"Dateneingabe!M109","v":0},{"$f":"COUNTIFS(E107:NF107,\"U\")","v":0},{"$f":"NL107-NM107","v":0}]
[{"$f":"IF(Dateneingabe!A110=0,\"zzz\",Dateneingabe!A110)","v":"zzz"},{"$f":"IF(Dateneingabe!B110=0,\"zzz\",Dateneingabe!B110)","v":"zzz"},{"$f":"IF(Dateneingabe!C110=0,\"zzz\",Dateneingabe!C110)","v":"zzz"},{"$f":"IF($D$3<$E$1,\"<?\",IF($D$3>$NF$1,\">?\",LOOKUP($D$3,$E$1:$NF$1,E108:NF108)))","v":0},null,null,null,null,null,null,null,null,null,null,null,null,null,null,null,null,null,null,null,null,null,null,null,null,null,null,null,null,null,null,null,null,null,null,null,null,null,null,null,null,null,null,null,null,null,null,null,null,null,null,null,null,null,null,null,null,null,null,null,null,null,null,null,null,null,null,null,null,null,null,null,null,null,null,null,null,null,null,null,null,null,null,null,null,null,null,null,null,null,null,null,null,null,null,null,null,null,null,null,null,null,null,null,null,null,null,null,null,null,null,null,null,null,null,null,null,null,null,null,null,null,null,null,null,null,null,null,null,null,null,null,null,null,null,null,null,null,null,null,null,null,null,null,null,null,null,null,null,null,null,null,null,null,null,null,null,null,null,null,null,null,null,null,null,null,null,null,null,null,null,null,null,null,null,null,null,null,null,null,null,null,null,null,null,null,null,null,null,null,null,null,null,null,null,null,null,null,null,null,null,null,null,null,null,null,null,null,null,null,null,null,null,null,null,null,null,null,null,null,null,null,null,null,null,null,null,null,null,null,null,null,null,null,null,null,null,null,null,null,null,null,null,null,null,null,null,null,null,null,null,null,null,null,null,null,null,null,null,null,null,null,null,null,null,null,null,null,null,null,null,null,null,null,null,null,null,null,null,null,null,null,null,null,null,null,null,null,null,null,null,null,null,null,null,null,null,null,null,null,null,null,null,null,null,null,null,null,null,null,null,null,null,null,null,null,null,null,null,null,null,null,null,null,null,null,null,null,null,null,null,null,null,null,null,null,null,null,null,null,null,null,null,null,null,null,null,null,null,null,null,null,null,null,null,null,null,null,null,null,null,null,null,null,null,null,null,null,{"$f":"Dateneingabe!N110","v":104},null,{"$f":"Dateneingabe!K110","v":0},{"$f":"Dateneingabe!L110","v":0},{"$f":"Dateneingabe!M110","v":0},{"$f":"COUNTIFS(E108:NF108,\"U\")","v":0},{"$f":"NL108-NM108","v":0}]
[{"$f":"IF(Dateneingabe!A111=0,\"zzz\",Dateneingabe!A111)","v":"zzz"},{"$f":"IF(Dateneingabe!B111=0,\"zzz\",Dateneingabe!B111)","v":"zzz"},{"$f":"IF(Dateneingabe!C111=0,\"zzz\",Dateneingabe!C111)","v":"zzz"},{"$f":"IF($D$3<$E$1,\"<?\",IF($D$3>$NF$1,\">?\",LOOKUP($D$3,$E$1:$NF$1,E109:NF109)))","v":0},null,null,null,null,null,null,null,null,null,null,null,null,null,null,null,null,null,null,null,null,null,null,null,null,null,null,null,null,null,null,null,null,null,null,null,null,null,null,null,null,null,null,null,null,null,null,null,null,null,null,null,null,null,null,null,null,null,null,null,null,null,null,null,null,null,null,null,null,null,null,null,null,null,null,null,null,null,null,null,null,null,null,null,null,null,null,null,null,null,null,null,null,null,null,null,null,null,null,null,null,null,null,null,null,null,null,null,null,null,null,null,null,null,null,null,null,null,null,null,null,null,null,null,null,null,null,null,null,null,null,null,null,null,null,null,null,null,null,null,null,null,null,null,null,null,null,null,null,null,null,null,null,null,null,null,null,null,null,null,null,null,null,null,null,null,null,null,null,null,null,null,null,null,null,null,null,null,null,null,null,null,null,null,null,null,null,null,null,null,null,null,null,null,null,null,null,null,null,null,null,null,null,null,null,null,null,null,null,null,null,null,null,null,null,null,null,null,null,null,null,null,null,null,null,null,null,null,null,null,null,null,null,null,null,null,null,null,null,null,null,null,null,null,null,null,null,null,null,null,null,null,null,null,null,null,null,null,null,null,null,null,null,null,null,null,null,null,null,null,null,null,null,null,null,null,null,null,null,null,null,null,null,null,null,null,null,null,null,null,null,null,null,null,null,null,null,null,null,null,null,null,null,null,null,null,null,null,null,null,null,null,null,null,null,null,null,null,null,null,null,null,null,null,null,null,null,null,null,null,null,null,null,null,null,null,null,null,null,null,null,null,null,null,null,null,null,null,null,null,null,null,null,null,null,null,null,null,null,null,null,null,null,null,null,null,null,null,{"$f":"Dateneingabe!N111","v":105},null,{"$f":"Dateneingabe!K111","v":0},{"$f":"Dateneingabe!L111","v":0},{"$f":"Dateneingabe!M111","v":0},{"$f":"COUNTIFS(E109:NF109,\"U\")","v":0},{"$f":"NL109-NM109","v":0}]
[{"$f":"IF(Dateneingabe!A112=0,\"zzz\",Dateneingabe!A112)","v":"zzz"},{"$f":"IF(Dateneingabe!B112=0,\"zzz\",Dateneingabe!B112)","v":"zzz"},{"$f":"IF(Dateneingabe!C112=0,\"zzz\",Dateneingabe!C112)","v":"zzz"},{"$f":"IF($D$3<$E$1,\"<?\",IF($D$3>$NF$1,\">?\",LOOKUP($D$3,$E$1:$NF$1,E110:NF110)))","v":0},null,null,null,null,null,null,null,null,null,null,null,null,null,null,null,null,null,null,null,null,null,null,null,null,null,null,null,null,null,null,null,null,null,null,null,null,null,null,null,null,null,null,null,null,null,null,null,null,null,null,null,null,null,null,null,null,null,null,null,null,null,null,null,null,null,null,null,null,null,null,null,null,null,null,null,null,null,null,null,null,null,null,null,null,null,null,null,null,null,null,null,null,null,null,null,null,null,null,null,null,null,null,null,null,null,null,null,null,null,null,null,null,null,null,null,null,null,null,null,null,null,null,null,null,null,null,null,null,null,null,null,null,null,null,null,null,null,null,null,null,null,null,null,null,null,null,null,null,null,null,null,null,null,null,null,null,null,null,null,null,null,null,null,null,null,null,null,null,null,null,null,null,null,null,null,null,null,null,null,null,null,null,null,null,null,null,null,null,null,null,null,null,null,null,null,null,null,null,null,null,null,null,null,null,null,null,null,null,null,null,null,null,null,null,null,null,null,null,null,null,null,null,null,null,null,null,null,null,null,null,null,null,null,null,null,null,null,null,null,null,null,null,null,null,null,null,null,null,null,null,null,null,null,null,null,null,null,null,null,null,null,null,null,null,null,null,null,null,null,null,null,null,null,null,null,null,null,null,null,null,null,null,null,null,null,null,null,null,null,null,null,null,null,null,null,null,null,null,null,null,null,null,null,null,null,null,null,null,null,null,null,null,null,null,null,null,null,null,null,null,null,null,null,null,null,null,null,null,null,null,null,null,null,null,null,null,null,null,null,null,null,null,null,null,null,null,null,null,null,null,null,null,null,null,null,null,null,null,null,null,null,null,null,null,null,null,null,{"$f":"Dateneingabe!N112","v":106},null,{"$f":"Dateneingabe!K112","v":0},{"$f":"Dateneingabe!L112","v":0},{"$f":"Dateneingabe!M112","v":0},{"$f":"COUNTIFS(E110:NF110,\"U\")","v":0},{"$f":"NL110-NM110","v":0}]
[{"$f":"IF(Dateneingabe!A113=0,\"zzz\",Dateneingabe!A113)","v":"zzz"},{"$f":"IF(Dateneingabe!B113=0,\"zzz\",Dateneingabe!B113)","v":"zzz"},{"$f":"IF(Dateneingabe!C113=0,\"zzz\",Dateneingabe!C113)","v":"zzz"},{"$f":"IF($D$3<$E$1,\"<?\",IF($D$3>$NF$1,\">?\",LOOKUP($D$3,$E$1:$NF$1,E111:NF111)))","v":0},null,null,null,null,null,null,null,null,null,null,null,null,null,null,null,null,null,null,null,null,null,null,null,null,null,null,null,null,null,null,null,null,null,null,null,null,null,null,null,null,null,null,null,null,null,null,null,null,null,null,null,null,null,null,null,null,null,null,null,null,null,null,null,null,null,null,null,null,null,null,null,null,null,null,null,null,null,null,null,null,null,null,null,null,null,null,null,null,null,null,null,null,null,null,null,null,null,null,null,null,null,null,null,null,null,null,null,null,null,null,null,null,null,null,null,null,null,null,null,null,null,null,null,null,null,null,null,null,null,null,null,null,null,null,null,null,null,null,null,null,null,null,null,null,null,null,null,null,null,null,null,null,null,null,null,null,null,null,null,null,null,null,null,null,null,null,null,null,null,null,null,null,null,null,null,null,null,null,null,null,null,null,null,null,null,null,null,null,null,null,null,null,null,null,null,null,null,null,null,null,null,null,null,null,null,null,null,null,null,null,null,null,null,null,null,null,null,null,null,null,null,null,null,null,null,null,null,null,null,null,null,null,null,null,null,null,null,null,null,null,null,null,null,null,null,null,null,null,null,null,null,null,null,null,null,null,null,null,null,null,null,null,null,null,null,null,null,null,null,null,null,null,null,null,null,null,null,null,null,null,null,null,null,null,null,null,null,null,null,null,null,null,null,null,null,null,null,null,null,null,null,null,null,null,null,null,null,null,null,null,null,null,null,null,null,null,null,null,null,null,null,null,null,null,null,null,null,null,null,null,null,null,null,null,null,null,null,null,null,null,null,null,null,null,null,null,null,null,null,null,null,null,null,null,null,null,null,null,null,null,null,null,null,null,null,null,null,{"$f":"Dateneingabe!N113","v":107},null,{"$f":"Dateneingabe!K113","v":0},{"$f":"Dateneingabe!L113","v":0},{"$f":"Dateneingabe!M113","v":0},{"$f":"COUNTIFS(E111:NF111,\"U\")","v":0},{"$f":"NL111-NM111","v":0}]
[{"$f":"IF(Dateneingabe!A114=0,\"zzz\",Dateneingabe!A114)","v":"zzz"},{"$f":"IF(Dateneingabe!B114=0,\"zzz\",Dateneingabe!B114)","v":"zzz"},{"$f":"IF(Dateneingabe!C114=0,\"zzz\",Dateneingabe!C114)","v":"zzz"},{"$f":"IF($D$3<$E$1,\"<?\",IF($D$3>$NF$1,\">?\",LOOKUP($D$3,$E$1:$NF$1,E112:NF112)))","v":0},null,null,null,null,null,null,null,null,null,null,null,null,null,null,null,null,null,null,null,null,null,null,null,null,null,null,null,null,null,null,null,null,null,null,null,null,null,null,null,null,null,null,null,null,null,null,null,null,null,null,null,null,null,null,null,null,null,null,null,null,null,null,null,null,null,null,null,null,null,null,null,null,null,null,null,null,null,null,null,null,null,null,null,null,null,null,null,null,null,null,null,null,null,null,null,null,null,null,null,null,null,null,null,null,null,null,null,null,null,null,null,null,null,null,null,null,null,null,null,null,null,null,null,null,null,null,null,null,null,null,null,null,null,null,null,null,null,null,null,null,null,null,null,null,null,null,null,null,null,null,null,null,null,null,null,null,null,null,null,null,null,null,null,null,null,null,null,null,null,null,null,null,null,null,null,null,null,null,null,null,null,null,null,null,null,null,null,null,null,null,null,null,null,null,null,null,null,null,null,null,null,null,null,null,null,null,null,null,null,null,null,null,null,null,null,null,null,null,null,null,null,null,null,null,null,null,null,null,null,null,null,null,null,null,null,null,null,null,null,null,null,null,null,null,null,null,null,null,null,null,null,null,null,null,null,null,null,null,null,null,null,null,null,null,null,null,null,null,null,null,null,null,null,null,null,null,null,null,null,null,null,null,null,null,null,null,null,null,null,null,null,null,null,null,null,null,null,null,null,null,null,null,null,null,null,null,null,null,null,null,null,null,null,null,null,null,null,null,null,null,null,null,null,null,null,null,null,null,null,null,null,null,null,null,null,null,null,null,null,null,null,null,null,null,null,null,null,null,null,null,null,null,null,null,null,null,null,null,null,null,null,null,null,null,null,null,null,{"$f":"Dateneingabe!N114","v":108},null,{"$f":"Dateneingabe!K114","v":0},{"$f":"Dateneingabe!L114","v":0},{"$f":"Dateneingabe!M114","v":0},{"$f":"COUNTIFS(E112:NF112,\"U\")","v":0},{"$f":"NL112-NM112","v":0}]
[{"$f":"IF(Dateneingabe!A115=0,\"zzz\",Dateneingabe!A115)","v":"zzz"},{"$f":"IF(Dateneingabe!B115=0,\"zzz\",Dateneingabe!B115)","v":"zzz"},{"$f":"IF(Dateneingabe!C115=0,\"zzz\",Dateneingabe!C115)","v":"zzz"},{"$f":"IF($D$3<$E$1,\"<?\",IF($D$3>$NF$1,\">?\",LOOKUP($D$3,$E$1:$NF$1,E113:NF113)))","v":0},null,null,null,null,null,null,null,null,null,null,null,null,null,null,null,null,null,null,null,null,null,null,null,null,null,null,null,null,null,null,null,null,null,null,null,null,null,null,null,null,null,null,null,null,null,null,null,null,null,null,null,null,null,null,null,null,null,null,null,null,null,null,null,null,null,null,null,null,null,null,null,null,null,null,null,null,null,null,null,null,null,null,null,null,null,null,null,null,null,null,null,null,null,null,null,null,null,null,null,null,null,null,null,null,null,null,null,null,null,null,null,null,null,null,null,null,null,null,null,null,null,null,null,null,null,null,null,null,null,null,null,null,null,null,null,null,null,null,null,null,null,null,null,null,null,null,null,null,null,null,null,null,null,null,null,null,null,null,null,null,null,null,null,null,null,null,null,null,null,null,null,null,null,null,null,null,null,null,null,null,null,null,null,null,null,null,null,null,null,null,null,null,null,null,null,null,null,null,null,null,null,null,null,null,null,null,null,null,null,null,null,null,null,null,null,null,null,null,null,null,null,null,null,null,null,null,null,null,null,null,null,null,null,null,null,null,null,null,null,null,null,null,null,null,null,null,null,null,null,null,null,null,null,null,null,null,null,null,null,null,null,null,null,null,null,null,null,null,null,null,null,null,null,null,null,null,null,null,null,null,null,null,null,null,null,null,null,null,null,null,null,null,null,null,null,null,null,null,null,null,null,null,null,null,null,null,null,null,null,null,null,null,null,null,null,null,null,null,null,null,null,null,null,null,null,null,null,null,null,null,null,null,null,null,null,null,null,null,null,null,null,null,null,null,null,null,null,null,null,null,null,null,null,null,null,null,null,null,null,null,null,null,null,null,null,null,null,{"$f":"Dateneingabe!N115","v":109},null,{"$f":"Dateneingabe!K115","v":0},{"$f":"Dateneingabe!L115","v":0},{"$f":"Dateneingabe!M115","v":0},{"$f":"COUNTIFS(E113:NF113,\"U\")","v":0},{"$f":"NL113-NM113","v":0}]
[{"$f":"IF(Dateneingabe!A116=0,\"zzz\",Dateneingabe!A116)","v":"zzz"},{"$f":"IF(Dateneingabe!B116=0,\"zzz\",Dateneingabe!B116)","v":"zzz"},{"$f":"IF(Dateneingabe!C116=0,\"zzz\",Dateneingabe!C116)","v":"zzz"},{"$f":"IF($D$3<$E$1,\"<?\",IF($D$3>$NF$1,\">?\",LOOKUP($D$3,$E$1:$NF$1,E114:NF114)))","v":0},null,null,null,null,null,null,null,null,null,null,null,null,null,null,null,null,null,null,null,null,null,null,null,null,null,null,null,null,null,null,null,null,null,null,null,null,null,null,null,null,null,null,null,null,null,null,null,null,null,null,null,null,null,null,null,null,null,null,null,null,null,null,null,null,null,null,null,null,null,null,null,null,null,null,null,null,null,null,null,null,null,null,null,null,null,null,null,null,null,null,null,null,null,null,null,null,null,null,null,null,null,null,null,null,null,null,null,null,null,null,null,null,null,null,null,null,null,null,null,null,null,null,null,null,null,null,null,null,null,null,null,null,null,null,null,null,null,null,null,null,null,null,null,null,null,null,null,null,null,null,null,null,null,null,null,null,null,null,null,null,null,null,null,null,null,null,null,null,null,null,null,null,null,null,null,null,null,null,null,null,null,null,null,null,null,null,null,null,null,null,null,null,null,null,null,null,null,null,null,null,null,null,null,null,null,null,null,null,null,null,null,null,null,null,null,null,null,null,null,null,null,null,null,null,null,null,null,null,null,null,null,null,null,null,null,null,null,null,null,null,null,null,null,null,null,null,null,null,null,null,null,null,null,null,null,null,null,null,null,null,null,null,null,null,null,null,null,null,null,null,null,null,null,null,null,null,null,null,null,null,null,null,null,null,null,null,null,null,null,null,null,null,null,null,null,null,null,null,null,null,null,null,null,null,null,null,null,null,null,null,null,null,null,null,null,null,null,null,null,null,null,null,null,null,null,null,null,null,null,null,null,null,null,null,null,null,null,null,null,null,null,null,null,null,null,null,null,null,null,null,null,null,null,null,null,null,null,null,null,null,null,null,null,null,null,null,null,{"$f":"Dateneingabe!N116","v":110},null,{"$f":"Dateneingabe!K116","v":0},{"$f":"Dateneingabe!L116","v":0},{"$f":"Dateneingabe!M116","v":0},{"$f":"COUNTIFS(E114:NF114,\"U\")","v":0},{"$f":"NL114-NM114","v":0}]
[{"$f":"IF(Dateneingabe!A117=0,\"zzz\",Dateneingabe!A117)","v":"zzz"},{"$f":"IF(Dateneingabe!B117=0,\"zzz\",Dateneingabe!B117)","v":"zzz"},{"$f":"IF(Dateneingabe!C117=0,\"zzz\",Dateneingabe!C117)","v":"zzz"},{"$f":"IF($D$3<$E$1,\"<?\",IF($D$3>$NF$1,\">?\",LOOKUP($D$3,$E$1:$NF$1,E115:NF115)))","v":0},null,null,null,null,null,null,null,null,null,null,null,null,null,null,null,null,null,null,null,null,null,null,null,null,null,null,null,null,null,null,null,null,null,null,null,null,null,null,null,null,null,null,null,null,null,null,null,null,null,null,null,null,null,null,null,null,null,null,null,null,null,null,null,null,null,null,null,null,null,null,null,null,null,null,null,null,null,null,null,null,null,null,null,null,null,null,null,null,null,null,null,null,null,null,null,null,null,null,null,null,null,null,null,null,null,null,null,null,null,null,null,null,null,null,null,null,null,null,null,null,null,null,null,null,null,null,null,null,null,null,null,null,null,null,null,null,null,null,null,null,null,null,null,null,null,null,null,null,null,null,null,null,null,null,null,null,null,null,null,null,null,null,null,null,null,null,null,null,null,null,null,null,null,null,null,null,null,null,null,null,null,null,null,null,null,null,null,null,null,null,null,null,null,null,null,null,null,null,null,null,null,null,null,null,null,null,null,null,null,null,null,null,null,null,null,null,null,null,null,null,null,null,null,null,null,null,null,null,null,null,null,null,null,null,null,null,null,null,null,null,null,null,null,null,null,null,null,null,null,null,null,null,null,null,null,null,null,null,null,null,null,null,null,null,null,null,null,null,null,null,null,null,null,null,null,null,null,null,null,null,null,null,null,null,null,null,null,null,null,null,null,null,null,null,null,null,null,null,null,null,null,null,null,null,null,null,null,null,null,null,null,null,null,null,null,null,null,null,null,null,null,null,null,null,null,null,null,null,null,null,null,null,null,null,null,null,null,null,null,null,null,null,null,null,null,null,null,null,null,null,null,null,null,null,null,null,null,null,null,null,null,null,null,null,null,null,null,{"$f":"Dateneingabe!N117","v":111},null,{"$f":"Dateneingabe!K117","v":0},{"$f":"Dateneingabe!L117","v":0},{"$f":"Dateneingabe!M117","v":0},{"$f":"COUNTIFS(E115:NF115,\"U\")","v":0},{"$f":"NL115-NM115","v":0}]
[{"$f":"IF(Dateneingabe!A118=0,\"zzz\",Dateneingabe!A118)","v":"zzz"},{"$f":"IF(Dateneingabe!B118=0,\"zzz\",Dateneingabe!B118)","v":"zzz"},{"$f":"IF(Dateneingabe!C118=0,\"zzz\",Dateneingabe!C118)","v":"zzz"},{"$f":"IF($D$3<$E$1,\"<?\",IF($D$3>$NF$1,\">?\",LOOKUP($D$3,$E$1:$NF$1,E116:NF116)))","v":0},null,null,null,null,null,null,null,null,null,null,null,null,null,null,null,null,null,null,null,null,null,null,null,null,null,null,null,null,null,null,null,null,null,null,null,null,null,null,null,null,null,null,null,null,null,null,null,null,null,null,null,null,null,null,null,null,null,null,null,null,null,null,null,null,null,null,null,null,null,null,null,null,null,null,null,null,null,null,null,null,null,null,null,null,null,null,null,null,null,null,null,null,null,null,null,null,null,null,null,null,null,null,null,null,null,null,null,null,null,null,null,null,null,null,null,null,null,null,null,null,null,null,null,null,null,null,null,null,null,null,null,null,null,null,null,null,null,null,null,null,null,null,null,null,null,null,null,null,null,null,null,null,null,null,null,null,null,null,null,null,null,null,null,null,null,null,null,null,null,null,null,null,null,null,null,null,null,null,null,null,null,null,null,null,null,null,null,null,null,null,null,null,null,null,null,null,null,null,null,null,null,null,null,null,null,null,null,null,null,null,null,null,null,null,null,null,null,null,null,null,null,null,null,null,null,null,null,null,null,null,null,null,null,null,null,null,null,null,null,null,null,null,null,null,null,null,null,null,null,null,null,null,null,null,null,null,null,null,null,null,null,null,null,null,null,null,null,null,null,null,null,null,null,null,null,null,null,null,null,null,null,null,null,null,null,null,null,null,null,null,null,null,null,null,null,null,null,null,null,null,null,null,null,null,null,null,null,null,null,null,null,null,null,null,null,null,null,null,null,null,null,null,null,null,null,null,null,null,null,null,null,null,null,null,null,null,null,null,null,null,null,null,null,null,null,null,null,null,null,null,null,null,null,null,null,null,null,null,null,null,null,null,null,null,null,null,null,{"$f":"Dateneingabe!N118","v":112},null,{"$f":"Dateneingabe!K118","v":0},{"$f":"Dateneingabe!L118","v":0},{"$f":"Dateneingabe!M118","v":0},{"$f":"COUNTIFS(E116:NF116,\"U\")","v":0},{"$f":"NL116-NM116","v":0}]
[{"$f":"IF(Dateneingabe!A119=0,\"zzz\",Dateneingabe!A119)","v":"zzz"},{"$f":"IF(Dateneingabe!B119=0,\"zzz\",Dateneingabe!B119)","v":"zzz"},{"$f":"IF(Dateneingabe!C119=0,\"zzz\",Dateneingabe!C119)","v":"zzz"},{"$f":"IF($D$3<$E$1,\"<?\",IF($D$3>$NF$1,\">?\",LOOKUP($D$3,$E$1:$NF$1,E117:NF117)))","v":0},null,null,null,null,null,null,null,null,null,null,null,null,null,null,null,null,null,null,null,null,null,null,null,null,null,null,null,null,null,null,null,null,null,null,null,null,null,null,null,null,null,null,null,null,null,null,null,null,null,null,null,null,null,null,null,null,null,null,null,null,null,null,null,null,null,null,null,null,null,null,null,null,null,null,null,null,null,null,null,null,null,null,null,null,null,null,null,null,null,null,null,null,null,null,null,null,null,null,null,null,null,null,null,null,null,null,null,null,null,null,null,null,null,null,null,null,null,null,null,null,null,null,null,null,null,null,null,null,null,null,null,null,null,null,null,null,null,null,null,null,null,null,null,null,null,null,null,null,null,null,null,null,null,null,null,null,null,null,null,null,null,null,null,null,null,null,null,null,null,null,null,null,null,null,null,null,null,null,null,null,null,null,null,null,null,null,null,null,null,null,null,null,null,null,null,null,null,null,null,null,null,null,null,null,null,null,null,null,null,null,null,null,null,null,null,null,null,null,null,null,null,null,null,null,null,null,null,null,null,null,null,null,null,null,null,null,null,null,null,null,null,null,null,null,null,null,null,null,null,null,null,null,null,null,null,null,null,null,null,null,null,null,null,null,null,null,null,null,null,null,null,null,null,null,null,null,null,null,null,null,null,null,null,null,null,null,null,null,null,null,null,null,null,null,null,null,null,null,null,null,null,null,null,null,null,null,null,null,null,null,null,null,null,null,null,null,null,null,null,null,null,null,null,null,null,null,null,null,null,null,null,null,null,null,null,null,null,null,null,null,null,null,null,null,null,null,null,null,null,null,null,null,null,null,null,null,null,null,null,null,null,null,null,null,null,null,null,{"$f":"Dateneingabe!N119","v":113},null,{"$f":"Dateneingabe!K119","v":0},{"$f":"Dateneingabe!L119","v":0},{"$f":"Dateneingabe!M119","v":0},{"$f":"COUNTIFS(E117:NF117,\"U\")","v":0},{"$f":"NL117-NM117","v":0}]
[{"$f":"IF(Dateneingabe!A120=0,\"zzz\",Dateneingabe!A120)","v":"zzz"},{"$f":"IF(Dateneingabe!B120=0,\"zzz\",Dateneingabe!B120)","v":"zzz"},{"$f":"IF(Dateneingabe!C120=0,\"zzz\",Dateneingabe!C120)","v":"zzz"},{"$f":"IF($D$3<$E$1,\"<?\",IF($D$3>$NF$1,\">?\",LOOKUP($D$3,$E$1:$NF$1,E118:NF118)))","v":0},null,null,null,null,null,null,null,null,null,null,null,null,null,null,null,null,null,null,null,null,null,null,null,null,null,null,null,null,null,null,null,null,null,null,null,null,null,null,null,null,null,null,null,null,null,null,null,null,null,null,null,null,null,null,null,null,null,null,null,null,null,null,null,null,null,null,null,null,null,null,null,null,null,null,null,null,null,null,null,null,null,null,null,null,null,null,null,null,null,null,null,null,null,null,null,null,null,null,null,null,null,null,null,null,null,null,null,null,null,null,null,null,null,null,null,null,null,null,null,null,null,null,null,null,null,null,null,null,null,null,null,null,null,null,null,null,null,null,null,null,null,null,null,null,null,null,null,null,null,null,null,null,null,null,null,null,null,null,null,null,null,null,null,null,null,null,null,null,null,null,null,null,null,null,null,null,null,null,null,null,null,null,null,null,null,null,null,null,null,null,null,null,null,null,null,null,null,null,null,null,null,null,null,null,null,null,null,null,null,null,null,null,null,null,null,null,null,null,null,null,null,null,null,null,null,null,null,null,null,null,null,null,null,null,null,null,null,null,null,null,null,null,null,null,null,null,null,null,null,null,null,null,null,null,null,null,null,null,null,null,null,null,null,null,null,null,null,null,null,null,null,null,null,null,null,null,null,null,null,null,null,null,null,null,null,null,null,null,null,null,null,null,null,null,null,null,null,null,null,null,null,null,null,null,null,null,null,null,null,null,null,null,null,null,null,null,null,null,null,null,null,null,null,null,null,null,null,null,null,null,null,null,null,null,null,null,null,null,null,null,null,null,null,null,null,null,null,null,null,null,null,null,null,null,null,null,null,null,null,null,null,null,null,null,null,null,null,{"$f":"Dateneingabe!N120","v":114},null,{"$f":"Dateneingabe!K120","v":0},{"$f":"Dateneingabe!L120","v":0},{"$f":"Dateneingabe!M120","v":0},{"$f":"COUNTIFS(E118:NF118,\"U\")","v":0},{"$f":"NL118-NM118","v":0}]
[{"$f":"IF(Dateneingabe!A121=0,\"zzz\",Dateneingabe!A121)","v":"zzz"},{"$f":"IF(Dateneingabe!B121=0,\"zzz\",Dateneingabe!B121)","v":"zzz"},{"$f":"IF(Dateneingabe!C121=0,\"zzz\",Dateneingabe!C121)","v":"zzz"},{"$f":"IF($D$3<$E$1,\"<?\",IF($D$3>$NF$1,\">?\",LOOKUP($D$3,$E$1:$NF$1,E119:NF119)))","v":0},null,null,null,null,null,null,null,null,null,null,null,null,null,null,null,null,null,null,null,null,null,null,null,null,null,null,null,null,null,null,null,null,null,null,null,null,null,null,null,null,null,null,null,null,null,null,null,null,null,null,null,null,null,null,null,null,null,null,null,null,null,null,null,null,null,null,null,null,null,null,null,null,null,null,null,null,null,null,null,null,null,null,null,null,null,null,null,null,null,null,null,null,null,null,null,null,null,null,null,null,null,null,null,null,null,null,null,null,null,null,null,null,null,null,null,null,null,null,null,null,null,null,null,null,null,null,null,null,null,null,null,null,null,null,null,null,null,null,null,null,null,null,null,null,null,null,null,null,null,null,null,null,null,null,null,null,null,null,null,null,null,null,null,null,null,null,null,null,null,null,null,null,null,null,null,null,null,null,null,null,null,null,null,null,null,null,null,null,null,null,null,null,null,null,null,null,null,null,null,null,null,null,null,null,null,null,null,null,null,null,null,null,null,null,null,null,null,null,null,null,null,null,null,null,null,null,null,null,null,null,null,null,null,null,null,null,null,null,null,null,null,null,null,null,null,null,null,null,null,null,null,null,null,null,null,null,null,null,null,null,null,null,null,null,null,null,null,null,null,null,null,null,null,null,null,null,null,null,null,null,null,null,null,null,null,null,null,null,null,null,null,null,null,null,null,null,null,null,null,null,null,null,null,null,null,null,null,null,null,null,null,null,null,null,null,null,null,null,null,null,null,null,null,null,null,null,null,null,null,null,null,null,null,null,null,null,null,null,null,null,null,null,null,null,null,null,null,null,null,null,null,null,null,null,null,null,null,null,null,null,null,null,null,null,null,null,null,{"$f":"Dateneingabe!N121","v":115},null,{"$f":"Dateneingabe!K121","v":0},{"$f":"Dateneingabe!L121","v":0},{"$f":"Dateneingabe!M121","v":0},{"$f":"COUNTIFS(E119:NF119,\"U\")","v":0},{"$f":"NL119-NM119","v":0}]
[{"$f":"IF(Dateneingabe!A122=0,\"zzz\",Dateneingabe!A122)","v":"zzz"},{"$f":"IF(Dateneingabe!B122=0,\"zzz\",Dateneingabe!B122)","v":"zzz"},{"$f":"IF(Dateneingabe!C122=0,\"zzz\",Dateneingabe!C122)","v":"zzz"},{"$f":"IF($D$3<$E$1,\"<?\",IF($D$3>$NF$1,\">?\",LOOKUP($D$3,$E$1:$NF$1,E120:NF120)))","v":0},null,null,null,null,null,null,null,null,null,null,null,null,null,null,null,null,null,null,null,null,null,null,null,null,null,null,null,null,null,null,null,null,null,null,null,null,null,null,null,null,null,null,null,null,null,null,null,null,null,null,null,null,null,null,null,null,null,null,null,null,null,null,null,null,null,null,null,null,null,null,null,null,null,null,null,null,null,null,null,null,null,null,null,null,null,null,null,null,null,null,null,null,null,null,null,null,null,null,null,null,null,null,null,null,null,null,null,null,null,null,null,null,null,null,null,null,null,null,null,null,null,null,null,null,null,null,null,null,null,null,null,null,null,null,null,null,null,null,null,null,null,null,null,null,null,null,null,null,null,null,null,null,null,null,null,null,null,null,null,null,null,null,null,null,null,null,null,null,null,null,null,null,null,null,null,null,null,null,null,null,null,null,null,null,null,null,null,null,null,null,null,null,null,null,null,null,null,null,null,null,null,null,null,null,null,null,null,null,null,null,null,null,null,null,null,null,null,null,null,null,null,null,null,null,null,null,null,null,null,null,null,null,null,null,null,null,null,null,null,null,null,null,null,null,null,null,null,null,null,null,null,null,null,null,null,null,null,null,null,null,null,null,null,null,null,null,null,null,null,null,null,null,null,null,null,null,null,null,null,null,null,null,null,null,null,null,null,null,null,null,null,null,null,null,null,null,null,null,null,null,null,null,null,null,null,null,null,null,null,null,null,null,null,null,null,null,null,null,null,null,null,null,null,null,null,null,null,null,null,null,null,null,null,null,null,null,null,null,null,null,null,null,null,null,null,null,null,null,null,null,null,null,null,null,null,null,null,null,null,null,null,null,null,null,null,null,null,{"$f":"Dateneingabe!N122","v":116},null,{"$f":"Dateneingabe!K122","v":0},{"$f":"Dateneingabe!L122","v":0},{"$f":"Dateneingabe!M122","v":0},{"$f":"COUNTIFS(E120:NF120,\"U\")","v":0},{"$f":"NL120-NM120","v":0}]
[{"$f":"IF(Dateneingabe!A123=0,\"zzz\",Dateneingabe!A123)","v":"zzz"},{"$f":"IF(Dateneingabe!B123=0,\"zzz\",Dateneingabe!B123)","v":"zzz"},{"$f":"IF(Dateneingabe!C123=0,\"zzz\",Dateneingabe!C123)","v":"zzz"},{"$f":"IF($D$3<$E$1,\"<?\",IF($D$3>$NF$1,\">?\",LOOKUP($D$3,$E$1:$NF$1,E121:NF121)))","v":0},null,null,null,null,null,null,null,null,null,null,null,null,null,null,null,null,null,null,null,null,null,null,null,null,null,null,null,null,null,null,null,null,null,null,null,null,null,null,null,null,null,null,null,null,null,null,null,null,null,null,null,null,null,null,null,null,null,null,null,null,null,null,null,null,null,null,null,null,null,null,null,null,null,null,null,null,null,null,null,null,null,null,null,null,null,null,null,null,null,null,null,null,null,null,null,null,null,null,null,null,null,null,null,null,null,null,null,null,null,null,null,null,null,null,null,null,null,null,null,null,null,null,null,null,null,null,null,null,null,null,null,null,null,null,null,null,null,null,null,null,null,null,null,null,null,null,null,null,null,null,null,null,null,null,null,null,null,null,null,null,null,null,null,null,null,null,null,null,null,null,null,null,null,null,null,null,null,null,null,null,null,null,null,null,null,null,null,null,null,null,null,null,null,null,null,null,null,null,null,null,null,null,null,null,null,null,null,null,null,null,null,null,null,null,null,null,null,null,null,null,null,null,null,null,null,null,null,null,null,null,null,null,null,null,null,null,null,null,null,null,null,null,null,null,null,null,null,null,null,null,null,null,null,null,null,null,null,null,null,null,null,null,null,null,null,null,null,null,null,null,null,null,null,null,null,null,null,null,null,null,null,null,null,null,null,null,null,null,null,null,null,null,null,null,null,null,null,null,null,null,null,null,null,null,null,null,null,null,null,null,null,null,null,null,null,null,null,null,null,null,null,null,null,null,null,null,null,null,null,null,null,null,null,null,null,null,null,null,null,null,null,null,null,null,null,null,null,null,null,null,null,null,null,null,null,null,null,null,null,null,null,null,null,null,null,null,null,{"$f":"Dateneingabe!N123","v":117},null,{"$f":"Dateneingabe!K123","v":0},{"$f":"Dateneingabe!L123","v":0},{"$f":"Dateneingabe!M123","v":0},{"$f":"COUNTIFS(E121:NF121,\"U\")","v":0},{"$f":"NL121-NM121","v":0}]
[{"$f":"IF(Dateneingabe!A124=0,\"zzz\",Dateneingabe!A124)","v":"zzz"},{"$f":"IF(Dateneingabe!B124=0,\"zzz\",Dateneingabe!B124)","v":"zzz"},{"$f":"IF(Dateneingabe!C124=0,\"zzz\",Dateneingabe!C124)","v":"zzz"},{"$f":"IF($D$3<$E$1,\"<?\",IF($D$3>$NF$1,\">?\",LOOKUP($D$3,$E$1:$NF$1,E122:NF122)))","v":0},null,null,null,null,null,null,null,null,null,null,null,null,null,null,null,null,null,null,null,null,null,null,null,null,null,null,null,null,null,null,null,null,null,null,null,null,null,null,null,null,null,null,null,null,null,null,null,null,null,null,null,null,null,null,null,null,null,null,null,null,null,null,null,null,null,null,null,null,null,null,null,null,null,null,null,null,null,null,null,null,null,null,null,null,null,null,null,null,null,null,null,null,null,null,null,null,null,null,null,null,null,null,null,null,null,null,null,null,null,null,null,null,null,null,null,null,null,null,null,null,null,null,null,null,null,null,null,null,null,null,null,null,null,null,null,null,null,null,null,null,null,null,null,null,null,null,null,null,null,null,null,null,null,null,null,null,null,null,null,null,null,null,null,null,null,null,null,null,null,null,null,null,null,null,null,null,null,null,null,null,null,null,null,null,null,null,null,null,null,null,null,null,null,null,null,null,null,null,null,null,null,null,null,null,null,null,null,null,null,null,null,null,null,null,null,null,null,null,null,null,null,null,null,null,null,null,null,null,null,null,null,null,null,null,null,null,null,null,null,null,null,null,null,null,null,null,null,null,null,null,null,null,null,null,null,null,null,null,null,null,null,null,null,null,null,null,null,null,null,null,null,null,null,null,null,null,null,null,null,null,null,null,null,null,null,null,null,null,null,null,null,null,null,null,null,null,null,null,null,null,null,null,null,null,null,null,null,null,null,null,null,null,null,null,null,null,null,null,null,null,null,null,null,null,null,null,null,null,null,null,null,null,null,null,null,null,null,null,null,null,null,null,null,null,null,null,null,null,null,null,null,null,null,null,null,null,null,null,null,null,null,null,null,null,null,null,null,{"$f":"Dateneingabe!N124","v":118},null,{"$f":"Dateneingabe!K124","v":0},{"$f":"Dateneingabe!L124","v":0},{"$f":"Dateneingabe!M124","v":0},{"$f":"COUNTIFS(E122:NF122,\"U\")","v":0},{"$f":"NL122-NM122","v":0}]
[{"$f":"IF(Dateneingabe!A125=0,\"zzz\",Dateneingabe!A125)","v":"zzz"},{"$f":"IF(Dateneingabe!B125=0,\"zzz\",Dateneingabe!B125)","v":"zzz"},{"$f":"IF(Dateneingabe!C125=0,\"zzz\",Dateneingabe!C125)","v":"zzz"},{"$f":"IF($D$3<$E$1,\"<?\",IF($D$3>$NF$1,\">?\",LOOKUP($D$3,$E$1:$NF$1,E123:NF123)))","v":0},null,null,null,null,null,null,null,null,null,null,null,null,null,null,null,null,null,null,null,null,null,null,null,null,null,null,null,null,null,null,null,null,null,null,null,null,null,null,null,null,null,null,null,null,null,null,null,null,null,null,null,null,null,null,null,null,null,null,null,null,null,null,null,null,null,null,null,null,null,null,null,null,null,null,null,null,null,null,null,null,null,null,null,null,null,null,null,null,null,null,null,null,null,null,null,null,null,null,null,null,null,null,null,null,null,null,null,null,null,null,null,null,null,null,null,null,null,null,null,null,null,null,null,null,null,null,null,null,null,null,null,null,null,null,null,null,null,null,null,null,null,null,null,null,null,null,null,null,null,null,null,null,null,null,null,null,null,null,null,null,null,null,null,null,null,null,null,null,null,null,null,null,null,null,null,null,null,null,null,null,null,null,null,null,null,null,null,null,null,null,null,null,null,null,null,null,null,null,null,null,null,null,null,null,null,null,null,null,null,null,null,null,null,null,null,null,null,null,null,null,null,null,null,null,null,null,null,null,null,null,null,null,null,null,null,null,null,null,null,null,null,null,null,null,null,null,null,null,null,null,null,null,null,null,null,null,null,null,null,null,null,null,null,null,null,null,null,null,null,null,null,null,null,null,null,null,null,null,null,null,null,null,null,null,null,null,null,null,null,null,null,null,null,null,null,null,null,null,null,null,null,null,null,null,null,null,null,null,null,null,null,null,null,null,null,null,null,null,null,null,null,null,null,null,null,null,null,null,null,null,null,null,null,null,null,null,null,null,null,null,null,null,null,null,null,null,null,null,null,null,null,null,null,null,null,null,null,null,null,null,null,null,null,null,null,null,null,{"$f":"Dateneingabe!N125","v":119},null,{"$f":"Dateneingabe!K125","v":0},{"$f":"Dateneingabe!L125","v":0},{"$f":"Dateneingabe!M125","v":0},{"$f":"COUNTIFS(E123:NF123,\"U\")","v":0},{"$f":"NL123-NM123","v":0}]
[{"$f":"IF(Dateneingabe!A126=0,\"zzz\",Dateneingabe!A126)","v":"zzz"},{"$f":"IF(Dateneingabe!B126=0,\"zzz\",Dateneingabe!B126)","v":"zzz"},{"$f":"IF(Dateneingabe!C126=0,\"zzz\",Dateneingabe!C126)","v":"zzz"},{"$f":"IF($D$3<$E$1,\"<?\",IF($D$3>$NF$1,\">?\",LOOKUP($D$3,$E$1:$NF$1,E124:NF124)))","v":0},null,null,null,null,null,null,null,null,null,null,null,null,null,null,null,null,null,null,null,null,null,null,null,null,null,null,null,null,null,null,null,null,null,null,null,null,null,null,null,null,null,null,null,null,null,null,null,null,null,null,null,null,null,null,null,null,null,null,null,null,null,null,null,null,null,null,null,null,null,null,null,null,null,null,null,null,null,null,null,null,null,null,null,null,null,null,null,null,null,null,null,null,null,null,null,null,null,null,null,null,null,null,null,null,null,null,null,null,null,null,null,null,null,null,null,null,null,null,null,null,null,null,null,null,null,null,null,null,null,null,null,null,null,null,null,null,null,null,null,null,null,null,null,null,null,null,null,null,null,null,null,null,null,null,null,null,null,null,null,null,null,null,null,null,null,null,null,null,null,null,null,null,null,null,null,null,null,null,null,null,null,null,null,null,null,null,null,null,null,null,null,null,null,null,null,null,null,null,null,null,null,null,null,null,null,null,null,null,null,null,null,null,null,null,null,null,null,null,null,null,null,null,null,null,null,null,null,null,null,null,null,null,null,null,null,null,null,null,null,null,null,null,null,null,null,null,null,null,null,null,null,null,null,null,null,null,null,null,null,null,null,null,null,null,null,null,null,null,null,null,null,null,null,null,null,null,null,null,null,null,null,null,null,null,null,null,null,null,null,null,null,null,null,null,null,null,null,null,null,null,null,null,null,null,null,null,null,null,null,null,null,null,null,null,null,null,null,null,null,null,null,null,null,null,null,null,null,null,null,null,null,null,null,null,null,null,null,null,null,null,null,null,null,null,null,null,null,null,null,null,null,null,null,null,null,null,null,null,null,null,null,null,null,null,null,null,null,{"$f":"Dateneingabe!N126","v":120},null,{"$f":"Dateneingabe!K126","v":0},{"$f":"Dateneingabe!L126","v":0},{"$f":"Dateneingabe!M126","v":0},{"$f":"COUNTIFS(E124:NF124,\"U\")","v":0},{"$f":"NL124-NM124","v":0}]
[{"$f":"IF(Dateneingabe!A127=0,\"zzz\",Dateneingabe!A127)","v":"zzz"},{"$f":"IF(Dateneingabe!B127=0,\"zzz\",Dateneingabe!B127)","v":"zzz"},{"$f":"IF(Dateneingabe!C127=0,\"zzz\",Dateneingabe!C127)","v":"zzz"},{"$f":"IF($D$3<$E$1,\"<?\",IF($D$3>$NF$1,\">?\",LOOKUP($D$3,$E$1:$NF$1,E125:NF125)))","v":0},null,null,null,null,null,null,null,null,null,null,null,null,null,null,null,null,null,null,null,null,null,null,null,null,null,null,null,null,null,null,null,null,null,null,null,null,null,null,null,null,null,null,null,null,null,null,null,null,null,null,null,null,null,null,null,null,null,null,null,null,null,null,null,null,null,null,null,null,null,null,null,null,null,null,null,null,null,null,null,null,null,null,null,null,null,null,null,null,null,null,null,null,null,null,null,null,null,null,null,null,null,null,null,null,null,null,null,null,null,null,null,null,null,null,null,null,null,null,null,null,null,null,null,null,null,null,null,null,null,null,null,null,null,null,null,null,null,null,null,null,null,null,null,null,null,null,null,null,null,null,null,null,null,null,null,null,null,null,null,null,null,null,null,null,null,null,null,null,null,null,null,null,null,null,null,null,null,null,null,null,null,null,null,null,null,null,null,null,null,null,null,null,null,null,null,null,null,null,null,null,null,null,null,null,null,null,null,null,null,null,null,null,null,null,null,null,null,null,null,null,null,null,null,null,null,null,null,null,null,null,null,null,null,null,null,null,null,null,null,null,null,null,null,null,null,null,null,null,null,null,null,null,null,null,null,null,null,null,null,null,null,null,null,null,null,null,null,null,null,null,null,null,null,null,null,null,null,null,null,null,null,null,null,null,null,null,null,null,null,null,null,null,null,null,null,null,null,null,null,null,null,null,null,null,null,null,null,null,null,null,null,null,null,null,null,null,null,null,null,null,null,null,null,null,null,null,null,null,null,null,null,null,null,null,null,null,null,null,null,null,null,null,null,null,null,null,null,null,null,null,null,null,null,null,null,null,null,null,null,null,null,null,null,null,null,null,null,{"$f":"Dateneingabe!N127","v":121},null,{"$f":"Dateneingabe!K127","v":0},{"$f":"Dateneingabe!L127","v":0},{"$f":"Dateneingabe!M127","v":0},{"$f":"COUNTIFS(E125:NF125,\"U\")","v":0},{"$f":"NL125-NM125","v":0}]
[{"$f":"IF(Dateneingabe!A128=0,\"zzz\",Dateneingabe!A128)","v":"zzz"},{"$f":"IF(Dateneingabe!B128=0,\"zzz\",Dateneingabe!B128)","v":"zzz"},{"$f":"IF(Dateneingabe!C128=0,\"zzz\",Dateneingabe!C128)","v":"zzz"},{"$f":"IF($D$3<$E$1,\"<?\",IF($D$3>$NF$1,\">?\",LOOKUP($D$3,$E$1:$NF$1,E126:NF126)))","v":0},null,null,null,null,null,null,null,null,null,null,null,null,null,null,null,null,null,null,null,null,null,null,null,null,null,null,null,null,null,null,null,null,null,null,null,null,null,null,null,null,null,null,null,null,null,null,null,null,null,null,null,null,null,null,null,null,null,null,null,null,null,null,null,null,null,null,null,null,null,null,null,null,null,null,null,null,null,null,null,null,null,null,null,null,null,null,null,null,null,null,null,null,null,null,null,null,null,null,null,null,null,null,null,null,null,null,null,null,null,null,null,null,null,null,null,null,null,null,null,null,null,null,null,null,null,null,null,null,null,null,null,null,null,null,null,null,null,null,null,null,null,null,null,null,null,null,null,null,null,null,null,null,null,null,null,null,null,null,null,null,null,null,null,null,null,null,null,null,null,null,null,null,null,null,null,null,null,null,null,null,null,null,null,null,null,null,null,null,null,null,null,null,null,null,null,null,null,null,null,null,null,null,null,null,null,null,null,null,null,null,null,null,null,null,null,null,null,null,null,null,null,null,null,null,null,null,null,null,null,null,null,null,null,null,null,null,null,null,null,null,null,null,null,null,null,null,null,null,null,null,null,null,null,null,null,null,null,null,null,null,null,null,null,null,null,null,null,null,null,null,null,null,null,null,null,null,null,null,null,null,null,null,null,null,null,null,null,null,null,null,null,null,null,null,null,null,null,null,null,null,null,null,null,null,null,null,null,null,null,null,null,null,null,null,null,null,null,null,null,null,null,null,null,null,null,null,null,null,null,null,null,null,null,null,null,null,null,null,null,null,null,null,null,null,null,null,null,null,null,null,null,null,null,null,null,null,null,null,null,null,null,null,null,null,null,null,null,{"$f":"Dateneingabe!N128","v":122},null,{"$f":"Dateneingabe!K128","v":0},{"$f":"Dateneingabe!L128","v":0},{"$f":"Dateneingabe!M128","v":0},{"$f":"COUNTIFS(E126:NF126,\"U\")","v":0},{"$f":"NL126-NM126","v":0}]
[{"$f":"IF(Dateneingabe!A129=0,\"zzz\",Dateneingabe!A129)","v":"zzz"},{"$f":"IF(Dateneingabe!B129=0,\"zzz\",Dateneingabe!B129)","v":"zzz"},{"$f":"IF(Dateneingabe!C129=0,\"zzz\",Dateneingabe!C129)","v":"zzz"},{"$f":"IF($D$3<$E$1,\"<?\",IF($D$3>$NF$1,\">?\",LOOKUP($D$3,$E$1:$NF$1,E127:NF127)))","v":0},null,null,null,null,null,null,null,null,null,null,null,null,null,null,null,null,null,null,null,null,null,null,null,null,null,null,null,null,null,null,null,null,null,null,null,null,null,null,null,null,null,null,null,null,null,null,null,null,null,null,null,null,null,null,null,null,null,null,null,null,null,null,null,null,null,null,null,null,null,null,null,null,null,null,null,null,null,null,null,null,null,null,null,null,null,null,null,null,null,null,null,null,null,null,null,null,null,null,null,null,null,null,null,null,null,null,null,null,null,null,null,null,null,null,null,null,null,null,null,null,null,null,null,null,null,null,null,null,null,null,null,null,null,null,null,null,null,null,null,null,null,null,null,null,null,null,null,null,null,null,null,null,null,null,null,null,null,null,null,null,null,null,null,null,null,null,null,null,null,null,null,null,null,null,null,null,null,null,null,null,null,null,null,null,null,null,null,null,null,null,null,null,null,null,null,null,null,null,null,null,null,null,null,null,null,null,null,null,null,null,null,null,null,null,null,null,null,null,null,null,null,null,null,null,null,null,null,null,null,null,null,null,null,null,null,null,null,null,null,null,null,null,null,null,null,null,null,null,null,null,null,null,null,null,null,null,null,null,null,null,null,null,null,null,null,null,null,null,null,null,null,null,null,null,null,null,null,null,null,null,null,null,null,null,null,null,null,null,null,null,null,null,null,null,null,null,null,null,null,null,null,null,null,null,null,null,null,null,null,null,null,null,null,null,null,null,null,null,null,null,null,null,null,null,null,null,null,null,null,null,null,null,null,null,null,null,null,null,null,null,null,null,null,null,null,null,null,null,null,null,null,null,null,null,null,null,null,null,null,null,null,null,null,null,null,null,null,{"$f":"Dateneingabe!N129","v":123},null,{"$f":"Dateneingabe!K129","v":0},{"$f":"Dateneingabe!L129","v":0},{"$f":"Dateneingabe!M129","v":0},{"$f":"COUNTIFS(E127:NF127,\"U\")","v":0},{"$f":"NL127-NM127","v":0}]
[{"$f":"IF(Dateneingabe!A130=0,\"zzz\",Dateneingabe!A130)","v":"zzz"},{"$f":"IF(Dateneingabe!B130=0,\"zzz\",Dateneingabe!B130)","v":"zzz"},{"$f":"IF(Dateneingabe!C130=0,\"zzz\",Dateneingabe!C130)","v":"zzz"},{"$f":"IF($D$3<$E$1,\"<?\",IF($D$3>$NF$1,\">?\",LOOKUP($D$3,$E$1:$NF$1,E128:NF128)))","v":0},null,null,null,null,null,null,null,null,null,null,null,null,null,null,null,null,null,null,null,null,null,null,null,null,null,null,null,null,null,null,null,null,null,null,null,null,null,null,null,null,null,null,null,null,null,null,null,null,null,null,null,null,null,null,null,null,null,null,null,null,null,null,null,null,null,null,null,null,null,null,null,null,null,null,null,null,null,null,null,null,null,null,null,null,null,null,null,null,null,null,null,null,null,null,null,null,null,null,null,null,null,null,null,null,null,null,null,null,null,null,null,null,null,null,null,null,null,null,null,null,null,null,null,null,null,null,null,null,null,null,null,null,null,null,null,null,null,null,null,null,null,null,null,null,null,null,null,null,null,null,null,null,null,null,null,null,null,null,null,null,null,null,null,null,null,null,null,null,null,null,null,null,null,null,null,null,null,null,null,null,null,null,null,null,null,null,null,null,null,null,null,null,null,null,null,null,null,null,null,null,null,null,null,null,null,null,null,null,null,null,null,null,null,null,null,null,null,null,null,null,null,null,null,null,null,null,null,null,null,null,null,null,null,null,null,null,null,null,null,null,null,null,null,null,null,null,null,null,null,null,null,null,null,null,null,null,null,null,null,null,null,null,null,null,null,null,null,null,null,null,null,null,null,null,null,null,null,null,null,null,null,null,null,null,null,null,null,null,null,null,null,null,null,null,null,null,null,null,null,null,null,null,null,null,null,null,null,null,null,null,null,null,null,null,null,null,null,null,null,null,null,null,null,null,null,null,null,null,null,null,null,null,null,null,null,null,null,null,null,null,null,null,null,null,null,null,null,null,null,null,null,null,null,null,null,null,null,null,null,null,null,null,null,null,null,null,null,{"$f":"Dateneingabe!N130","v":124},null,{"$f":"Dateneingabe!K130","v":0},{"$f":"Dateneingabe!L130","v":0},{"$f":"Dateneingabe!M130","v":0},{"$f":"COUNTIFS(E128:NF128,\"U\")","v":0},{"$f":"NL128-NM128","v":0}]
[{"$f":"IF(Dateneingabe!A131=0,\"zzz\",Dateneingabe!A131)","v":"zzz"},{"$f":"IF(Dateneingabe!B131=0,\"zzz\",Dateneingabe!B131)","v":"zzz"},{"$f":"IF(Dateneingabe!C131=0,\"zzz\",Dateneingabe!C131)","v":"zzz"},{"$f":"IF($D$3<$E$1,\"<?\",IF($D$3>$NF$1,\">?\",LOOKUP($D$3,$E$1:$NF$1,E129:NF129)))","v":0},null,null,null,null,null,null,null,null,null,null,null,null,null,null,null,null,null,null,null,null,null,null,null,null,null,null,null,null,null,null,null,null,null,null,null,null,null,null,null,null,null,null,null,null,null,null,null,null,null,null,null,null,null,null,null,null,null,null,null,null,null,null,null,null,null,null,null,null,null,null,null,null,null,null,null,null,null,null,null,null,null,null,null,null,null,null,null,null,null,null,null,null,null,null,null,null,null,null,null,null,null,null,null,null,null,null,null,null,null,null,null,null,null,null,null,null,null,null,null,null,null,null,null,null,null,null,null,null,null,null,null,null,null,null,null,null,null,null,null,null,null,null,null,null,null,null,null,null,null,null,null,null,null,null,null,null,null,null,null,null,null,null,null,null,null,null,null,null,null,null,null,null,null,null,null,null,null,null,null,null,null,null,null,null,null,null,null,null,null,null,null,null,null,null,null,null,null,null,null,null,null,null,null,null,null,null,null,null,null,null,null,null,null,null,null,null,null,null,null,null,null,null,null,null,null,null,null,null,null,null,null,null,null,null,null,null,null,null,null,null,null,null,null,null,null,null,null,null,null,null,null,null,null,null,null,null,null,null,null,null,null,null,null,null,null,null,null,null,null,null,null,null,null,null,null,null,null,null,null,null,null,null,null,null,null,null,null,null,null,null,null,null,null,null,null,null,null,null,null,null,null,null,null,null,null,null,null,null,null,null,null,null,null,null,null,null,null,null,null,null,null,null,null,null,null,null,null,null,null,null,null,null,null,null,null,null,null,null,null,null,null,null,null,null,null,null,null,null,null,null,null,null,null,null,null,null,null,null,null,null,null,null,null,null,null,null,null,{"$f":"Dateneingabe!N131","v":125},null,{"$f":"Dateneingabe!K131","v":0},{"$f":"Dateneingabe!L131","v":0},{"$f":"Dateneingabe!M131","v":0},{"$f":"COUNTIFS(E129:NF129,\"U\")","v":0},{"$f":"NL129-NM129","v":0}]
[{"$f":"IF(Dateneingabe!A132=0,\"zzz\",Dateneingabe!A132)","v":"zzz"},{"$f":"IF(Dateneingabe!B132=0,\"zzz\",Dateneingabe!B132)","v":"zzz"},{"$f":"IF(Dateneingabe!C132=0,\"zzz\",Dateneingabe!C132)","v":"zzz"},{"$f":"IF($D$3<$E$1,\"<?\",IF($D$3>$NF$1,\">?\",LOOKUP($D$3,$E$1:$NF$1,E130:NF130)))","v":0},null,null,null,null,null,null,null,null,null,null,null,null,null,null,null,null,null,null,null,null,null,null,null,null,null,null,null,null,null,null,null,null,null,null,null,null,null,null,null,null,null,null,null,null,null,null,null,null,null,null,null,null,null,null,null,null,null,null,null,null,null,null,null,null,null,null,null,null,null,null,null,null,null,null,null,null,null,null,null,null,null,null,null,null,null,null,null,null,null,null,null,null,null,null,null,null,null,null,null,null,null,null,null,null,null,null,null,null,null,null,null,null,null,null,null,null,null,null,null,null,null,null,null,null,null,null,null,null,null,null,null,null,null,null,null,null,null,null,null,null,null,null,null,null,null,null,null,null,null,null,null,null,null,null,null,null,null,null,null,null,null,null,null,null,null,null,null,null,null,null,null,null,null,null,null,null,null,null,null,null,null,null,null,null,null,null,null,null,null,null,null,null,null,null,null,null,null,null,null,null,null,null,null,null,null,null,null,null,null,null,null,null,null,null,null,null,null,null,null,null,null,null,null,null,null,null,null,null,null,null,null,null,null,null,null,null,null,null,null,null,null,null,null,null,null,null,null,null,null,null,null,null,null,null,null,null,null,null,null,null,null,null,null,null,null,null,null,null,null,null,null,null,null,null,null,null,null,null,null,null,null,null,null,null,null,null,null,null,null,null,null,null,null,null,null,null,null,null,null,null,null,null,null,null,null,null,null,null,null,null,null,null,null,null,null,null,null,null,null,null,null,null,null,null,null,null,null,null,null,null,null,null,null,null,null,null,null,null,null,null,null,null,null,null,null,null,null,null,null,null,null,null,null,null,null,null,null,null,null,null,null,null,null,null,null,null,null,{"$f":"Dateneingabe!N132","v":126},null,{"$f":"Dateneingabe!K132","v":0},{"$f":"Dateneingabe!L132","v":0},{"$f":"Dateneingabe!M132","v":0},{"$f":"COUNTIFS(E130:NF130,\"U\")","v":0},{"$f":"NL130-NM130","v":0}]
[{"$f":"IF(Dateneingabe!A133=0,\"zzz\",Dateneingabe!A133)","v":"zzz"},{"$f":"IF(Dateneingabe!B133=0,\"zzz\",Dateneingabe!B133)","v":"zzz"},{"$f":"IF(Dateneingabe!C133=0,\"zzz\",Dateneingabe!C133)","v":"zzz"},{"$f":"IF($D$3<$E$1,\"<?\",IF($D$3>$NF$1,\">?\",LOOKUP($D$3,$E$1:$NF$1,E131:NF131)))","v":0},null,null,null,null,null,null,null,null,null,null,null,null,null,null,null,null,null,null,null,null,null,null,null,null,null,null,null,null,null,null,null,null,null,null,null,null,null,null,null,null,null,null,null,null,null,null,null,null,null,null,null,null,null,null,null,null,null,null,null,null,null,null,null,null,null,null,null,null,null,null,null,null,null,null,null,null,null,null,null,null,null,null,null,null,null,null,null,null,null,null,null,null,null,null,null,null,null,null,null,null,null,null,null,null,null,null,null,null,null,null,null,null,null,null,null,null,null,null,null,null,null,null,null,null,null,null,null,null,null,null,null,null,null,null,null,null,null,null,null,null,null,null,null,null,null,null,null,null,null,null,null,null,null,null,null,null,null,null,null,null,null,null,null,null,null,null,null,null,null,null,null,null,null,null,null,null,null,null,null,null,null,null,null,null,null,null,null,null,null,null,null,null,null,null,null,null,null,null,null,null,null,null,null,null,null,null,null,null,null,null,null,null,null,null,null,null,null,null,null,null,null,null,null,null,null,null,null,null,null,null,null,null,null,null,null,null,null,null,null,null,null,null,null,null,null,null,null,null,null,null,null,null,null,null,null,null,null,null,null,null,null,null,null,null,null,null,null,null,null,null,null,null,null,null,null,null,null,null,null,null,null,null,null,null,null,null,null,null,null,null,null,null,null,null,null,null,null,null,null,null,null,null,null,null,null,null,null,null,null,null,null,null,null,null,null,null,null,null,null,null,null,null,null,null,null,null,null,null,null,null,null,null,null,null,null,null,null,null,null,null,null,null,null,null,null,null,null,null,null,null,null,null,null,null,null,null,null,null,null,null,null,null,null,null,null,null,null,{"$f":"Dateneingabe!N133","v":127},null,{"$f":"Dateneingabe!K133","v":0},{"$f":"Dateneingabe!L133","v":0},{"$f":"Dateneingabe!M133","v":0},{"$f":"COUNTIFS(E131:NF131,\"U\")","v":0},{"$f":"NL131-NM131","v":0}]
[{"$f":"IF(Dateneingabe!A134=0,\"zzz\",Dateneingabe!A134)","v":"zzz"},{"$f":"IF(Dateneingabe!B134=0,\"zzz\",Dateneingabe!B134)","v":"zzz"},{"$f":"IF(Dateneingabe!C134=0,\"zzz\",Dateneingabe!C134)","v":"zzz"},{"$f":"IF($D$3<$E$1,\"<?\",IF($D$3>$NF$1,\">?\",LOOKUP($D$3,$E$1:$NF$1,E132:NF132)))","v":0},null,null,null,null,null,null,null,null,null,null,null,null,null,null,null,null,null,null,null,null,null,null,null,null,null,null,null,null,null,null,null,null,null,null,null,null,null,null,null,null,null,null,null,null,null,null,null,null,null,null,null,null,null,null,null,null,null,null,null,null,null,null,null,null,null,null,null,null,null,null,null,null,null,null,null,null,null,null,null,null,null,null,null,null,null,null,null,null,null,null,null,null,null,null,null,null,null,null,null,null,null,null,null,null,null,null,null,null,null,null,null,null,null,null,null,null,null,null,null,null,null,null,null,null,null,null,null,null,null,null,null,null,null,null,null,null,null,null,null,null,null,null,null,null,null,null,null,null,null,null,null,null,null,null,null,null,null,null,null,null,null,null,null,null,null,null,null,null,null,null,null,null,null,null,null,null,null,null,null,null,null,null,null,null,null,null,null,null,null,null,null,null,null,null,null,null,null,null,null,null,null,null,null,null,null,null,null,null,null,null,null,null,null,null,null,null,null,null,null,null,null,null,null,null,null,null,null,null,null,null,null,null,null,null,null,null,null,null,null,null,null,null,null,null,null,null,null,null,null,null,null,null,null,null,null,null,null,null,null,null,null,null,null,null,null,null,null,null,null,null,null,null,null,null,null,null,null,null,null,null,null,null,null,null,null,null,null,null,null,null,null,null,null,null,null,null,null,null,null,null,null,null,null,null,null,null,null,null,null,null,null,null,null,null,null,null,null,null,null,null,null,null,null,null,null,null,null,null,null,null,null,null,null,null,null,null,null,null,null,null,null,null,null,null,null,null,null,null,null,null,null,null,null,null,null,null,null,null,null,null,null,null,null,null,null,null,null,{"$f":"Dateneingabe!N134","v":128},null,{"$f":"Dateneingabe!K134","v":0},{"$f":"Dateneingabe!L134","v":0},{"$f":"Dateneingabe!M134","v":0},{"$f":"COUNTIFS(E132:NF132,\"U\")","v":0},{"$f":"NL132-NM132","v":0}]
[{"$f":"IF(Dateneingabe!A135=0,\"zzz\",Dateneingabe!A135)","v":"zzz"},{"$f":"IF(Dateneingabe!B135=0,\"zzz\",Dateneingabe!B135)","v":"zzz"},{"$f":"IF(Dateneingabe!C135=0,\"zzz\",Dateneingabe!C135)","v":"zzz"},{"$f":"IF($D$3<$E$1,\"<?\",IF($D$3>$NF$1,\">?\",LOOKUP($D$3,$E$1:$NF$1,E133:NF133)))","v":0},null,null,null,null,null,null,null,null,null,null,null,null,null,null,null,null,null,null,null,null,null,null,null,null,null,null,null,null,null,null,null,null,null,null,null,null,null,null,null,null,null,null,null,null,null,null,null,null,null,null,null,null,null,null,null,null,null,null,null,null,null,null,null,null,null,null,null,null,null,null,null,null,null,null,null,null,null,null,null,null,null,null,null,null,null,null,null,null,null,null,null,null,null,null,null,null,null,null,null,null,null,null,null,null,null,null,null,null,null,null,null,null,null,null,null,null,null,null,null,null,null,null,null,null,null,null,null,null,null,null,null,null,null,null,null,null,null,null,null,null,null,null,null,null,null,null,null,null,null,null,null,null,null,null,null,null,null,null,null,null,null,null,null,null,null,null,null,null,null,null,null,null,null,null,null,null,null,null,null,null,null,null,null,null,null,null,null,null,null,null,null,null,null,null,null,null,null,null,null,null,null,null,null,null,null,null,null,null,null,null,null,null,null,null,null,null,null,null,null,null,null,null,null,null,null,null,null,null,null,null,null,null,null,null,null,null,null,null,null,null,null,null,null,null,null,null,null,null,null,null,null,null,null,null,null,null,null,null,null,null,null,null,null,null,null,null,null,null,null,null,null,null,null,null,null,null,null,null,null,null,null,null,null,null,null,null,null,null,null,null,null,null,null,null,null,null,null,null,null,null,null,null,null,null,null,null,null,null,null,null,null,null,null,null,null,null,null,null,null,null,null,null,null,null,null,null,null,null,null,null,null,null,null,null,null,null,null,null,null,null,null,null,null,null,null,null,null,null,null,null,null,null,null,null,null,null,null,null,null,null,null,null,null,null,null,null,null,{"$f":"Dateneingabe!N135","v":129},null,{"$f":"Dateneingabe!K135","v":0},{"$f":"Dateneingabe!L135","v":0},{"$f":"Dateneingabe!M135","v":0},{"$f":"COUNTIFS(E133:NF133,\"U\")","v":0},{"$f":"NL133-NM133","v":0}]
[{"$f":"IF(Dateneingabe!A136=0,\"zzz\",Dateneingabe!A136)","v":"zzz"},{"$f":"IF(Dateneingabe!B136=0,\"zzz\",Dateneingabe!B136)","v":"zzz"},{"$f":"IF(Dateneingabe!C136=0,\"zzz\",Dateneingabe!C136)","v":"zzz"},{"$f":"IF($D$3<$E$1,\"<?\",IF($D$3>$NF$1,\">?\",LOOKUP($D$3,$E$1:$NF$1,E134:NF134)))","v":0},null,null,null,null,null,null,null,null,null,null,null,null,null,null,null,null,null,null,null,null,null,null,null,null,null,null,null,null,null,null,null,null,null,null,null,null,null,null,null,null,null,null,null,null,null,null,null,null,null,null,null,null,null,null,null,null,null,null,null,null,null,null,null,null,null,null,null,null,null,null,null,null,null,null,null,null,null,null,null,null,null,null,null,null,null,null,null,null,null,null,null,null,null,null,null,null,null,null,null,null,null,null,null,null,null,null,null,null,null,null,null,null,null,null,null,null,null,null,null,null,null,null,null,null,null,null,null,null,null,null,null,null,null,null,null,null,null,null,null,null,null,null,null,null,null,null,null,null,null,null,null,null,null,null,null,null,null,null,null,null,null,null,null,null,null,null,null,null,null,null,null,null,null,null,null,null,null,null,null,null,null,null,null,null,null,null,null,null,null,null,null,null,null,null,null,null,null,null,null,null,null,null,null,null,null,null,null,null,null,null,null,null,null,null,null,null,null,null,null,null,null,null,null,null,null,null,null,null,null,null,null,null,null,null,null,null,null,null,null,null,null,null,null,null,null,null,null,null,null,null,null,null,null,null,null,null,null,null,null,null,null,null,null,null,null,null,null,null,null,null,null,null,null,null,null,null,null,null,null,null,null,null,null,null,null,null,null,null,null,null,null,null,null,null,null,null,null,null,null,null,null,null,null,null,null,null,null,null,null,null,null,null,null,null,null,null,null,null,null,null,null,null,null,null,null,null,null,null,null,null,null,null,null,null,null,null,null,null,null,null,null,null,null,null,null,null,null,null,null,null,null,null,null,null,null,null,null,null,null,null,null,null,null,null,null,null,null,{"$f":"Dateneingabe!N136","v":130},null,{"$f":"Dateneingabe!K136","v":0},{"$f":"Dateneingabe!L136","v":0},{"$f":"Dateneingabe!M136","v":0},{"$f":"COUNTIFS(E134:NF134,\"U\")","v":0},{"$f":"NL134-NM134","v":0}]
[{"$f":"IF(Dateneingabe!A137=0,\"zzz\",Dateneingabe!A137)","v":"zzz"},{"$f":"IF(Dateneingabe!B137=0,\"zzz\",Dateneingabe!B137)","v":"zzz"},{"$f":"IF(Dateneingabe!C137=0,\"zzz\",Dateneingabe!C137)","v":"zzz"},{"$f":"IF($D$3<$E$1,\"<?\",IF($D$3>$NF$1,\">?\",LOOKUP($D$3,$E$1:$NF$1,E135:NF135)))","v":0},null,null,null,null,null,null,null,null,null,null,null,null,null,null,null,null,null,null,null,null,null,null,null,null,null,null,null,null,null,null,null,null,null,null,null,null,null,null,null,null,null,null,null,null,null,null,null,null,null,null,null,null,null,null,null,null,null,null,null,null,null,null,null,null,null,null,null,null,null,null,null,null,null,null,null,null,null,null,null,null,null,null,null,null,null,null,null,null,null,null,null,null,null,null,null,null,null,null,null,null,null,null,null,null,null,null,null,null,null,null,null,null,null,null,null,null,null,null,null,null,null,null,null,null,null,null,null,null,null,null,null,null,null,null,null,null,null,null,null,null,null,null,null,null,null,null,null,null,null,null,null,null,null,null,null,null,null,null,null,null,null,null,null,null,null,null,null,null,null,null,null,null,null,null,null,null,null,null,null,null,null,null,null,null,null,null,null,null,null,null,null,null,null,null,null,null,null,null,null,null,null,null,null,null,null,null,null,null,null,null,null,null,null,null,null,null,null,null,null,null,null,null,null,null,null,null,null,null,null,null,null,null,null,null,null,null,null,null,null,null,null,null,null,null,null,null,null,null,null,null,null,null,null,null,null,null,null,null,null,null,null,null,null,null,null,null,null,null,null,null,null,null,null,null,null,null,null,null,null,null,null,null,null,null,null,null,null,null,null,null,null,null,null,null,null,null,null,null,null,null,null,null,null,null,null,null,null,null,null,null,null,null,null,null,null,null,null,null,null,null,null,null,null,null,null,null,null,null,null,null,null,null,null,null,null,null,null,null,null,null,null,null,null,null,null,null,null,null,null,null,null,null,null,null,null,null,null,null,null,null,null,null,null,null,null,null,null,{"$f":"Dateneingabe!N137","v":131},null,{"$f":"Dateneingabe!K137","v":0},{"$f":"Dateneingabe!L137","v":0},{"$f":"Dateneingabe!M137","v":0},{"$f":"COUNTIFS(E135:NF135,\"U\")","v":0},{"$f":"NL135-NM135","v":0}]
[{"$f":"IF(Dateneingabe!A138=0,\"zzz\",Dateneingabe!A138)","v":"zzz"},{"$f":"IF(Dateneingabe!B138=0,\"zzz\",Dateneingabe!B138)","v":"zzz"},{"$f":"IF(Dateneingabe!C138=0,\"zzz\",Dateneingabe!C138)","v":"zzz"},{"$f":"IF($D$3<$E$1,\"<?\",IF($D$3>$NF$1,\">?\",LOOKUP($D$3,$E$1:$NF$1,E136:NF136)))","v":0},null,null,null,null,null,null,null,null,null,null,null,null,null,null,null,null,null,null,null,null,null,null,null,null,null,null,null,null,null,null,null,null,null,null,null,null,null,null,null,null,null,null,null,null,null,null,null,null,null,null,null,null,null,null,null,null,null,null,null,null,null,null,null,null,null,null,null,null,null,null,null,null,null,null,null,null,null,null,null,null,null,null,null,null,null,null,null,null,null,null,null,null,null,null,null,null,null,null,null,null,null,null,null,null,null,null,null,null,null,null,null,null,null,null,null,null,null,null,null,null,null,null,null,null,null,null,null,null,null,null,null,null,null,null,null,null,null,null,null,null,null,null,null,null,null,null,null,null,null,null,null,null,null,null,null,null,null,null,null,null,null,null,null,null,null,null,null,null,null,null,null,null,null,null,null,null,null,null,null,null,null,null,null,null,null,null,null,null,null,null,null,null,null,null,null,null,null,null,null,null,null,null,null,null,null,null,null,null,null,null,null,null,null,null,null,null,null,null,null,null,null,null,null,null,null,null,null,null,null,null,null,null,null,null,null,null,null,null,null,null,null,null,null,null,null,null,null,null,null,null,null,null,null,null,null,null,null,null,null,null,null,null,null,null,null,null,null,null,null,null,null,null,null,null,null,null,null,null,null,null,null,null,null,null,null,null,null,null,null,null,null,null,null,null,null,null,null,null,null,null,null,null,null,null,null,null,null,null,null,null,null,null,null,null,null,null,null,null,null,null,null,null,null,null,null,null,null,null,null,null,null,null,null,null,null,null,null,null,null,null,null,null,null,null,null,null,null,null,null,null,null,null,null,null,null,null,null,null,null,null,null,null,null,null,null,null,null,{"$f":"Dateneingabe!N138","v":132},null,{"$f":"Dateneingabe!K138","v":0},{"$f":"Dateneingabe!L138","v":0},{"$f":"Dateneingabe!M138","v":0},{"$f":"COUNTIFS(E136:NF136,\"U\")","v":0},{"$f":"NL136-NM136","v":0}]
[{"$f":"IF(Dateneingabe!A139=0,\"zzz\",Dateneingabe!A139)","v":"zzz"},{"$f":"IF(Dateneingabe!B139=0,\"zzz\",Dateneingabe!B139)","v":"zzz"},{"$f":"IF(Dateneingabe!C139=0,\"zzz\",Dateneingabe!C139)","v":"zzz"},{"$f":"IF($D$3<$E$1,\"<?\",IF($D$3>$NF$1,\">?\",LOOKUP($D$3,$E$1:$NF$1,E137:NF137)))","v":0},null,null,null,null,null,null,null,null,null,null,null,null,null,null,null,null,null,null,null,null,null,null,null,null,null,null,null,null,null,null,null,null,null,null,null,null,null,null,null,null,null,null,null,null,null,null,null,null,null,null,null,null,null,null,null,null,null,null,null,null,null,null,null,null,null,null,null,null,null,null,null,null,null,null,null,null,null,null,null,null,null,null,null,null,null,null,null,null,null,null,null,null,null,null,null,null,null,null,null,null,null,null,null,null,null,null,null,null,null,null,null,null,null,null,null,null,null,null,null,null,null,null,null,null,null,null,null,null,null,null,null,null,null,null,null,null,null,null,null,null,null,null,null,null,null,null,null,null,null,null,null,null,null,null,null,null,null,null,null,null,null,null,null,null,null,null,null,null,null,null,null,null,null,null,null,null,null,null,null,null,null,null,null,null,null,null,null,null,null,null,null,null,null,null,null,null,null,null,null,null,null,null,null,null,null,null,null,null,null,null,null,null,null,null,null,null,null,null,null,null,null,null,null,null,null,null,null,null,null,null,null,null,null,null,null,null,null,null,null,null,null,null,null,null,null,null,null,null,null,null,null,null,null,null,null,null,null,null,null,null,null,null,null,null,null,null,null,null,null,null,null,null,null,null,null,null,null,null,null,null,null,null,null,null,null,null,null,null,null,null,null,null,null,null,null,null,null,null,null,null,null,null,null,null,null,null,null,null,null,null,null,null,null,null,null,null,null,null,null,null,null,null,null,null,null,null,null,null,null,null,null,null,null,null,null,null,null,null,null,null,null,null,null,null,null,null,null,null,null,null,null,null,null,null,null,null,null,null,null,null,null,null,null,null,null,null,null,{"$f":"Dateneingabe!N139","v":133},null,{"$f":"Dateneingabe!K139","v":0},{"$f":"Dateneingabe!L139","v":0},{"$f":"Dateneingabe!M139","v":0},{"$f":"COUNTIFS(E137:NF137,\"U\")","v":0},{"$f":"NL137-NM137","v":0}]
[{"$f":"IF(Dateneingabe!A140=0,\"zzz\",Dateneingabe!A140)","v":"zzz"},{"$f":"IF(Dateneingabe!B140=0,\"zzz\",Dateneingabe!B140)","v":"zzz"},{"$f":"IF(Dateneingabe!C140=0,\"zzz\",Dateneingabe!C140)","v":"zzz"},{"$f":"IF($D$3<$E$1,\"<?\",IF($D$3>$NF$1,\">?\",LOOKUP($D$3,$E$1:$NF$1,E138:NF138)))","v":0},null,null,null,null,null,null,null,null,null,null,null,null,null,null,null,null,null,null,null,null,null,null,null,null,null,null,null,null,null,null,null,null,null,null,null,null,null,null,null,null,null,null,null,null,null,null,null,null,null,null,null,null,null,null,null,null,null,null,null,null,null,null,null,null,null,null,null,null,null,null,null,null,null,null,null,null,null,null,null,null,null,null,null,null,null,null,null,null,null,null,null,null,null,null,null,null,null,null,null,null,null,null,null,null,null,null,null,null,null,null,null,null,null,null,null,null,null,null,null,null,null,null,null,null,null,null,null,null,null,null,null,null,null,null,null,null,null,null,null,null,null,null,null,null,null,null,null,null,null,null,null,null,null,null,null,null,null,null,null,null,null,null,null,null,null,null,null,null,null,null,null,null,null,null,null,null,null,null,null,null,null,null,null,null,null,null,null,null,null,null,null,null,null,null,null,null,null,null,null,null,null,null,null,null,null,null,null,null,null,null,null,null,null,null,null,null,null,null,null,null,null,null,null,null,null,null,null,null,null,null,null,null,null,null,null,null,null,null,null,null,null,null,null,null,null,null,null,null,null,null,null,null,null,null,null,null,null,null,null,null,null,null,null,null,null,null,null,null,null,null,null,null,null,null,null,null,null,null,null,null,null,null,null,null,null,null,null,null,null,null,null,null,null,null,null,null,null,null,null,null,null,null,null,null,null,null,null,null,null,null,null,null,null,null,null,null,null,null,null,null,null,null,null,null,null,null,null,null,null,null,null,null,null,null,null,null,null,null,null,null,null,null,null,null,null,null,null,null,null,null,null,null,null,null,null,null,null,null,null,null,null,null,null,null,null,null,null,{"$f":"Dateneingabe!N140","v":134},null,{"$f":"Dateneingabe!K140","v":0},{"$f":"Dateneingabe!L140","v":0},{"$f":"Dateneingabe!M140","v":0},{"$f":"COUNTIFS(E138:NF138,\"U\")","v":0},{"$f":"NL138-NM138","v":0}]
[{"$f":"IF(Dateneingabe!A141=0,\"zzz\",Dateneingabe!A141)","v":"zzz"},{"$f":"IF(Dateneingabe!B141=0,\"zzz\",Dateneingabe!B141)","v":"zzz"},{"$f":"IF(Dateneingabe!C141=0,\"zzz\",Dateneingabe!C141)","v":"zzz"},{"$f":"IF($D$3<$E$1,\"<?\",IF($D$3>$NF$1,\">?\",LOOKUP($D$3,$E$1:$NF$1,E139:NF139)))","v":0},null,null,null,null,null,null,null,null,null,null,null,null,null,null,null,null,null,null,null,null,null,null,null,null,null,null,null,null,null,null,null,null,null,null,null,null,null,null,null,null,null,null,null,null,null,null,null,null,null,null,null,null,null,null,null,null,null,null,null,null,null,null,null,null,null,null,null,null,null,null,null,null,null,null,null,null,null,null,null,null,null,null,null,null,null,null,null,null,null,null,null,null,null,null,null,null,null,null,null,null,null,null,null,null,null,null,null,null,null,null,null,null,null,null,null,null,null,null,null,null,null,null,null,null,null,null,null,null,null,null,null,null,null,null,null,null,null,null,null,null,null,null,null,null,null,null,null,null,null,null,null,null,null,null,null,null,null,null,null,null,null,null,null,null,null,null,null,null,null,null,null,null,null,null,null,null,null,null,null,null,null,null,null,null,null,null,null,null,null,null,null,null,null,null,null,null,null,null,null,null,null,null,null,null,null,null,null,null,null,null,null,null,null,null,null,null,null,null,null,null,null,null,null,null,null,null,null,null,null,null,null,null,null,null,null,null,null,null,null,null,null,null,null,null,null,null,null,null,null,null,null,null,null,null,null,null,null,null,null,null,null,null,null,null,null,null,null,null,null,null,null,null,null,null,null,null,null,null,null,null,null,null,null,null,null,null,null,null,null,null,null,null,null,null,null,null,null,null,null,null,null,null,null,null,null,null,null,null,null,null,null,null,null,null,null,null,null,null,null,null,null,null,null,null,null,null,null,null,null,null,null,null,null,null,null,null,null,null,null,null,null,null,null,null,null,null,null,null,null,null,null,null,null,null,null,null,null,null,null,null,null,null,null,null,null,null,null,{"$f":"Dateneingabe!N141","v":135},null,{"$f":"Dateneingabe!K141","v":0},{"$f":"Dateneingabe!L141","v":0},{"$f":"Dateneingabe!M141","v":0},{"$f":"COUNTIFS(E139:NF139,\"U\")","v":0},{"$f":"NL139-NM139","v":0}]
[{"$f":"IF(Dateneingabe!A142=0,\"zzz\",Dateneingabe!A142)","v":"zzz"},{"$f":"IF(Dateneingabe!B142=0,\"zzz\",Dateneingabe!B142)","v":"zzz"},{"$f":"IF(Dateneingabe!C142=0,\"zzz\",Dateneingabe!C142)","v":"zzz"},{"$f":"IF($D$3<$E$1,\"<?\",IF($D$3>$NF$1,\">?\",LOOKUP($D$3,$E$1:$NF$1,E140:NF140)))","v":0},null,null,null,null,null,null,null,null,null,null,null,null,null,null,null,null,null,null,null,null,null,null,null,null,null,null,null,null,null,null,null,null,null,null,null,null,null,null,null,null,null,null,null,null,null,null,null,null,null,null,null,null,null,null,null,null,null,null,null,null,null,null,null,null,null,null,null,null,null,null,null,null,null,null,null,null,null,null,null,null,null,null,null,null,null,null,null,null,null,null,null,null,null,null,null,null,null,null,null,null,null,null,null,null,null,null,null,null,null,null,null,null,null,null,null,null,null,null,null,null,null,null,null,null,null,null,null,null,null,null,null,null,null,null,null,null,null,null,null,null,null,null,null,null,null,null,null,null,null,null,null,null,null,null,null,null,null,null,null,null,null,null,null,null,null,null,null,null,null,null,null,null,null,null,null,null,null,null,null,null,null,null,null,null,null,null,null,null,null,null,null,null,null,null,null,null,null,null,null,null,null,null,null,null,null,null,null,null,null,null,null,null,null,null,null,null,null,null,null,null,null,null,null,null,null,null,null,null,null,null,null,null,null,null,null,null,null,null,null,null,null,null,null,null,null,null,null,null,null,null,null,null,null,null,null,null,null,null,null,null,null,null,null,null,null,null,null,null,null,null,null,null,null,null,null,null,null,null,null,null,null,null,null,null,null,null,null,null,null,null,null,null,null,null,null,null,null,null,null,null,null,null,null,null,null,null,null,null,null,null,null,null,null,null,null,null,null,null,null,null,null,null,null,null,null,null,null,null,null,null,null,null,null,null,null,null,null,null,null,null,null,null,null,null,null,null,null,null,null,null,null,null,null,null,null,null,null,null,null,null,null,null,null,null,null,null,null,{"$f":"Dateneingabe!N142","v":136},null,{"$f":"Dateneingabe!K142","v":0},{"$f":"Dateneingabe!L142","v":0},{"$f":"Dateneingabe!M142","v":0},{"$f":"COUNTIFS(E140:NF140,\"U\")","v":0},{"$f":"NL140-NM140","v":0}]
[{"$f":"IF(Dateneingabe!A143=0,\"zzz\",Dateneingabe!A143)","v":"zzz"},{"$f":"IF(Dateneingabe!B143=0,\"zzz\",Dateneingabe!B143)","v":"zzz"},{"$f":"IF(Dateneingabe!C143=0,\"zzz\",Dateneingabe!C143)","v":"zzz"},{"$f":"IF($D$3<$E$1,\"<?\",IF($D$3>$NF$1,\">?\",LOOKUP($D$3,$E$1:$NF$1,E141:NF141)))","v":0},null,null,null,null,null,null,null,null,null,null,null,null,null,null,null,null,null,null,null,null,null,null,null,null,null,null,null,null,null,null,null,null,null,null,null,null,null,null,null,null,null,null,null,null,null,null,null,null,null,null,null,null,null,null,null,null,null,null,null,null,null,null,null,null,null,null,null,null,null,null,null,null,null,null,null,null,null,null,null,null,null,null,null,null,null,null,null,null,null,null,null,null,null,null,null,null,null,null,null,null,null,null,null,null,null,null,null,null,null,null,null,null,null,null,null,null,null,null,null,null,null,null,null,null,null,null,null,null,null,null,null,null,null,null,null,null,null,null,null,null,null,null,null,null,null,null,null,null,null,null,null,null,null,null,null,null,null,null,null,null,null,null,null,null,null,null,null,null,null,null,null,null,null,null,null,null,null,null,null,null,null,null,null,null,null,null,null,null,null,null,null,null,null,null,null,null,null,null,null,null,null,null,null,null,null,null,null,null,null,null,null,null,null,null,null,null,null,null,null,null,null,null,null,null,null,null,null,null,null,null,null,null,null,null,null,null,null,null,null,null,null,null,null,null,null,null,null,null,null,null,null,null,null,null,null,null,null,null,null,null,null,null,null,null,null,null,null,null,null,null,null,null,null,null,null,null,null,null,null,null,null,null,null,null,null,null,null,null,null,null,null,null,null,null,null,null,null,null,null,null,null,null,null,null,null,null,null,null,null,null,null,null,null,null,null,null,null,null,null,null,null,null,null,null,null,null,null,null,null,null,null,null,null,null,null,null,null,null,null,null,null,null,null,null,null,null,null,null,null,null,null,null,null,null,null,null,null,null,null,null,null,null,null,null,null,null,null,{"$f":"Dateneingabe!N143","v":137},null,{"$f":"Dateneingabe!K143","v":0},{"$f":"Dateneingabe!L143","v":0},{"$f":"Dateneingabe!M143","v":0},{"$f":"COUNTIFS(E141:NF141,\"U\")","v":0},{"$f":"NL141-NM141","v":0}]
[{"$f":"IF(Dateneingabe!A144=0,\"zzz\",Dateneingabe!A144)","v":"zzz"},{"$f":"IF(Dateneingabe!B144=0,\"zzz\",Dateneingabe!B144)","v":"zzz"},{"$f":"IF(Dateneingabe!C144=0,\"zzz\",Dateneingabe!C144)","v":"zzz"},{"$f":"IF($D$3<$E$1,\"<?\",IF($D$3>$NF$1,\">?\",LOOKUP($D$3,$E$1:$NF$1,E142:NF142)))","v":0},null,null,null,null,null,null,null,null,null,null,null,null,null,null,null,null,null,null,null,null,null,null,null,null,null,null,null,null,null,null,null,null,null,null,null,null,null,null,null,null,null,null,null,null,null,null,null,null,null,null,null,null,null,null,null,null,null,null,null,null,null,null,null,null,null,null,null,null,null,null,null,null,null,null,null,null,null,null,null,null,null,null,null,null,null,null,null,null,null,null,null,null,null,null,null,null,null,null,null,null,null,null,null,null,null,null,null,null,null,null,null,null,null,null,null,null,null,null,null,null,null,null,null,null,null,null,null,null,null,null,null,null,null,null,null,null,null,null,null,null,null,null,null,null,null,null,null,null,null,null,null,null,null,null,null,null,null,null,null,null,null,null,null,null,null,null,null,null,null,null,null,null,null,null,null,null,null,null,null,null,null,null,null,null,null,null,null,null,null,null,null,null,null,null,null,null,null,null,null,null,null,null,null,null,null,null,null,null,null,null,null,null,null,null,null,null,null,null,null,null,null,null,null,null,null,null,null,null,null,null,null,null,null,null,null,null,null,null,null,null,null,null,null,null,null,null,null,null,null,null,null,null,null,null,null,null,null,null,null,null,null,null,null,null,null,null,null,null,null,null,null,null,null,null,null,null,null,null,null,null,null,null,null,null,null,null,null,null,null,null,null,null,null,null,null,null,null,null,null,null,null,null,null,null,null,null,null,null,null,null,null,null,null,null,null,null,null,null,null,null,null,null,null,null,null,null,null,null,null,null,null,null,null,null,null,null,null,null,null,null,null,null,null,null,null,null,null,null,null,null,null,null,null,null,null,null,null,null,null,null,null,null,null,null,null,null,null,{"$f":"Dateneingabe!N144","v":138},null,{"$f":"Dateneingabe!K144","v":0},{"$f":"Dateneingabe!L144","v":0},{"$f":"Dateneingabe!M144","v":0},{"$f":"COUNTIFS(E142:NF142,\"U\")","v":0},{"$f":"NL142-NM142","v":0}]
[{"$f":"IF(Dateneingabe!A145=0,\"zzz\",Dateneingabe!A145)","v":"zzz"},{"$f":"IF(Dateneingabe!B145=0,\"zzz\",Dateneingabe!B145)","v":"zzz"},{"$f":"IF(Dateneingabe!C145=0,\"zzz\",Dateneingabe!C145)","v":"zzz"},{"$f":"IF($D$3<$E$1,\"<?\",IF($D$3>$NF$1,\">?\",LOOKUP($D$3,$E$1:$NF$1,E143:NF143)))","v":0},null,null,null,null,null,null,null,null,null,null,null,null,null,null,null,null,null,null,null,null,null,null,null,null,null,null,null,null,null,null,null,null,null,null,null,null,null,null,null,null,null,null,null,null,null,null,null,null,null,null,null,null,null,null,null,null,null,null,null,null,null,null,null,null,null,null,null,null,null,null,null,null,null,null,null,null,null,null,null,null,null,null,null,null,null,null,null,null,null,null,null,null,null,null,null,null,null,null,null,null,null,null,null,null,null,null,null,null,null,null,null,null,null,null,null,null,null,null,null,null,null,null,null,null,null,null,null,null,null,null,null,null,null,null,null,null,null,null,null,null,null,null,null,null,null,null,null,null,null,null,null,null,null,null,null,null,null,null,null,null,null,null,null,null,null,null,null,null,null,null,null,null,null,null,null,null,null,null,null,null,null,null,null,null,null,null,null,null,null,null,null,null,null,null,null,null,null,null,null,null,null,null,null,null,null,null,null,null,null,null,null,null,null,null,null,null,null,null,null,null,null,null,null,null,null,null,null,null,null,null,null,null,null,null,null,null,null,null,null,null,null,null,null,null,null,null,null,null,null,null,null,null,null,null,null,null,null,null,null,null,null,null,null,null,null,null,null,null,null,null,null,null,null,null,null,null,null,null,null,null,null,null,null,null,null,null,null,null,null,null,null,null,null,null,null,null,null,null,null,null,null,null,null,null,null,null,null,null,null,null,null,null,null,null,null,null,null,null,null,null,null,null,null,null,null,null,null,null,null,null,null,null,null,null,null,null,null,null,null,null,null,null,null,null,null,null,null,null,null,null,null,null,null,null,null,null,null,null,null,null,null,null,null,null,null,null,null,{"$f":"Dateneingabe!N145","v":139},null,{"$f":"Dateneingabe!K145","v":0},{"$f":"Dateneingabe!L145","v":0},{"$f":"Dateneingabe!M145","v":0},{"$f":"COUNTIFS(E143:NF143,\"U\")","v":0},{"$f":"NL143-NM143","v":0}]
[{"$f":"IF(Dateneingabe!A146=0,\"zzz\",Dateneingabe!A146)","v":"zzz"},{"$f":"IF(Dateneingabe!B146=0,\"zzz\",Dateneingabe!B146)","v":"zzz"},{"$f":"IF(Dateneingabe!C146=0,\"zzz\",Dateneingabe!C146)","v":"zzz"},{"$f":"IF($D$3<$E$1,\"<?\",IF($D$3>$NF$1,\">?\",LOOKUP($D$3,$E$1:$NF$1,E144:NF144)))","v":0},null,null,null,null,null,null,null,null,null,null,null,null,null,null,null,null,null,null,null,null,null,null,null,null,null,null,null,null,null,null,null,null,null,null,null,null,null,null,null,null,null,null,null,null,null,null,null,null,null,null,null,null,null,null,null,null,null,null,null,null,null,null,null,null,null,null,null,null,null,null,null,null,null,null,null,null,null,null,null,null,null,null,null,null,null,null,null,null,null,null,null,null,null,null,null,null,null,null,null,null,null,null,null,null,null,null,null,null,null,null,null,null,null,null,null,null,null,null,null,null,null,null,null,null,null,null,null,null,null,null,null,null,null,null,null,null,null,null,null,null,null,null,null,null,null,null,null,null,null,null,null,null,null,null,null,null,null,null,null,null,null,null,null,null,null,null,null,null,null,null,null,null,null,null,null,null,null,null,null,null,null,null,null,null,null,null,null,null,null,null,null,null,null,null,null,null,null,null,null,null,null,null,null,null,null,null,null,null,null,null,null,null,null,null,null,null,null,null,null,null,null,null,null,null,null,null,null,null,null,null,null,null,null,null,null,null,null,null,null,null,null,null,null,null,null,null,null,null,null,null,null,null,null,null,null,null,null,null,null,null,null,null,null,null,null,null,null,null,null,null,null,null,null,null,null,null,null,null,null,null,null,null,null,null,null,null,null,null,null,null,null,null,null,null,null,null,null,null,null,null,null,null,null,null,null,null,null,null,null,null,null,null,null,null,null,null,null,null,null,null,null,null,null,null,null,null,null,null,null,null,null,null,null,null,null,null,null,null,null,null,null,null,null,null,null,null,null,null,null,null,null,null,null,null,null,null,null,null,null,null,null,null,null,null,null,null,null,{"$f":"Dateneingabe!N146","v":140},null,{"$f":"Dateneingabe!K146","v":0},{"$f":"Dateneingabe!L146","v":0},{"$f":"Dateneingabe!M146","v":0},{"$f":"COUNTIFS(E144:NF144,\"U\")","v":0},{"$f":"NL144-NM144","v":0}]
[{"$f":"IF(Dateneingabe!A147=0,\"zzz\",Dateneingabe!A147)","v":"zzz"},{"$f":"IF(Dateneingabe!B147=0,\"zzz\",Dateneingabe!B147)","v":"zzz"},{"$f":"IF(Dateneingabe!C147=0,\"zzz\",Dateneingabe!C147)","v":"zzz"},{"$f":"IF($D$3<$E$1,\"<?\",IF($D$3>$NF$1,\">?\",LOOKUP($D$3,$E$1:$NF$1,E145:NF145)))","v":0},null,null,null,null,null,null,null,null,null,null,null,null,null,null,null,null,null,null,null,null,null,null,null,null,null,null,null,null,null,null,null,null,null,null,null,null,null,null,null,null,null,null,null,null,null,null,null,null,null,null,null,null,null,null,null,null,null,null,null,null,null,null,null,null,null,null,null,null,null,null,null,null,null,null,null,null,null,null,null,null,null,null,null,null,null,null,null,null,null,null,null,null,null,null,null,null,null,null,null,null,null,null,null,null,null,null,null,null,null,null,null,null,null,null,null,null,null,null,null,null,null,null,null,null,null,null,null,null,null,null,null,null,null,null,null,null,null,null,null,null,null,null,null,null,null,null,null,null,null,null,null,null,null,null,null,null,null,null,null,null,null,null,null,null,null,null,null,null,null,null,null,null,null,null,null,null,null,null,null,null,null,null,null,null,null,null,null,null,null,null,null,null,null,null,null,null,null,null,null,null,null,null,null,null,null,null,null,null,null,null,null,null,null,null,null,null,null,null,null,null,null,null,null,null,null,null,null,null,null,null,null,null,null,null,null,null,null,null,null,null,null,null,null,null,null,null,null,null,null,null,null,null,null,null,null,null,null,null,null,null,null,null,null,null,null,null,null,null,null,null,null,null,null,null,null,null,null,null,null,null,null,null,null,null,null,null,null,null,null,null,null,null,null,null,null,null,null,null,null,null,null,null,null,null,null,null,null,null,null,null,null,null,null,null,null,null,null,null,null,null,null,null,null,null,null,null,null,null,null,null,null,null,null,null,null,null,null,null,null,null,null,null,null,null,null,null,null,null,null,null,null,null,null,null,null,null,null,null,null,null,null,null,null,null,null,null,null,{"$f":"Dateneingabe!N147","v":141},null,{"$f":"Dateneingabe!K147","v":0},{"$f":"Dateneingabe!L147","v":0},{"$f":"Dateneingabe!M147","v":0},{"$f":"COUNTIFS(E145:NF145,\"U\")","v":0},{"$f":"NL145-NM145","v":0}]
[{"$f":"IF(Dateneingabe!A148=0,\"zzz\",Dateneingabe!A148)","v":"zzz"},{"$f":"IF(Dateneingabe!B148=0,\"zzz\",Dateneingabe!B148)","v":"zzz"},{"$f":"IF(Dateneingabe!C148=0,\"zzz\",Dateneingabe!C148)","v":"zzz"},{"$f":"IF($D$3<$E$1,\"<?\",IF($D$3>$NF$1,\">?\",LOOKUP($D$3,$E$1:$NF$1,E146:NF146)))","v":0},null,null,null,null,null,null,null,null,null,null,null,null,null,null,null,null,null,null,null,null,null,null,null,null,null,null,null,null,null,null,null,null,null,null,null,null,null,null,null,null,null,null,null,null,null,null,null,null,null,null,null,null,null,null,null,null,null,null,null,null,null,null,null,null,null,null,null,null,null,null,null,null,null,null,null,null,null,null,null,null,null,null,null,null,null,null,null,null,null,null,null,null,null,null,null,null,null,null,null,null,null,null,null,null,null,null,null,null,null,null,null,null,null,null,null,null,null,null,null,null,null,null,null,null,null,null,null,null,null,null,null,null,null,null,null,null,null,null,null,null,null,null,null,null,null,null,null,null,null,null,null,null,null,null,null,null,null,null,null,null,null,null,null,null,null,null,null,null,null,null,null,null,null,null,null,null,null,null,null,null,null,null,null,null,null,null,null,null,null,null,null,null,null,null,null,null,null,null,null,null,null,null,null,null,null,null,null,null,null,null,null,null,null,null,null,null,null,null,null,null,null,null,null,null,null,null,null,null,null,null,null,null,null,null,null,null,null,null,null,null,null,null,null,null,null,null,null,null,null,null,null,null,null,null,null,null,null,null,null,null,null,null,null,null,null,null,null,null,null,null,null,null,null,null,null,null,null,null,null,null,null,null,null,null,null,null,null,null,null,null,null,null,null,null,null,null,null,null,null,null,null,null,null,null,null,null,null,null,null,null,null,null,null,null,null,null,null,null,null,null,null,null,null,null,null,null,null,null,null,null,null,null,null,null,null,null,null,null,null,null,null,null,null,null,null,null,null,null,null,null,null,null,null,null,null,null,null,null,null,null,null,null,null,null,null,null,null,{"$f":"Dateneingabe!N148","v":142},null,{"$f":"Dateneingabe!K148","v":0},{"$f":"Dateneingabe!L148","v":0},{"$f":"Dateneingabe!M148","v":0},{"$f":"COUNTIFS(E146:NF146,\"U\")","v":0},{"$f":"NL146-NM146","v":0}]
[{"$f":"IF(Dateneingabe!A149=0,\"zzz\",Dateneingabe!A149)","v":"zzz"},{"$f":"IF(Dateneingabe!B149=0,\"zzz\",Dateneingabe!B149)","v":"zzz"},{"$f":"IF(Dateneingabe!C149=0,\"zzz\",Dateneingabe!C149)","v":"zzz"},{"$f":"IF($D$3<$E$1,\"<?\",IF($D$3>$NF$1,\">?\",LOOKUP($D$3,$E$1:$NF$1,E147:NF147)))","v":0},null,null,null,null,null,null,null,null,null,null,null,null,null,null,null,null,null,null,null,null,null,null,null,null,null,null,null,null,null,null,null,null,null,null,null,null,null,null,null,null,null,null,null,null,null,null,null,null,null,null,null,null,null,null,null,null,null,null,null,null,null,null,null,null,null,null,null,null,null,null,null,null,null,null,null,null,null,null,null,null,null,null,null,null,null,null,null,null,null,null,null,null,null,null,null,null,null,null,null,null,null,null,null,null,null,null,null,null,null,null,null,null,null,null,null,null,null,null,null,null,null,null,null,null,null,null,null,null,null,null,null,null,null,null,null,null,null,null,null,null,null,null,null,null,null,null,null,null,null,null,null,null,null,null,null,null,null,null,null,null,null,null,null,null,null,null,null,null,null,null,null,null,null,null,null,null,null,null,null,null,null,null,null,null,null,null,null,null,null,null,null,null,null,null,null,null,null,null,null,null,null,null,null,null,null,null,null,null,null,null,null,null,null,null,null,null,null,null,null,null,null,null,null,null,null,null,null,null,null,null,null,null,null,null,null,null,null,null,null,null,null,null,null,null,null,null,null,null,null,null,null,null,null,null,null,null,null,null,null,null,null,null,null,null,null,null,null,null,null,null,null,null,null,null,null,null,null,null,null,null,null,null,null,null,null,null,null,null,null,null,null,null,null,null,null,null,null,null,null,null,null,null,null,null,null,null,null,null,null,null,null,null,null,null,null,null,null,null,null,null,null,null,null,null,null,null,null,null,null,null,null,null,null,null,null,null,null,null,null,null,null,null,null,null,null,null,null,null,null,null,null,null,null,null,null,null,null,null,null,null,null,null,null,null,null,null,null,{"$f":"Dateneingabe!N149","v":143},null,{"$f":"Dateneingabe!K149","v":0},{"$f":"Dateneingabe!L149","v":0},{"$f":"Dateneingabe!M149","v":0},{"$f":"COUNTIFS(E147:NF147,\"U\")","v":0},{"$f":"NL147-NM147","v":0}]
[{"$f":"IF(Dateneingabe!A150=0,\"zzz\",Dateneingabe!A150)","v":"zzz"},{"$f":"IF(Dateneingabe!B150=0,\"zzz\",Dateneingabe!B150)","v":"zzz"},{"$f":"IF(Dateneingabe!C150=0,\"zzz\",Dateneingabe!C150)","v":"zzz"},{"$f":"IF($D$3<$E$1,\"<?\",IF($D$3>$NF$1,\">?\",LOOKUP($D$3,$E$1:$NF$1,E148:NF148)))","v":0},null,null,null,null,null,null,null,null,null,null,null,null,null,null,null,null,null,null,null,null,null,null,null,null,null,null,null,null,null,null,null,null,null,null,null,null,null,null,null,null,null,null,null,null,null,null,null,null,null,null,null,null,null,null,null,null,null,null,null,null,null,null,null,null,null,null,null,null,null,null,null,null,null,null,null,null,null,null,null,null,null,null,null,null,null,null,null,null,null,null,null,null,null,null,null,null,null,null,null,null,null,null,null,null,null,null,null,null,null,null,null,null,null,null,null,null,null,null,null,null,null,null,null,null,null,null,null,null,null,null,null,null,null,null,null,null,null,null,null,null,null,null,null,null,null,null,null,null,null,null,null,null,null,null,null,null,null,null,null,null,null,null,null,null,null,null,null,null,null,null,null,null,null,null,null,null,null,null,null,null,null,null,null,null,null,null,null,null,null,null,null,null,null,null,null,null,null,null,null,null,null,null,null,null,null,null,null,null,null,null,null,null,null,null,null,null,null,null,null,null,null,null,null,null,null,null,null,null,null,null,null,null,null,null,null,null,null,null,null,null,null,null,null,null,null,null,null,null,null,null,null,null,null,null,null,null,null,null,null,null,null,null,null,null,null,null,null,null,null,null,null,null,null,null,null,null,null,null,null,null,null,null,null,null,null,null,null,null,null,null,null,null,null,null,null,null,null,null,null,null,null,null,null,null,null,null,null,null,null,null,null,null,null,null,null,null,null,null,null,null,null,null,null,null,null,null,null,null,null,null,null,null,null,null,null,null,null,null,null,null,null,null,null,null,null,null,null,null,null,null,null,null,null,null,null,null,null,null,null,null,null,null,null,null,null,null,null,{"$f":"Dateneingabe!N150","v":144},null,{"$f":"Dateneingabe!K150","v":0},{"$f":"Dateneingabe!L150","v":0},{"$f":"Dateneingabe!M150","v":0},{"$f":"COUNTIFS(E148:NF148,\"U\")","v":0},{"$f":"NL148-NM148","v":0}]
[{"$f":"IF(Dateneingabe!A151=0,\"zzz\",Dateneingabe!A151)","v":"zzz"},{"$f":"IF(Dateneingabe!B151=0,\"zzz\",Dateneingabe!B151)","v":"zzz"},{"$f":"IF(Dateneingabe!C151=0,\"zzz\",Dateneingabe!C151)","v":"zzz"},{"$f":"IF($D$3<$E$1,\"<?\",IF($D$3>$NF$1,\">?\",LOOKUP($D$3,$E$1:$NF$1,E149:NF149)))","v":0},null,null,null,null,null,null,null,null,null,null,null,null,null,null,null,null,null,null,null,null,null,null,null,null,null,null,null,null,null,null,null,null,null,null,null,null,null,null,null,null,null,null,null,null,null,null,null,null,null,null,null,null,null,null,null,null,null,null,null,null,null,null,null,null,null,null,null,null,null,null,null,null,null,null,null,null,null,null,null,null,null,null,null,null,null,null,null,null,null,null,null,null,null,null,null,null,null,null,null,null,null,null,null,null,null,null,null,null,null,null,null,null,null,null,null,null,null,null,null,null,null,null,null,null,null,null,null,null,null,null,null,null,null,null,null,null,null,null,null,null,null,null,null,null,null,null,null,null,null,null,null,null,null,null,null,null,null,null,null,null,null,null,null,null,null,null,null,null,null,null,null,null,null,null,null,null,null,null,null,null,null,null,null,null,null,null,null,null,null,null,null,null,null,null,null,null,null,null,null,null,null,null,null,null,null,null,null,null,null,null,null,null,null,null,null,null,null,null,null,null,null,null,null,null,null,null,null,null,null,null,null,null,null,null,null,null,null,null,null,null,null,null,null,null,null,null,null,null,null,null,null,null,null,null,null,null,null,null,null,null,null,null,null,null,null,null,null,null,null,null,null,null,null,null,null,null,null,null,null,null,null,null,null,null,null,null,null,null,null,null,null,null,null,null,null,null,null,null,null,null,null,null,null,null,null,null,null,null,null,null,null,null,null,null,null,null,null,null,null,null,null,null,null,null,null,null,null,null,null,null,null,null,null,null,null,null,null,null,null,null,null,null,null,null,null,null,null,null,null,null,null,null,null,null,null,null,null,null,null,null,null,null,null,null,null,null,null,{"$f":"Dateneingabe!N151","v":145},null,{"$f":"Dateneingabe!K151","v":0},{"$f":"Dateneingabe!L151","v":0},{"$f":"Dateneingabe!M151","v":0},{"$f":"COUNTIFS(E149:NF149,\"U\")","v":0},{"$f":"NL149-NM149","v":0}]
[{"$f":"IF(Dateneingabe!A152=0,\"zzz\",Dateneingabe!A152)","v":"zzz"},{"$f":"IF(Dateneingabe!B152=0,\"zzz\",Dateneingabe!B152)","v":"zzz"},{"$f":"IF(Dateneingabe!C152=0,\"zzz\",Dateneingabe!C152)","v":"zzz"},{"$f":"IF($D$3<$E$1,\"<?\",IF($D$3>$NF$1,\">?\",LOOKUP($D$3,$E$1:$NF$1,E150:NF150)))","v":0},null,null,null,null,null,null,null,null,null,null,null,null,null,null,null,null,null,null,null,null,null,null,null,null,null,null,null,null,null,null,null,null,null,null,null,null,null,null,null,null,null,null,null,null,null,null,null,null,null,null,null,null,null,null,null,null,null,null,null,null,null,null,null,null,null,null,null,null,null,null,null,null,null,null,null,null,null,null,null,null,null,null,null,null,null,null,null,null,null,null,null,null,null,null,null,null,null,null,null,null,null,null,null,null,null,null,null,null,null,null,null,null,null,null,null,null,null,null,null,null,null,null,null,null,null,null,null,null,null,null,null,null,null,null,null,null,null,null,null,null,null,null,null,null,null,null,null,null,null,null,null,null,null,null,null,null,null,null,null,null,null,null,null,null,null,null,null,null,null,null,null,null,null,null,null,null,null,null,null,null,null,null,null,null,null,null,null,null,null,null,null,null,null,null,null,null,null,null,null,null,null,null,null,null,null,null,null,null,null,null,null,null,null,null,null,null,null,null,null,null,null,null,null,null,null,null,null,null,null,null,null,null,null,null,null,null,null,null,null,null,null,null,null,null,null,null,null,null,null,null,null,null,null,null,null,null,null,null,null,null,null,null,null,null,null,null,null,null,null,null,null,null,null,null,null,null,null,null,null,null,null,null,null,null,null,null,null,null,null,null,null,null,null,null,null,null,null,null,null,null,null,null,null,null,null,null,null,null,null,null,null,null,null,null,null,null,null,null,null,null,null,null,null,null,null,null,null,null,null,null,null,null,null,null,null,null,null,null,null,null,null,null,null,null,null,null,null,null,null,null,null,null,null,null,null,null,null,null,null,null,null,null,null,null,null,null,null,{"$f":"Dateneingabe!N152","v":146},null,{"$f":"Dateneingabe!K152","v":0},{"$f":"Dateneingabe!L152","v":0},{"$f":"Dateneingabe!M152","v":0},{"$f":"COUNTIFS(E150:NF150,\"U\")","v":0},{"$f":"NL150-NM150","v":0}]
[{"$f":"IF(Dateneingabe!A153=0,\"zzz\",Dateneingabe!A153)","v":"zzz"},{"$f":"IF(Dateneingabe!B153=0,\"zzz\",Dateneingabe!B153)","v":"zzz"},{"$f":"IF(Dateneingabe!C153=0,\"zzz\",Dateneingabe!C153)","v":"zzz"},{"$f":"IF($D$3<$E$1,\"<?\",IF($D$3>$NF$1,\">?\",LOOKUP($D$3,$E$1:$NF$1,E151:NF151)))","v":0},null,null,null,null,null,null,null,null,null,null,null,null,null,null,null,null,null,null,null,null,null,null,null,null,null,null,null,null,null,null,null,null,null,null,null,null,null,null,null,null,null,null,null,null,null,null,null,null,null,null,null,null,null,null,null,null,null,null,null,null,null,null,null,null,null,null,null,null,null,null,null,null,null,null,null,null,null,null,null,null,null,null,null,null,null,null,null,null,null,null,null,null,null,null,null,null,null,null,null,null,null,null,null,null,null,null,null,null,null,null,null,null,null,null,null,null,null,null,null,null,null,null,null,null,null,null,null,null,null,null,null,null,null,null,null,null,null,null,null,null,null,null,null,null,null,null,null,null,null,null,null,null,null,null,null,null,null,null,null,null,null,null,null,null,null,null,null,null,null,null,null,null,null,null,null,null,null,null,null,null,null,null,null,null,null,null,null,null,null,null,null,null,null,null,null,null,null,null,null,null,null,null,null,null,null,null,null,null,null,null,null,null,null,null,null,null,null,null,null,null,null,null,null,null,null,null,null,null,null,null,null,null,null,null,null,null,null,null,null,null,null,null,null,null,null,null,null,null,null,null,null,null,null,null,null,null,null,null,null,null,null,null,null,null,null,null,null,null,null,null,null,null,null,null,null,null,null,null,null,null,null,null,null,null,null,null,null,null,null,null,null,null,null,null,null,null,null,null,null,null,null,null,null,null,null,null,null,null,null,null,null,null,null,null,null,null,null,null,null,null,null,null,null,null,null,null,null,null,null,null,null,null,null,null,null,null,null,null,null,null,null,null,null,null,null,null,null,null,null,null,null,null,null,null,null,null,null,null,null,null,null,null,null,null,null,null,null,{"$f":"Dateneingabe!N153","v":147},null,{"$f":"Dateneingabe!K153","v":0},{"$f":"Dateneingabe!L153","v":0},{"$f":"Dateneingabe!M153","v":0},{"$f":"COUNTIFS(E151:NF151,\"U\")","v":0},{"$f":"NL151-NM151","v":0}]
[{"$f":"IF(Dateneingabe!A154=0,\"zzz\",Dateneingabe!A154)","v":"zzz"},{"$f":"IF(Dateneingabe!B154=0,\"zzz\",Dateneingabe!B154)","v":"zzz"},{"$f":"IF(Dateneingabe!C154=0,\"zzz\",Dateneingabe!C154)","v":"zzz"},{"$f":"IF($D$3<$E$1,\"<?\",IF($D$3>$NF$1,\">?\",LOOKUP($D$3,$E$1:$NF$1,E152:NF152)))","v":0},null,null,null,null,null,null,null,null,null,null,null,null,null,null,null,null,null,null,null,null,null,null,null,null,null,null,null,null,null,null,null,null,null,null,null,null,null,null,null,null,null,null,null,null,null,null,null,null,null,null,null,null,null,null,null,null,null,null,null,null,null,null,null,null,null,null,null,null,null,null,null,null,null,null,null,null,null,null,null,null,null,null,null,null,null,null,null,null,null,null,null,null,null,null,null,null,null,null,null,null,null,null,null,null,null,null,null,null,null,null,null,null,null,null,null,null,null,null,null,null,null,null,null,null,null,null,null,null,null,null,null,null,null,null,null,null,null,null,null,null,null,null,null,null,null,null,null,null,null,null,null,null,null,null,null,null,null,null,null,null,null,null,null,null,null,null,null,null,null,null,null,null,null,null,null,null,null,null,null,null,null,null,null,null,null,null,null,null,null,null,null,null,null,null,null,null,null,null,null,null,null,null,null,null,null,null,null,null,null,null,null,null,null,null,null,null,null,null,null,null,null,null,null,null,null,null,null,null,null,null,null,null,null,null,null,null,null,null,null,null,null,null,null,null,null,null,null,null,null,null,null,null,null,null,null,null,null,null,null,null,null,null,null,null,null,null,null,null,null,null,null,null,null,null,null,null,null,null,null,null,null,null,null,null,null,null,null,null,null,null,null,null,null,null,null,null,null,null,null,null,null,null,null,null,null,null,null,null,null,null,null,null,null,null,null,null,null,null,null,null,null,null,null,null,null,null,null,null,null,null,null,null,null,null,null,null,null,null,null,null,null,null,null,null,null,null,null,null,null,null,null,null,null,null,null,null,null,null,null,null,null,null,null,null,null,null,null,{"$f":"Dateneingabe!N154","v":148},null,{"$f":"Dateneingabe!K154","v":0},{"$f":"Dateneingabe!L154","v":0},{"$f":"Dateneingabe!M154","v":0},{"$f":"COUNTIFS(E152:NF152,\"U\")","v":0},{"$f":"NL152-NM152","v":0}]
[{"$f":"IF(Dateneingabe!A155=0,\"zzz\",Dateneingabe!A155)","v":"zzz"},{"$f":"IF(Dateneingabe!B155=0,\"zzz\",Dateneingabe!B155)","v":"zzz"},{"$f":"IF(Dateneingabe!C155=0,\"zzz\",Dateneingabe!C155)","v":"zzz"},{"$f":"IF($D$3<$E$1,\"<?\",IF($D$3>$NF$1,\">?\",LOOKUP($D$3,$E$1:$NF$1,E153:NF153)))","v":0},null,null,null,null,null,null,null,null,null,null,null,null,null,null,null,null,null,null,null,null,null,null,null,null,null,null,null,null,null,null,null,null,null,null,null,null,null,null,null,null,null,null,null,null,null,null,null,null,null,null,null,null,null,null,null,null,null,null,null,null,null,null,null,null,null,null,null,null,null,null,null,null,null,null,null,null,null,null,null,null,null,null,null,null,null,null,null,null,null,null,null,null,null,null,null,null,null,null,null,null,null,null,null,null,null,null,null,null,null,null,null,null,null,null,null,null,null,null,null,null,null,null,null,null,null,null,null,null,null,null,null,null,null,null,null,null,null,null,null,null,null,null,null,null,null,null,null,null,null,null,null,null,null,null,null,null,null,null,null,null,null,null,null,null,null,null,null,null,null,null,null,null,null,null,null,null,null,null,null,null,null,null,null,null,null,null,null,null,null,null,null,null,null,null,null,null,null,null,null,null,null,null,null,null,null,null,null,null,null,null,null,null,null,null,null,null,null,null,null,null,null,null,null,null,null,null,null,null,null,null,null,null,null,null,null,null,null,null,null,null,null,null,null,null,null,null,null,null,null,null,null,null,null,null,null,null,null,null,null,null,null,null,null,null,null,null,null,null,null,null,null,null,null,null,null,null,null,null,null,null,null,null,null,null,null,null,null,null,null,null,null,null,null,null,null,null,null,null,null,null,null,null,null,null,null,null,null,null,null,null,null,null,null,null,null,null,null,null,null,null,null,null,null,null,null,null,null,null,null,null,null,null,null,null,null,null,null,null,null,null,null,null,null,null,null,null,null,null,null,null,null,null,null,null,null,null,null,null,null,null,null,null,null,null,null,null,null,{"$f":"Dateneingabe!N155","v":149},null,{"$f":"Dateneingabe!K155","v":0},{"$f":"Dateneingabe!L155","v":0},{"$f":"Dateneingabe!M155","v":0},{"$f":"COUNTIFS(E153:NF153,\"U\")","v":0},{"$f":"NL153-NM153","v":0}]
[{"$f":"IF(Dateneingabe!A156=0,\"zzz\",Dateneingabe!A156)","v":"zzz"},{"$f":"IF(Dateneingabe!B156=0,\"zzz\",Dateneingabe!B156)","v":"zzz"},{"$f":"IF(Dateneingabe!C156=0,\"zzz\",Dateneingabe!C156)","v":"zzz"},{"$f":"IF($D$3<$E$1,\"<?\",IF($D$3>$NF$1,\">?\",LOOKUP($D$3,$E$1:$NF$1,E154:NF154)))","v":0},null,null,null,null,null,null,null,null,null,null,null,null,null,null,null,null,null,null,null,null,null,null,null,null,null,null,null,null,null,null,null,null,null,null,null,null,null,null,null,null,null,null,null,null,null,null,null,null,null,null,null,null,null,null,null,null,null,null,null,null,null,null,null,null,null,null,null,null,null,null,null,null,null,null,null,null,null,null,null,null,null,null,null,null,null,null,null,null,null,null,null,null,null,null,null,null,null,null,null,null,null,null,null,null,null,null,null,null,null,null,null,null,null,null,null,null,null,null,null,null,null,null,null,null,null,null,null,null,null,null,null,null,null,null,null,null,null,null,null,null,null,null,null,null,null,null,null,null,null,null,null,null,null,null,null,null,null,null,null,null,null,null,null,null,null,null,null,null,null,null,null,null,null,null,null,null,null,null,null,null,null,null,null,null,null,null,null,null,null,null,null,null,null,null,null,null,null,null,null,null,null,null,null,null,null,null,null,null,null,null,null,null,null,null,null,null,null,null,null,null,null,null,null,null,null,null,null,null,null,null,null,null,null,null,null,null,null,null,null,null,null,null,null,null,null,null,null,null,null,null,null,null,null,null,null,null,null,null,null,null,null,null,null,null,null,null,null,null,null,null,null,null,null,null,null,null,null,null,null,null,null,null,null,null,null,null,null,null,null,null,null,null,null,null,null,null,null,null,null,null,null,null,null,null,null,null,null,null,null,null,null,null,null,null,null,null,null,null,null,null,null,null,null,null,null,null,null,null,null,null,null,null,null,null,null,null,null,null,null,null,null,null,null,null,null,null,null,null,null,null,null,null,null,null,null,null,null,null,null,null,null,null,null,null,null,null,null,{"$f":"Dateneingabe!N156","v":150},null,{"$f":"Dateneingabe!K156","v":0},{"$f":"Dateneingabe!L156","v":0},{"$f":"Dateneingabe!M156","v":0},{"$f":"COUNTIFS(E154:NF154,\"U\")","v":0},{"$f":"NL154-NM154","v":0}]
[]
[]
[]
[]
[]
[]
[]
[]
[]
[]
[]
[]
[]
[]
[]
[]
[]
[]
[]
[]
[]
[]
[]
[]
[]
[]
[]
[]
[]
[]
[]
[]
[]
[]
[]
[]
[]
[]
[]
[]
[]
[]
[]
[]
[null,null,null,null,null,null,null,null,null,null,null,null,null,null,null,null,null,null,null,null,null,null,null,null,null,null,null,null,null,null,null,null,null,null,null,null,null,null,null,null,null,null,null,null,null,null,null,null,null,null,null,null,null,null,null,null,null,null,null,null,null,null,null,null,null,null,null,null,null,null,null,null,null,null,null,null,null,null,null,null,null,null,null,null,null,null,null,null,null,null,null,null,null,null,null,null,null,null,null,null,null,null,null,null,null,null,null,null,null,null,null,null,null,null,null,null,null,null,null,null,null,null,null,null,null,null,null,null,null,null,null,null,null,null,null,null,null,null,null,null,null,null,null,null,null,null,null,null,null,null,null,null,null,null,null,null,null,null,null,null,null,null,null,null,null,null,null,null,null,null,null,null,null,null,null,null,null,null,null,null,null,null,null,null,null,null,null,null,null,null,null,null,null,null,null,null,null,null,null,null,null,null,null,null,null,null,null,null,null,null,null,null,null,null,null,null,null,null,null,null,null,null,null,null,null,null,null,null,null,null,null,null,null,null,null,null,null,null,null,null,null,null,null,null,null,null,null,null,null,null,null,null,null,null,null,null,null,null,null,null,null,null,null,null,null,null,null,null,null,null,null,null,null,null,null,null,null,null,null,null,null,null,null,null,null,null,null,null,null,null,null,null,null,null,null,null,null,null,null,null,null,null,null,null,null,null,null,null,null,null,null,null,null,null,null,null,null,null,null,null,null,null,null,null,null,null,null,null,null,null,null,null,null,null,null,null,null,null,null,null,null,null,null,null,null,null,null,null,null,null,null,null,null,null,null,null,null,null,null,null,null,null,null,null,null,null,null,null,null,null,null,null,null,"Januar","Februar","März","April","Mai","Juni","Juli","August","September","Oktober","November","Dezember","Gesamt"]
[{"$f":"$A$5","v":"zzz"},{"$f":"$B$5","v":"zzz"},{"$f":"SUM(E200:NF200)","v":0},null,{"$f":"IF(E5=\"F\",1,IF(E5=\"F1\",1,IF(E5=\"F2\",1,IF(E5=\"F3\",1,0))))","v":0},{"$f":"IF(F5=\"F\",1,IF(F5=\"F1\",1,IF(F5=\"F2\",1,IF(F5=\"F3\",1,0))))","v":0},0,0,0,0,0,0,0,0,0,0,0,0,0,0,0,0,0,0,0,0,0,0,0,0,0,0,0,0,0,0,0,0,0,0,0,0,0,0,0,0,0,0,0,0,0,0,0,0,0,0,0,0,0,0,0,0,0,0,0,0,0,0,0,{"$f":"IF(BR5=\"F\",1,IF(BR5=\"F1\",1,IF(BR5=\"F2\",1,IF(BR5=\"F3\",1,0))))","v":0},0,0,0,0,0,0,0,0,0,0,0,0,0,0,0,0,0,0,0,0,0,0,0,0,0,0,0,0,0,0,0,0,0,0,0,0,0,0,0,0,0,0,0,0,0,0,0,0,0,0,0,0,0,0,0,0,0,0,0,0,0,0,0,{"$f":"IF(ED5=\"F\",1,IF(ED5=\"F1\",1,IF(ED5=\"F2\",1,IF(ED5=\"F3\",1,0))))","v":0},0,0,0,0,0,0,0,0,0,0,0,0,0,0,0,0,0,0,0,0,0,0,0,0,0,0,0,0,0,0,0,0,0,0,0,0,0,0,0,0,0,0,0,0,0,0,0,0,0,0,0,0,0,0,0,0,0,0,0,0,0,0,0,{"$f":"IF(GP5=\"F\",1,IF(GP5=\"F1\",1,IF(GP5=\"F2\",1,IF(GP5=\"F3\",1,0))))","v":0},0,0,0,0,0,0,0,0,0,0,0,0,0,0,0,0,0,0,0,0,0,0,0,0,0,0,0,0,0,0,0,0,0,0,0,0,0,0,0,0,0,0,0,0,0,0,0,0,0,0,0,0,0,0,0,0,0,0,0,0,0,0,0,{"$f":"IF(JB5=\"F\",1,IF(JB5=\"F1\",1,IF(JB5=\"F2\",1,IF(JB5=\"F3\",1,0))))","v":0},0,0,0,0,0,0,0,0,0,0,0,0,0,0,0,0,0,0,0,0,0,0,0,0,0,0,0,0,0,0,0,0,0,0,0,0,0,0,0,0,0,0,0,0,0,0,0,0,0,0,0,0,0,0,0,0,0,0,0,0,0,0,0,{"$f":"IF(LN5=\"F\",1,IF(LN5=\"F1\",1,IF(LN5=\"F2\",1,IF(LN5=\"F3\",1,0))))","v":0},0,0,0,0,0,0,0,0,0,0,0,0,0,0,0,0,0,0,0,0,0,0,0,0,0,0,0,0,0,0,0,0,0,0,0,0,0,0,0,0,0,0,0,0,null,null,null,{"$f":"SUM(E200:AI200)","v":0},{"$f":"SUM(AJ200:BL200)","v":0},{"$f":"SUM(BM200:CQ200)","v":0},{"$f":"SUM(CR200:DU200)","v":0},{"$f":"SUM(DV200:EZ200)","v":0},{"$f":"SUM(FA200:GD200)","v":0},{"$f":"SUM(GE200:HI200)","v":0},{"$f":"SUM(HJ200:IN200)","v":0},{"$f":"SUM(IO200:JR200)","v":0},{"$f":"SUM(JS200:KW200)","v":0},{"$f":"SUM(KX200:MA200)","v":0},{"$f":"SUM(MB200:NF200)","v":0},{"$f":"SUM(NJ200:NU200)","v":0}]
[{"$f":"$A$6","v":"zzz"},{"$f":"$B$6","v":"zzz"},{"$f":"SUM(E201:NF201)","v":0},null,{"$f":"IF(E6=\"F\",1,IF(E6=\"F1\",1,IF(E6=\"F2\",1,IF(E6=\"F3\",1,0))))","v":0},0,0,0,0,0,0,0,0,0,0,0,0,0,0,0,0,0,0,0,0,0,0,0,0,0,0,0,0,0,0,0,0,0,0,0,0,0,0,0,0,0,0,0,0,0,0,0,0,0,0,0,0,0,0,0,0,0,0,0,0,0,0,0,0,0,0,0,0,0,0,0,0,0,0,0,0,0,0,0,0,0,0,0,0,0,0,0,0,0,0,0,0,0,0,0,0,0,0,0,0,0,0,0,0,0,0,0,0,0,0,0,0,0,0,0,0,0,0,0,0,0,0,0,0,0,0,0,0,0,0,0,0,0,0,0,0,0,0,0,0,0,0,0,0,0,0,0,0,0,0,0,0,0,0,0,0,0,0,0,0,0,0,0,0,0,0,0,0,0,0,0,0,0,0,0,0,0,0,0,0,0,0,0,0,0,0,0,0,0,0,0,0,0,0,0,0,0,0,0,0,0,0,0,0,0,0,0,0,0,0,0,0,0,0,0,0,0,0,0,0,0,0,0,0,0,0,0,0,0,0,0,0,0,0,0,0,0,0,0,0,0,0,0,0,0,0,0,0,0,0,0,0,0,0,0,0,0,0,0,0,0,0,0,0,0,0,0,0,0,0,0,0,0,0,0,0,0,0,0,0,0,0,0,0,0,0,0,0,0,0,0,0,0,0,0,0,0,0,0,0,0,0,0,0,0,0,0,0,0,0,0,0,0,0,0,0,0,0,0,0,0,0,0,0,0,0,0,0,0,0,0,0,0,0,0,0,0,0,0,0,0,0,0,0,0,0,0,0,0,0,0,0,0,0,0,0,0,0,0,0,0,0,0,0,0,null,null,null,{"$f":"SUM(E201:AI201)","v":0},{"$f":"SUM(AJ201:BL201)","v":0},{"$f":"SUM(BM201:CQ201)","v":0},{"$f":"SUM(CR201:DU201)","v":0},{"$f":"SUM(DV201:EZ201)","v":0},{"$f":"SUM(FA201:GD201)","v":0},{"$f":"SUM(GE201:HI201)","v":0},{"$f":"SUM(HJ201:IN201)","v":0},{"$f":"SUM(IO201:JR201)","v":0},{"$f":"SUM(JS201:KW201)","v":0},{"$f":"SUM(KX201:MA201)","v":0},{"$f":"SUM(MB201:NF201)","v":0},{"$f":"SUM(NJ201:NU201)","v":0}]
[]
[]
[]
[]
[]
[]
[]
[]
[]
[]
[]
[]
[]
[]
[]
[]
[]
[]
[]
[]
[]
[]
[]
[]
[]
[]
[]
[]
[]
[]
[]
[]
[]
[]
[]
[]
[]
[]
[]
[]
[]
[]
[]
[]
[]
[]
[]
[]
[]
[]
[]
[]
[]
[]
[]
[]
[]
[]
[]
[]
[]
[]
[]
[]
[]
[]
[]
[]
[]
[]
[]
[]
[]
[]
[]
[]
[]
[]
[]
[]
[]
[]
[]
[]
[]
[]
[]
[]
[]
[]
[]
[]
[]
[]
[]
[]
[]
[]
[]
[]
[]
[]
[]
[]
[]
[]
[]
[]
[]
[]
[]
[]
[]
[]
[]
[]
[]
[]
[]
[]
[]
[]
[]
[]
[]
[]
[]
[]
[]
[]
[]
[]
[]
[]
[]
[]
[]
[]
[]
[]
[]
[]
[]
[]
[]
[]
[]
[]
[null,null,null,null,null,null,null,null,null,null,null,null,null,null,null,null,null,null,null,null,null,null,null,null,null,null,null,null,null,null,null,null,null,null,null,null,null,null,null,null,null,null,null,null,null,null,null,null,null,null,null,null,null,null,null,null,null,null,null,null,null,null,null,null,null,null,null,null,null,null,null,null,null,null,null,null,null,null,null,null,null,null,null,null,null,null,null,null,null,null,null,null,null,null,null,null,null,null,null,null,null,null,null,null,null,null,null,null,null,null,null,null,null,null,null,null,null,null,null,null,null,null,null,null,null,null,null,null,null,null,null,null,null,null,null,null,null,null,null,null,null,null,null,null,null,null,null,null,null,null,null,null,null,null,null,null,null,null,null,null,null,null,null,null,null,null,null,null,null,null,null,null,null,null,null,null,null,null,null,null,null,null,null,null,null,null,null,null,null,null,null,null,null,null,null,null,null,null,null,null,null,null,null,null,null,null,null,null,null,null,null,null,null,null,null,null,null,null,null,null,null,null,null,null,null,null,null,null,null,null,null,null,null,null,null,null,null,null,null,null,null,null,null,null,null,null,null,null,null,null,null,null,null,null,null,null,null,null,null,null,null,null,null,null,null,null,null,null,null,null,null,null,null,null,null,null,null,null,null,null,null,null,null,null,null,null,null,null,null,null,null,null,null,null,null,null,null,null,null,null,null,null,null,null,null,null,null,null,null,null,null,null,null,null,null,null,null,null,null,null,null,null,null,null,null,null,null,null,null,null,null,null,null,null,null,null,null,null,null,null,null,null,null,null,null,null,null,null,null,null,null,null,null,null,null,null,null,null,null,null,null,null,null,null,null,null,null,null,null,null,null,null,null,{"$f":"SUM(NJ200:NJ349)","v":0},{"$f":"SUM(NK200:NK349)","v":0},0,0,0,0,0,0,0,0,0,0,0]
[{"$f":"$A$5","v":"zzz"},{"$f":"$B$5","v":"zzz"},{"$f":"SUM(E351:NF351)","v":0},null,{"$f":"IF(E5=\"S\",1,IF(E5=\"S2\",1,IF(E5=\"S3\",1,0)))","v":0},0,0,0,0,0,0,0,0,0,0,0,0,0,0,0,0,0,0,0,0,0,0,0,0,0,0,0,0,0,0,0,0,0,0,0,0,0,0,0,0,0,0,0,0,0,0,0,0,0,0,0,0,0,0,0,0,0,0,0,0,0,0,0,{"$f":"IF(BQ5=\"S\",1,IF(BQ5=\"S2\",1,IF(BQ5=\"S3\",1,0)))","v":0},0,0,0,0,0,0,0,0,0,0,0,0,0,0,0,0,0,0,0,0,0,0,0,0,0,0,0,0,0,0,0,0,0,0,0,0,0,0,0,0,0,0,0,0,0,0,0,0,0,0,0,0,0,0,0,0,0,0,0,0,0,0,0,{"$f":"IF(EC5=\"S\",1,IF(EC5=\"S2\",1,IF(EC5=\"S3\",1,0)))","v":0},0,0,0,0,0,0,0,0,0,0,0,0,0,0,0,0,0,0,0,0,0,0,0,0,0,0,0,0,0,0,0,0,0,0,0,0,0,0,0,0,0,0,0,0,0,0,0,0,0,0,0,0,0,0,0,0,0,0,0,0,0,0,0,{"$f":"IF(GO5=\"S\",1,IF(GO5=\"S2\",1,IF(GO5=\"S3\",1,0)))","v":0},0,0,0,0,0,0,0,0,0,0,0,0,0,0,0,0,0,0,0,0,0,0,0,0,0,0,0,0,0,0,0,0,0,0,0,0,0,0,0,0,0,0,0,0,0,0,0,0,0,0,0,0,0,0,0,0,0,0,0,0,0,0,0,{"$f":"IF(JA5=\"S\",1,IF(JA5=\"S2\",1,IF(JA5=\"S3\",1,0)))","v":0},0,0,0,0,0,0,0,0,0,0,0,0,0,0,0,0,0,0,0,0,0,0,0,0,0,0,0,0,0,0,0,0,0,0,0,0,0,0,0,0,0,0,0,0,0,0,0,0,0,0,0,0,0,0,0,0,0,0,0,0,0,0,0,{"$f":"IF(LM5=\"S\",1,IF(LM5=\"S2\",1,IF(LM5=\"S3\",1,0)))","v":0},0,0,0,0,0,0,0,0,0,0,0,0,0,0,0,0,0,0,0,0,0,0,0,0,0,0,0,0,0,0,0,0,0,0,0,0,0,0,0,0,0,0,0,0,0,null,null,null,{"$f":"SUM(E351:AI351)","v":0},{"$f":"SUM(AJ351:BL351)","v":0},{"$f":"SUM(BM351:CQ351)","v":0},{"$f":"SUM(CR351:DU351)","v":0},{"$f":"SUM(DV351:EZ351)","v":0},{"$f":"SUM(FA351:GD351)","v":0},{"$f":"SUM(GE351:HI351)","v":0},{"$f":"SUM(HJ351:IN351)","v":0},{"$f":"SUM(IO351:JR351)","v":0},{"$f":"SUM(JS351:KW351)","v":0},{"$f":"SUM(KX351:MA351)","v":0},{"$f":"SUM(MB351:NF351)","v":0},{"$f":"SUM(NJ351:NU351)","v":0}]
[{"$f":"$A$6","v":"zzz"},{"$f":"$B$6","v":"zzz"},{"$f":"SUM(E352:NF352)","v":0},null,{"$f":"IF(E6=\"S\",1,IF(E6=\"S2\",1,IF(E6=\"S3\",1,0)))","v":0},0,0,0,0,0,0,0,0,0,0,0,0,0,0,0,0,0,0,0,0,0,0,0,0,0,0,0,0,0,0,0,0,0,0,0,0,0,0,0,0,0,0,0,0,0,0,0,0,0,0,0,0,0,0,0,0,0,0,0,0,0,0,0,{"$f":"IF(BQ6=\"S\",1,IF(BQ6=\"S2\",1,IF(BQ6=\"S3\",1,0)))","v":0},0,0,0,0,0,0,0,0,0,0,0,0,0,0,0,0,0,0,0,0,0,0,0,0,0,0,0,0,0,0,0,0,0,0,0,0,0,0,0,0,0,0,0,0,0,0,0,0,0,0,0,0,0,0,0,0,0,0,0,0,0,0,0,{"$f":"IF(EC6=\"S\",1,IF(EC6=\"S2\",1,IF(EC6=\"S3\",1,0)))","v":0},0,0,0,0,0,0,0,0,0,0,0,0,0,0,0,0,0,0,0,0,0,0,0,0,0,0,0,0,0,0,0,0,0,0,0,0,0,0,0,0,0,0,0,0,0,0,0,0,0,0,0,0,0,0,0,0,0,0,0,0,0,0,0,{"$f":"IF(GO6=\"S\",1,IF(GO6=\"S2\",1,IF(GO6=\"S3\",1,0)))","v":0},0,0,0,0,0,0,0,0,0,0,0,0,0,0,0,0,0,0,0,0,0,0,0,0,0,0,0,0,0,0,0,0,0,0,0,0,0,0,0,0,0,0,0,0,0,0,0,0,0,0,0,0,0,0,0,0,0,0,0,0,0,0,0,{"$f":"IF(JA6=\"S\",1,IF(JA6=\"S2\",1,IF(JA6=\"S3\",1,0)))","v":0},0,0,0,0,0,0,0,0,0,0,0,0,0,0,0,0,0,0,0,0,0,0,0,0,0,0,0,0,0,0,0,0,0,0,0,0,0,0,0,0,0,0,0,0,0,0,0,0,0,0,0,0,0,0,0,0,0,0,0,0,0,0,0,{"$f":"IF(LM6=\"S\",1,IF(LM6=\"S2\",1,IF(LM6=\"S3\",1,0)))","v":0},0,0,0,0,0,0,0,0,0,0,0,0,0,0,0,0,0,0,0,0,0,0,0,0,0,0,0,0,0,0,0,0,0,0,0,0,0,0,0,0,0,0,0,0,0,null,null,null,{"$f":"SUM(E352:AI352)","v":0},{"$f":"SUM(AJ352:BL352)","v":0},{"$f":"SUM(BM352:CQ352)","v":0},{"$f":"SUM(CR352:DU352)","v":0},{"$f":"SUM(DV352:EZ352)","v":0},{"$f":"SUM(FA352:GD352)","v":0},{"$f":"SUM(GE352:HI352)","v":0},{"$f":"SUM(HJ352:IN352)","v":0},{"$f":"SUM(IO352:JR352)","v":0},{"$f":"SUM(JS352:KW352)","v":0},{"$f":"SUM(KX352:MA352)","v":0},{"$f":"SUM(MB352:NF352)","v":0},{"$f":"SUM(NJ352:NU352)","v":0}]
[]
[]
[]
[]
[]
[]
[]
[]
[]
[]
[]
[]
[]
[]
[]
[]
[]
[]
[]
[]
[]
[]
[]
[]
[]
[]
[]
[]
[]
[]
[]
[]
[]
[]
[]
[]
[]
[]
[]
[]
[]
[]
[]
[]
[]
[]
[]
[]
[]
[]
[]
[]
[]
[]
[]
[]
[]
[]
[]
[]
[]
[]
[]
[]
[]
[]
[]
[]
[]
[]
[]
[]
[]
[]
[]
[]
[]
[]
[]
[]
[]
[]
[]
[]
[]
[]
[]
[]
[]
[]
[]
[]
[]
[]
[]
[]
[]
[]
[]
[]
[]
[]
[]
[]
[]
[]
[]
[]
[]
[]
[]
[]
[]
[]
[]
[]
[]
[]
[]
[]
[]
[]
[]
[]
[]
[]
[]
[]
[]
[]
[]
[]
[]
[]
[]
[]
[]
[]
[]
[]
[]
[]
[]
[]
[]
[]
[]
[]
[null,null,null,null,null,null,null,null,null,null,null,null,null,null,null,null,null,null,null,null,null,null,null,null,null,null,null,null,null,null,null,null,null,null,null,null,null,null,null,null,null,null,null,null,null,null,null,null,null,null,null,null,null,null,null,null,null,null,null,null,null,null,null,null,null,null,null,null,null,null,null,null,null,null,null,null,null,null,null,null,null,null,null,null,null,null,null,null,null,null,null,null,null,null,null,null,null,null,null,null,null,null,null,null,null,null,null,null,null,null,null,null,null,null,null,null,null,null,null,null,null,null,null,null,null,null,null,null,null,null,null,null,null,null,null,null,null,null,null,null,null,null,null,null,null,null,null,null,null,null,null,null,null,null,null,null,null,null,null,null,null,null,null,null,null,null,null,null,null,null,null,null,null,null,null,null,null,null,null,null,null,null,null,null,null,null,null,null,null,null,null,null,null,null,null,null,null,null,null,null,null,null,null,null,null,null,null,null,null,null,null,null,null,null,null,null,null,null,null,null,null,null,null,null,null,null,null,null,null,null,null,null,null,null,null,null,null,null,null,null,null,null,null,null,null,null,null,null,null,null,null,null,null,null,null,null,null,null,null,null,null,null,null,null,null,null,null,null,null,null,null,null,null,null,null,null,null,null,null,null,null,null,null,null,null,null,null,null,null,null,null,null,null,null,null,null,null,null,null,null,null,null,null,null,null,null,null,null,null,null,null,null,null,null,null,null,null,null,null,null,null,null,null,null,null,null,null,null,null,null,null,null,null,null,null,null,null,null,null,null,null,null,null,null,null,null,null,null,null,null,null,null,null,null,null,null,null,null,null,null,null,null,null,null,null,null,null,null,null,null,null,null,null,{"$f":"SUM(NJ351:NJ500)","v":0},{"$f":"SUM(NK351:NK500)","v":0},0,0,0,0,0,0,0,0,0,0,0]
[{"$f":"$A$5","v":"zzz"},{"$f":"$B$5","v":"zzz"},{"$f":"SUM(E502:NF502)","v":0},null,{"$f":"IF(E5=\"N\",1,0)","v":0},0,0,0,0,0,0,0,0,0,0,0,0,0,0,0,0,0,0,0,0,0,0,0,0,0,0,0,0,0,0,0,0,0,0,0,0,0,0,0,0,0,0,0,0,0,0,0,0,0,0,0,0,0,0,0,0,0,0,0,0,0,0,0,{"$f":"IF(BQ5=\"N\",1,0)","v":0},0,0,0,0,0,0,0,0,0,0,0,0,0,0,0,0,0,0,0,0,0,0,0,0,0,0,0,0,0,0,0,0,0,0,0,0,0,0,0,0,0,0,0,0,0,0,0,0,0,0,0,0,0,0,0,0,0,0,0,0,0,0,0,{"$f":"IF(EC5=\"N\",1,0)","v":0},0,0,0,0,0,0,0,0,0,0,0,0,0,0,0,0,0,0,0,0,0,0,0,0,0,0,0,0,0,0,0,0,0,0,0,0,0,0,0,0,0,0,0,0,0,0,0,0,0,0,0,0,0,0,0,0,0,0,0,0,0,0,0,{"$f":"IF(GO5=\"N\",1,0)","v":0},0,0,0,0,0,0,0,0,0,0,0,0,0,0,0,0,0,0,0,0,0,0,0,0,0,0,0,0,0,0,0,0,0,0,0,0,0,0,0,0,0,0,0,0,0,0,0,0,0,0,0,0,0,0,0,0,0,0,0,0,0,0,0,{"$f":"IF(JA5=\"N\",1,0)","v":0},0,0,0,0,0,0,0,0,0,0,0,0,0,0,0,0,0,0,0,0,0,0,0,0,0,0,0,0,0,0,0,0,0,0,0,0,0,0,0,0,0,0,0,0,0,0,0,0,0,0,0,0,0,0,0,0,0,0,0,0,0,0,0,{"$f":"IF(LM5=\"N\",1,0)","v":0},0,0,0,0,0,0,0,0,0,0,0,0,0,0,0,0,0,0,0,0,0,0,0,0,0,0,0,0,0,0,0,0,0,0,0,0,0,0,0,0,0,0,0,0,0,null,null,null,{"$f":"SUM(E502:AI502)","v":0},{"$f":"SUM(AJ502:BL502)","v":0},{"$f":"SUM(BM502:CQ502)","v":0},{"$f":"SUM(CR502:DU502)","v":0},{"$f":"SUM(DV502:EZ502)","v":0},{"$f":"SUM(FA502:GD502)","v":0},{"$f":"SUM(GE502:HI502)","v":0},{"$f":"SUM(HJ502:IN502)","v":0},{"$f":"SUM(IO502:JR502)","v":0},{"$f":"SUM(JS502:KW502)","v":0},{"$f":"SUM(KX502:MA502)","v":0},{"$f":"SUM(MB502:NF502)","v":0},{"$f":"SUM(NJ502:NU502)","v":0}]
[{"$f":"$A$6","v":"zzz"},{"$f":"$B$6","v":"zzz"},{"$f":"SUM(E503:NF503)","v":0},null,{"$f":"IF(E6=\"N\",1,0)","v":0},0,0,0,0,0,0,0,0,0,0,0,0,0,0,0,0,0,0,0,0,0,0,0,0,0,0,0,0,0,0,0,0,0,0,0,0,0,0,0,0,0,0,0,0,0,0,0,0,0,0,0,0,0,0,0,0,0,0,0,0,0,0,0,{"$f":"IF(BQ6=\"N\",1,0)","v":0},0,0,0,0,0,0,0,0,0,0,0,0,0,0,0,0,0,0,0,0,0,0,0,0,0,0,0,0,0,0,0,0,0,0,0,0,0,0,0,0,0,0,0,0,0,0,0,0,0,0,0,0,0,0,0,0,0,0,0,0,0,0,0,{"$f":"IF(EC6=\"N\",1,0)","v":0},0,0,0,0,0,0,0,0,0,0,0,0,0,0,0,0,0,0,0,0,0,0,0,0,0,0,0,0,0,0,0,0,0,0,0,0,0,0,0,0,0,0,0,0,0,0,0,0,0,0,0,0,0,0,0,0,0,0,0,0,0,0,0,{"$f":"IF(GO6=\"N\",1,0)","v":0},0,0,0,0,0,0,0,0,0,0,0,0,0,0,0,0,0,0,0,0,0,0,0,0,0,0,0,0,0,0,0,0,0,0,0,0,0,0,0,0,0,0,0,0,0,0,0,0,0,0,0,0,0,0,0,0,0,0,0,0,0,0,0,{"$f":"IF(JA6=\"N\",1,0)","v":0},0,0,0,0,0,0,0,0,0,0,0,0,0,0,0,0,0,0,0,0,0,0,0,0,0,0,0,0,0,0,0,0,0,0,0,0,0,0,0,0,0,0,0,0,0,0,0,0,0,0,0,0,0,0,0,0,0,0,0,0,0,0,0,{"$f":"IF(LM6=\"N\",1,0)","v":0},0,0,0,0,0,0,0,0,0,0,0,0,0,0,0,0,0,0,0,0,0,0,0,0,0,0,0,0,0,0,0,0,0,0,0,0,0,0,0,0,0,0,0,0,0,null,null,null,{"$f":"SUM(E503:AI503)","v":0},{"$f":"SUM(AJ503:BL503)","v":0},{"$f":"SUM(BM503:CQ503)","v":0},{"$f":"SUM(CR503:DU503)","v":0},{"$f":"SUM(DV503:EZ503)","v":0},{"$f":"SUM(FA503:GD503)","v":0},{"$f":"SUM(GE503:HI503)","v":0},{"$f":"SUM(HJ503:IN503)","v":0},{"$f":"SUM(IO503:JR503)","v":0},{"$f":"SUM(JS503:KW503)","v":0},{"$f":"SUM(KX503:MA503)","v":0},{"$f":"SUM(MB503:NF503)","v":0},{"$f":"SUM(NJ503:NU503)","v":0}]
[]
[]
[]
[]
[]
[]
[]
[]
[]
[]
[]
[]
[]
[]
[]
[]
[]
[]
[]
[]
[]
[]
[]
[]
[]
[]
[]
[]
[]
[]
[]
[]
[]
[]
[]
[]
[]
[]
[]
[]
[]
[]
[]
[]
[]
[]
[]
[]
[]
[]
[]
[]
[]
[]
[]
[]
[]
[]
[]
[]
[]
[]
[]
[]
[]
[]
[]
[]
[]
[]
[]
[]
[]
[]
[]
[]
[]
[]
[]
[]
[]
[]
[]
[]
[]
[]
[]
[]
[]
[]
[]
[]
[]
[]
[]
[]
[]
[]
[]
[]
[]
[]
[]
[]
[]
[]
[]
[]
[]
[]
[]
[]
[]
[]
[]
[]
[]
[]
[]
[]
[]
[]
[]
[]
[]
[]
[]
[]
[]
[]
[]
[]
[]
[]
[]
[]
[]
[]
[]
[]
[]
[]
[]
[]
[]
[]
[]
[]
[null,null,null,null,null,null,null,null,null,null,null,null,null,null,null,null,null,null,null,null,null,null,null,null,null,null,null,null,null,null,null,null,null,null,null,null,null,null,null,null,null,null,null,null,null,null,null,null,null,null,null,null,null,null,null,null,null,null,null,null,null,null,null,null,null,null,null,null,null,null,null,null,null,null,null,null,null,null,null,null,null,null,null,null,null,null,null,null,null,null,null,null,null,null,null,null,null,null,null,null,null,null,null,null,null,null,null,null,null,null,null,null,null,null,null,null,null,null,null,null,null,null,null,null,null,null,null,null,null,null,null,null,null,null,null,null,null,null,null,null,null,null,null,null,null,null,null,null,null,null,null,null,null,null,null,null,null,null,null,null,null,null,null,null,null,null,null,null,null,null,null,null,null,null,null,null,null,null,null,null,null,null,null,null,null,null,null,null,null,null,null,null,null,null,null,null,null,null,null,null,null,null,null,null,null,null,null,null,null,null,null,null,null,null,null,null,null,null,null,null,null,null,null,null,null,null,null,null,null,null,null,null,null,null,null,null,null,null,null,null,null,null,null,null,null,null,null,null,null,null,null,null,null,null,null,null,null,null,null,null,null,null,null,null,null,null,null,null,null,null,null,null,null,null,null,null,null,null,null,null,null,null,null,null,null,null,null,null,null,null,null,null,null,null,null,null,null,null,null,null,null,null,null,null,null,null,null,null,null,null,null,null,null,null,null,null,null,null,null,null,null,null,null,null,null,null,null,null,null,null,null,null,null,null,null,null,null,null,null,null,null,null,null,null,null,null,null,null,null,null,null,null,null,null,null,null,null,null,null,null,null,null,null,null,null,null,null,null,null,null,null,null,null,{"$f":"SUM(NJ502:NJ651)","v":0},{"$f":"SUM(NK502:NK651)","v":0},0,0,0,0,0,0,0,0,0,0,0]
[{"$f":"$A$5","v":"zzz"},{"$f":"$B$5","v":"zzz"},{"$f":"SUM(E653:NF653)","v":0},null,{"$f":"IF(E5=\"U\",1,0)","v":0},0,0,0,0,0,0,0,0,0,0,0,0,0,0,0,0,0,0,0,0,0,0,0,0,0,0,0,0,0,0,0,0,0,0,0,0,0,0,0,0,0,0,0,0,0,0,0,0,0,0,0,0,0,0,0,0,0,0,0,0,0,0,0,{"$f":"IF(BQ5=\"U\",1,0)","v":0},0,0,0,0,0,0,0,0,0,0,0,0,0,0,0,0,0,0,0,0,0,0,0,0,0,0,0,0,0,0,0,0,0,0,0,0,0,0,0,0,0,0,0,0,0,0,0,0,0,0,0,0,0,0,0,0,0,0,0,0,0,0,0,{"$f":"IF(EC5=\"U\",1,0)","v":0},0,0,0,0,0,0,0,0,0,0,0,0,0,0,0,0,0,0,0,0,0,0,0,0,0,0,0,0,0,0,0,0,0,0,0,0,0,0,0,0,0,0,0,0,0,0,0,0,0,0,0,0,0,0,0,0,0,0,0,0,0,0,0,{"$f":"IF(GO5=\"U\",1,0)","v":0},0,0,0,0,0,0,0,0,0,0,0,0,0,0,0,0,0,0,0,0,0,0,0,0,0,0,0,0,0,0,0,0,0,0,0,0,0,0,0,0,0,0,0,0,0,0,0,0,0,0,0,0,0,0,0,0,0,0,0,0,0,0,0,{"$f":"IF(JA5=\"U\",1,0)","v":0},0,0,0,0,0,0,0,0,0,0,0,0,0,0,0,0,0,0,0,0,0,0,0,0,0,0,0,0,0,0,0,0,0,0,0,0,0,0,0,0,0,0,0,0,0,0,0,0,0,0,0,0,0,0,0,0,0,0,0,0,0,0,0,{"$f":"IF(LM5=\"U\",1,0)","v":0},0,0,0,0,0,0,0,0,0,0,0,0,0,0,0,0,0,0,0,0,0,0,0,0,0,0,0,0,0,0,0,0,0,0,0,0,0,0,0,0,0,0,0,0,0,null,null,null,{"$f":"SUM(E653:AI653)","v":0},{"$f":"SUM(AJ653:BL653)","v":0},{"$f":"SUM(BM653:CQ653)","v":0},{"$f":"SUM(CR653:DU653)","v":0},{"$f":"SUM(DV653:EZ653)","v":0},{"$f":"SUM(FA653:GD653)","v":0},{"$f":"SUM(GE653:HI653)","v":0},{"$f":"SUM(HJ653:IN653)","v":0},{"$f":"SUM(IO653:JR653)","v":0},{"$f":"SUM(JS653:KW653)","v":0},{"$f":"SUM(KX653:MA653)","v":0},{"$f":"SUM(MB653:NF653)","v":0},{"$f":"SUM(NJ653:NU653)","v":0}]
[{"$f":"$A$6","v":"zzz"},{"$f":"$B$6","v":"zzz"},{"$f":"SUM(E654:NF654)","v":0},null,{"$f":"IF(E6=\"U\",1,0)","v":0},0,0,0,0,0,0,0,0,0,0,0,0,0,0,0,0,0,0,0,0,0,0,0,0,0,0,0,0,0,0,0,0,0,0,0,0,0,0,0,0,0,0,0,0,0,0,0,0,0,0,0,0,0,0,0,0,0,0,0,0,0,0,0,{"$f":"IF(BQ6=\"U\",1,0)","v":0},0,0,0,0,0,0,0,0,0,0,0,0,0,0,0,0,0,0,0,0,0,0,0,0,0,0,0,0,0,0,0,0,0,0,0,0,0,0,0,0,0,0,0,0,0,0,0,0,0,0,0,0,0,0,0,0,0,0,0,0,0,0,0,{"$f":"IF(EC6=\"U\",1,0)","v":0},0,0,0,0,0,0,0,0,0,0,0,0,0,0,0,0,0,0,0,0,0,0,0,0,0,0,0,0,0,0,0,0,0,0,0,0,0,0,0,0,0,0,0,0,0,0,0,0,0,0,0,0,0,0,0,0,0,0,0,0,0,0,0,{"$f":"IF(GO6=\"U\",1,0)","v":0},0,0,0,0,0,0,0,0,0,0,0,0,0,0,0,0,0,0,0,0,0,0,0,0,0,0,0,0,0,0,0,0,0,0,0,0,0,0,0,0,0,0,0,0,0,0,0,0,0,0,0,0,0,0,0,0,0,0,0,0,0,0,0,{"$f":"IF(JA6=\"U\",1,0)","v":0},0,0,0,0,0,0,0,0,0,0,0,0,0,0,0,0,0,0,0,0,0,0,0,0,0,0,0,0,0,0,0,0,0,0,0,0,0,0,0,0,0,0,0,0,0,0,0,0,0,0,0,0,0,0,0,0,0,0,0,0,0,0,0,{"$f":"IF(LM6=\"U\",1,0)","v":0},0,0,0,0,0,0,0,0,0,0,0,0,0,0,0,0,0,0,0,0,0,0,0,0,0,0,0,0,0,0,0,0,0,0,0,0,0,0,0,0,0,0,0,0,0,null,null,null,{"$f":"SUM(E654:AI654)","v":0},{"$f":"SUM(AJ654:BL654)","v":0},{"$f":"SUM(BM654:CQ654)","v":0},{"$f":"SUM(CR654:DU654)","v":0},{"$f":"SUM(DV654:EZ654)","v":0},{"$f":"SUM(FA654:GD654)","v":0},{"$f":"SUM(GE654:HI654)","v":0},{"$f":"SUM(HJ654:IN654)","v":0},{"$f":"SUM(IO654:JR654)","v":0},{"$f":"SUM(JS654:KW654)","v":0},{"$f":"SUM(KX654:MA654)","v":0},{"$f":"SUM(MB654:NF654)","v":0},{"$f":"SUM(NJ654:NU654)","v":0}]
[]
[]
[]
[]
[]
[]
[]
[]
[]
[]
[]
[]
[]
[]
[]
[]
[]
[]
[]
[]
[]
[]
[]
[]
[]
[]
[]
[]
[]
[]
[]
[]
[]
[]
[]
[]
[]
[]
[]
[]
[]
[]
[]
[]
[]
[]
[]
[]
[]
[]
[]
[]
[]
[]
[]
[]
[]
[]
[]
[]
[]
[]
[]
[]
[]
[]
[]
[]
[]
[]
[]
[]
[]
[]
[]
[]
[]
[]
[]
[]
[]
[]
[]
[]
[]
[]
[]
[]
[]
[]
[]
[]
[]
[]
[]
[]
[]
[]
[]
[]
[]
[]
[]
[]
[]
[]
[]
[]
[]
[]
[]
[]
[]
[]
[]
[]
[]
[]
[]
[]
[]
[]
[]
[]
[]
[]
[]
[]
[]
[]
[]
[]
[]
[]
[]
[]
[]
[]
[]
[]
[]
[]
[]
[]
[]
[]
[]
[]
[null,null,null,null,null,null,null,null,null,null,null,null,null,null,null,null,null,null,null,null,null,null,null,null,null,null,null,null,null,null,null,null,null,null,null,null,null,null,null,null,null,null,null,null,null,null,null,null,null,null,null,null,null,null,null,null,null,null,null,null,null,null,null,null,null,null,null,null,null,null,null,null,null,null,null,null,null,null,null,null,null,null,null,null,null,null,null,null,null,null,null,null,null,null,null,null,null,null,null,null,null,null,null,null,null,null,null,null,null,null,null,null,null,null,null,null,null,null,null,null,null,null,null,null,null,null,null,null,null,null,null,null,null,null,null,null,null,null,null,null,null,null,null,null,null,null,null,null,null,null,null,null,null,null,null,null,null,null,null,null,null,null,null,null,null,null,null,null,null,null,null,null,null,null,null,null,null,null,null,null,null,null,null,null,null,null,null,null,null,null,null,null,null,null,null,null,null,null,null,null,null,null,null,null,null,null,null,null,null,null,null,null,null,null,null,null,null,null,null,null,null,null,null,null,null,null,null,null,null,null,null,null,null,null,null,null,null,null,null,null,null,null,null,null,null,null,null,null,null,null,null,null,null,null,null,null,null,null,null,null,null,null,null,null,null,null,null,null,null,null,null,null,null,null,null,null,null,null,null,null,null,null,null,null,null,null,null,null,null,null,null,null,null,null,null,null,null,null,null,null,null,null,null,null,null,null,null,null,null,null,null,null,null,null,null,null,null,null,null,null,null,null,null,null,null,null,null,null,null,null,null,null,null,null,null,null,null,null,null,null,null,null,null,null,null,null,null,null,null,null,null,null,null,null,null,null,null,null,null,null,null,null,null,null,null,null,null,null,null,null,null,null,null,{"$f":"SUM(NJ653:NJ802)","v":0},{"$f":"SUM(NK653:NK802)","v":0},0,0,0,0,0,0,0,0,0,0,0]
[{"$f":"$A$5","v":"zzz"},{"$f":"$B$5","v":"zzz"},{"$f":"SUM(E804:NF804)","v":0},null,{"$f":"IF(E5=\"K\",1,IF(E5=\"KuK\",1,0))","v":0},0,0,0,0,0,0,0,0,0,0,0,0,0,0,0,0,0,0,0,0,0,0,0,0,0,0,0,0,0,0,0,0,0,0,0,0,0,0,0,0,0,0,0,0,0,0,0,0,0,0,0,0,0,0,0,0,0,0,0,0,0,0,0,{"$f":"IF(BQ5=\"K\",1,IF(BQ5=\"KuK\",1,0))","v":0},0,0,0,0,0,0,0,0,0,0,0,0,0,0,0,0,0,0,0,0,0,0,0,0,0,0,0,0,0,0,0,0,0,0,0,0,0,0,0,0,0,0,0,0,0,0,0,0,0,0,0,0,0,0,0,0,0,0,0,0,0,0,0,{"$f":"IF(EC5=\"K\",1,IF(EC5=\"KuK\",1,0))","v":0},0,0,0,0,0,0,0,0,0,0,0,0,0,0,0,0,0,0,0,0,0,0,0,0,0,0,0,0,0,0,0,0,0,0,0,0,0,0,0,0,0,0,0,0,0,0,0,0,0,0,0,0,0,0,0,0,0,0,0,0,0,0,0,{"$f":"IF(GO5=\"K\",1,IF(GO5=\"KuK\",1,0))","v":0},0,0,0,0,0,0,0,0,0,0,0,0,0,0,0,0,0,0,0,0,0,0,0,0,0,0,0,0,0,0,0,0,0,0,0,0,0,0,0,0,0,0,0,0,0,0,0,0,0,0,0,0,0,0,0,0,0,0,0,0,0,0,0,{"$f":"IF(JA5=\"K\",1,IF(JA5=\"KuK\",1,0))","v":0},0,0,0,0,0,0,0,0,0,0,0,0,0,0,0,0,0,0,0,0,0,0,0,0,0,0,0,0,0,0,0,0,0,0,0,0,0,0,0,0,0,0,0,0,0,0,0,0,0,0,0,0,0,0,0,0,0,0,0,0,0,0,0,{"$f":"IF(LM5=\"K\",1,IF(LM5=\"KuK\",1,0))","v":0},0,0,0,0,0,0,0,0,0,0,0,0,0,0,0,0,0,0,0,0,0,0,0,0,0,0,0,0,0,0,0,0,0,0,0,0,0,0,0,0,0,0,0,0,0,null,null,null,{"$f":"SUM(E804:AI804)","v":0},{"$f":"SUM(AJ804:BL804)","v":0},{"$f":"SUM(BM804:CQ804)","v":0},{"$f":"SUM(CR804:DU804)","v":0},{"$f":"SUM(DV804:EZ804)","v":0},{"$f":"SUM(FA804:GD804)","v":0},{"$f":"SUM(GE804:HI804)","v":0},{"$f":"SUM(HJ804:IN804)","v":0},{"$f":"SUM(IO804:JR804)","v":0},{"$f":"SUM(JS804:KW804)","v":0},{"$f":"SUM(KX804:MA804)","v":0},{"$f":"SUM(MB804:NF804)","v":0},{"$f":"SUM(NJ804:NU804)","v":0}]
[{"$f":"$A$6","v":"zzz"},{"$f":"$B$6","v":"zzz"},{"$f":"SUM(E805:NF805)","v":0},null,{"$f":"IF(E6=\"K\",1,IF(E6=\"KuK\",1,0))","v":0},0,0,0,0,0,0,0,0,0,0,0,0,0,0,0,0,0,0,0,0,0,0,0,0,0,0,0,0,0,0,0,0,0,0,0,0,0,0,0,0,0,0,0,0,0,0,0,0,0,0,0,0,0,0,0,0,0,0,0,0,0,0,0,{"$f":"IF(BQ6=\"K\",1,IF(BQ6=\"KuK\",1,0))","v":0},0,0,0,0,0,0,0,0,0,0,0,0,0,0,0,0,0,0,0,0,0,0,0,0,0,0,0,0,0,0,0,0,0,0,0,0,0,0,0,0,0,0,0,0,0,0,0,0,0,0,0,0,0,0,0,0,0,0,0,0,0,0,0,{"$f":"IF(EC6=\"K\",1,IF(EC6=\"KuK\",1,0))","v":0},0,0,0,0,0,0,0,0,0,0,0,0,0,0,0,0,0,0,0,0,0,0,0,0,0,0,0,0,0,0,0,0,0,0,0,0,0,0,0,0,0,0,0,0,0,0,0,0,0,0,0,0,0,0,0,0,0,0,0,0,0,0,0,{"$f":"IF(GO6=\"K\",1,IF(GO6=\"KuK\",1,0))","v":0},0,0,0,0,0,0,0,0,0,0,0,0,0,0,0,0,0,0,0,0,0,0,0,0,0,0,0,0,0,0,0,0,0,0,0,0,0,0,0,0,0,0,0,0,0,0,0,0,0,0,0,0,0,0,0,0,0,0,0,0,0,0,0,{"$f":"IF(JA6=\"K\",1,IF(JA6=\"KuK\",1,0))","v":0},0,0,0,0,0,0,0,0,0,0,0,0,0,0,0,0,0,0,0,0,0,0,0,0,0,0,0,0,0,0,0,0,0,0,0,0,0,0,0,0,0,0,0,0,0,0,0,0,0,0,0,0,0,0,0,0,0,0,0,0,0,0,0,{"$f":"IF(LM6=\"K\",1,IF(LM6=\"KuK\",1,0))","v":0},0,0,0,0,0,0,0,0,0,0,0,0,0,0,0,0,0,0,0,0,0,0,0,0,0,0,0,0,0,0,0,0,0,0,0,0,0,0,0,0,0,0,0,0,0,null,null,null,{"$f":"SUM(E805:AI805)","v":0},{"$f":"SUM(AJ805:BL805)","v":0},{"$f":"SUM(BM805:CQ805)","v":0},{"$f":"SUM(CR805:DU805)","v":0},{"$f":"SUM(DV805:EZ805)","v":0},{"$f":"SUM(FA805:GD805)","v":0},{"$f":"SUM(GE805:HI805)","v":0},{"$f":"SUM(HJ805:IN805)","v":0},{"$f":"SUM(IO805:JR805)","v":0},{"$f":"SUM(JS805:KW805)","v":0},{"$f":"SUM(KX805:MA805)","v":0},{"$f":"SUM(MB805:NF805)","v":0},{"$f":"SUM(NJ805:NU805)","v":0}]
[]
[]
[]
[]
[]
[]
[]
[]
[]
[]
[]
[]
[]
[]
[]
[]
[]
[]
[]
[]
[]
[]
[]
[]
[]
[]
[]
[]
[]
[]
[]
[]
[]
[]
[]
[]
[]
[]
[]
[]
[]
[]
[]
[]
[]
[]
[]
[]
[]
[]
[]
[]
[]
[]
[]
[]
[]
[]
[]
[]
[]
[]
[]
[]
[]
[]
[]
[]
[]
[]
[]
[]
[]
[]
[]
[]
[]
[]
[]
[]
[]
[]
[]
[]
[]
[]
[]
[]
[]
[]
[]
[]
[]
[]
[]
[]
[]
[]
[]
[]
[]
[]
[]
[]
[]
[]
[]
[]
[]
[]
[]
[]
[]
[]
[]
[]
[]
[]
[]
[]
[]
[]
[]
[]
[]
[]
[]
[]
[]
[]
[]
[]
[]
[]
[]
[]
[]
[]
[]
[]
[]
[]
[]
[]
[]
[]
[]
[]
[null,null,null,null,null,null,null,null,null,null,null,null,null,null,null,null,null,null,null,null,null,null,null,null,null,null,null,null,null,null,null,null,null,null,null,null,null,null,null,null,null,null,null,null,null,null,null,null,null,null,null,null,null,null,null,null,null,null,null,null,null,null,null,null,null,null,null,null,null,null,null,null,null,null,null,null,null,null,null,null,null,null,null,null,null,null,null,null,null,null,null,null,null,null,null,null,null,null,null,null,null,null,null,null,null,null,null,null,null,null,null,null,null,null,null,null,null,null,null,null,null,null,null,null,null,null,null,null,null,null,null,null,null,null,null,null,null,null,null,null,null,null,null,null,null,null,null,null,null,null,null,null,null,null,null,null,null,null,null,null,null,null,null,null,null,null,null,null,null,null,null,null,null,null,null,null,null,null,null,null,null,null,null,null,null,null,null,null,null,null,null,null,null,null,null,null,null,null,null,null,null,null,null,null,null,null,null,null,null,null,null,null,null,null,null,null,null,null,null,null,null,null,null,null,null,null,null,null,null,null,null,null,null,null,null,null,null,null,null,null,null,null,null,null,null,null,null,null,null,null,null,null,null,null,null,null,null,null,null,null,null,null,null,null,null,null,null,null,null,null,null,null,null,null,null,null,null,null,null,null,null,null,null,null,null,null,null,null,null,null,null,null,null,null,null,null,null,null,null,null,null,null,null,null,null,null,null,null,null,null,null,null,null,null,null,null,null,null,null,null,null,null,null,null,null,null,null,null,null,null,null,null,null,null,null,null,null,null,null,null,null,null,null,null,null,null,null,null,null,null,null,null,null,null,null,null,null,null,null,null,null,null,null,null,null,null,null,null,null,null,null,null,null,{"$f":"SUM(NJ804:NJ953)","v":0},{"$f":"SUM(NK804:NK953)","v":0},0,0,0,0,0,0,0,0,0,0,0]
[{"$f":"$A$5","v":"zzz"},{"$f":"$B$5","v":"zzz"},{"$f":"SUM(E955:NF955)","v":0},null,{"$f":"IF(E5=\"AK\",1,0)","v":0},0,0,0,0,0,0,0,0,0,0,0,0,0,0,0,0,0,0,0,0,0,0,0,0,0,0,0,0,0,0,0,0,0,0,0,0,0,0,0,0,0,0,0,0,0,0,0,0,0,0,0,0,0,0,0,0,0,0,0,0,0,0,0,{"$f":"IF(BQ5=\"AK\",1,0)","v":0},0,0,0,0,0,0,0,0,0,0,0,0,0,0,0,0,0,0,0,0,0,0,0,0,0,0,0,0,0,0,0,0,0,0,0,0,0,0,0,0,0,0,0,0,0,0,0,0,0,0,0,0,0,0,0,0,0,0,0,0,0,0,0,{"$f":"IF(EC5=\"AK\",1,0)","v":0},0,0,0,0,0,0,0,0,0,0,0,0,0,0,0,0,0,0,0,0,0,0,0,0,0,0,0,0,0,0,0,0,0,0,0,0,0,0,0,0,0,0,0,0,0,0,0,0,0,0,0,0,0,0,0,0,0,0,0,0,0,0,0,{"$f":"IF(GO5=\"AK\",1,0)","v":0},0,0,0,0,0,0,0,0,0,0,0,0,0,0,0,0,0,0,0,0,0,0,0,0,0,0,0,0,0,0,0,0,0,0,0,0,0,0,0,0,0,0,0,0,0,0,0,0,0,0,0,0,0,0,0,0,0,0,0,0,0,0,0,{"$f":"IF(JA5=\"AK\",1,0)","v":0},0,0,0,0,0,0,0,0,0,0,0,0,0,0,0,0,0,0,0,0,0,0,0,0,0,0,0,0,0,0,0,0,0,0,0,0,0,0,0,0,0,0,0,0,0,0,0,0,0,0,0,0,0,0,0,0,0,0,0,0,0,0,0,{"$f":"IF(LM5=\"AK\",1,0)","v":0},0,0,0,0,0,0,0,0,0,0,0,0,0,0,0,0,0,0,0,0,0,0,0,0,0,0,0,0,0,0,0,0,0,0,0,0,0,0,0,0,0,0,0,0,0,null,null,null,{"$f":"SUM(E955:AI955)","v":0},{"$f":"SUM(AJ955:BL955)","v":0},{"$f":"SUM(BM955:CQ955)","v":0},{"$f":"SUM(CR955:DU955)","v":0},{"$f":"SUM(DV955:EZ955)","v":0},{"$f":"SUM(FA955:GD955)","v":0},{"$f":"SUM(GE955:HI955)","v":0},{"$f":"SUM(HJ955:IN955)","v":0},{"$f":"SUM(IO955:JR955)","v":0},{"$f":"SUM(JS955:KW955)","v":0},{"$f":"SUM(KX955:MA955)","v":0},{"$f":"SUM(MB955:NF955)","v":0},{"$f":"SUM(NJ955:NU955)","v":0}]
[{"$f":"$A$6","v":"zzz"},{"$f":"$B$6","v":"zzz"},{"$f":"SUM(E956:NF956)","v":0},null,{"$f":"IF(E6=\"AK\",1,0)","v":0},0,0,0,0,0,0,0,0,0,0,0,0,0,0,0,0,0,0,0,0,0,0,0,0,0,0,0,0,0,0,0,0,0,0,0,0,0,0,0,0,0,0,0,0,0,0,0,0,0,0,0,0,0,0,0,0,0,0,0,0,0,0,0,{"$f":"IF(BQ6=\"AK\",1,0)","v":0},0,0,0,0,0,0,0,0,0,0,0,0,0,0,0,0,0,0,0,0,0,0,0,0,0,0,0,0,0,0,0,0,0,0,0,0,0,0,0,0,0,0,0,0,0,0,0,0,0,0,0,0,0,0,0,0,0,0,0,0,0,0,0,{"$f":"IF(EC6=\"AK\",1,0)","v":0},0,0,0,0,0,0,0,0,0,0,0,0,0,0,0,0,0,0,0,0,0,0,0,0,0,0,0,0,0,0,0,0,0,0,0,0,0,0,0,0,0,0,0,0,0,0,0,0,0,0,0,0,0,0,0,0,0,0,0,0,0,0,0,{"$f":"IF(GO6=\"AK\",1,0)","v":0},0,0,0,0,0,0,0,0,0,0,0,0,0,0,0,0,0,0,0,0,0,0,0,0,0,0,0,0,0,0,0,0,0,0,0,0,0,0,0,0,0,0,0,0,0,0,0,0,0,0,0,0,0,0,0,0,0,0,0,0,0,0,0,{"$f":"IF(JA6=\"AK\",1,0)","v":0},0,0,0,0,0,0,0,0,0,0,0,0,0,0,0,0,0,0,0,0,0,0,0,0,0,0,0,0,0,0,0,0,0,0,0,0,0,0,0,0,0,0,0,0,0,0,0,0,0,0,0,0,0,0,0,0,0,0,0,0,0,0,0,{"$f":"IF(LM6=\"AK\",1,0)","v":0},0,0,0,0,0,0,0,0,0,0,0,0,0,0,0,0,0,0,0,0,0,0,0,0,0,0,0,0,0,0,0,0,0,0,0,0,0,0,0,0,0,0,0,0,0,null,null,null,{"$f":"SUM(E956:AI956)","v":0},{"$f":"SUM(AJ956:BL956)","v":0},{"$f":"SUM(BM956:CQ956)","v":0},{"$f":"SUM(CR956:DU956)","v":0},{"$f":"SUM(DV956:EZ956)","v":0},{"$f":"SUM(FA956:GD956)","v":0},{"$f":"SUM(GE956:HI956)","v":0},{"$f":"SUM(HJ956:IN956)","v":0},{"$f":"SUM(IO956:JR956)","v":0},{"$f":"SUM(JS956:KW956)","v":0},{"$f":"SUM(KX956:MA956)","v":0},{"$f":"SUM(MB956:NF956)","v":0},{"$f":"SUM(NJ956:NU956)","v":0}]
[]
[]
[]
[]
[]
[]
[]
[]
[]
[]
[]
[]
[]
[]
[]
[]
[]
[]
[]
[]
[]
[]
[]
[]
[]
[]
[]
[]
[]
[]
[]
[]
[]
[]
[]
[]
[]
[]
[]
[]
[]
[]
[]
[]
[]
[]
[]
[]
[]
[]
[]
[]
[]
[]
[]
[]
[]
[]
[]
[]
[]
[]
[]
[]
[]
[]
[]
[]
[]
[]
[]
[]
[]
[]
[]
[]
[]
[]
[]
[]
[]
[]
[]
[]
[]
[]
[]
[]
[]
[]
[]
[]
[]
[]
[]
[]
[]
[]
[]
[]
[]
[]
[]
[]
[]
[]
[]
[]
[]
[]
[]
[]
[]
[]
[]
[]
[]
[]
[]
[]
[]
[]
[]
[]
[]
[]
[]
[]
[]
[]
[]
[]
[]
[]
[]
[]
[]
[]
[]
[]
[]
[]
[]
[]
[]
[]
[]
[]
[null,null,null,null,null,null,null,null,null,null,null,null,null,null,null,null,null,null,null,null,null,null,null,null,null,null,null,null,null,null,null,null,null,null,null,null,null,null,null,null,null,null,null,null,null,null,null,null,null,null,null,null,null,null,null,null,null,null,null,null,null,null,null,null,null,null,null,null,null,null,null,null,null,null,null,null,null,null,null,null,null,null,null,null,null,null,null,null,null,null,null,null,null,null,null,null,null,null,null,null,null,null,null,null,null,null,null,null,null,null,null,null,null,null,null,null,null,null,null,null,null,null,null,null,null,null,null,null,null,null,null,null,null,null,null,null,null,null,null,null,null,null,null,null,null,null,null,null,null,null,null,null,null,null,null,null,null,null,null,null,null,null,null,null,null,null,null,null,null,null,null,null,null,null,null,null,null,null,null,null,null,null,null,null,null,null,null,null,null,null,null,null,null,null,null,null,null,null,null,null,null,null,null,null,null,null,null,null,null,null,null,null,null,null,null,null,null,null,null,null,null,null,null,null,null,null,null,null,null,null,null,null,null,null,null,null,null,null,null,null,null,null,null,null,null,null,null,null,null,null,null,null,null,null,null,null,null,null,null,null,null,null,null,null,null,null,null,null,null,null,null,null,null,null,null,null,null,null,null,null,null,null,null,null,null,null,null,null,null,null,null,null,null,null,null,null,null,null,null,null,null,null,null,null,null,null,null,null,null,null,null,null,null,null,null,null,null,null,null,null,null,null,null,null,null,null,null,null,null,null,null,null,null,null,null,null,null,null,null,null,null,null,null,null,null,null,null,null,null,null,null,null,null,null,null,null,null,null,null,null,null,null,null,null,null,null,null,null,null,null,null,null,null,{"$f":"SUM(NJ955:NJ1104)","v":0},{"$f":"SUM(NK955:NK1104)","v":0},0,0,0,0,0,0,0,0,0,0,0]
[{"$f":"$A$5","v":"zzz"},{"$f":"$B$5","v":"zzz"},{"$f":"SUM(E1106:NF1106)","v":0},null,{"$f":"IF(E5=\"KA\",1,0)","v":0},0,0,0,0,0,0,0,0,0,0,0,0,0,0,0,0,0,0,0,0,0,0,0,0,0,0,0,0,0,0,0,0,0,0,0,0,0,0,0,0,0,0,0,0,0,0,0,0,0,0,0,0,0,0,0,0,0,0,0,0,0,0,0,{"$f":"IF(BQ5=\"KA\",1,0)","v":0},0,0,0,0,0,0,0,0,0,0,0,0,0,0,0,0,0,0,0,0,0,0,0,0,0,0,0,0,0,0,0,0,0,0,0,0,0,0,0,0,0,0,0,0,0,0,0,0,0,0,0,0,0,0,0,0,0,0,0,0,0,0,0,{"$f":"IF(EC5=\"KA\",1,0)","v":0},0,0,0,0,0,0,0,0,0,0,0,0,0,0,0,0,0,0,0,0,0,0,0,0,0,0,0,0,0,0,0,0,0,0,0,0,0,0,0,0,0,0,0,0,0,0,0,0,0,0,0,0,0,0,0,0,0,0,0,0,0,0,0,{"$f":"IF(GO5=\"KA\",1,0)","v":0},0,0,0,0,0,0,0,0,0,0,0,0,0,0,0,0,0,0,0,0,0,0,0,0,0,0,0,0,0,0,0,0,0,0,0,0,0,0,0,0,0,0,0,0,0,0,0,0,0,0,0,0,0,0,0,0,0,0,0,0,0,0,0,{"$f":"IF(JA5=\"KA\",1,0)","v":0},0,0,0,0,0,0,0,0,0,0,0,0,0,0,0,0,0,0,0,0,0,0,0,0,0,0,0,0,0,0,0,0,0,0,0,0,0,0,0,0,0,0,0,0,0,0,0,0,0,0,0,0,0,0,0,0,0,0,0,0,0,0,0,{"$f":"IF(LM5=\"KA\",1,0)","v":0},0,0,0,0,0,0,0,0,0,0,0,0,0,0,0,0,0,0,0,0,0,0,0,0,0,0,0,0,0,0,0,0,0,0,0,0,0,0,0,0,0,0,0,0,0,null,null,null,{"$f":"SUM(E1106:AI1106)","v":0},{"$f":"SUM(AJ1106:BL1106)","v":0},{"$f":"SUM(BM1106:CQ1106)","v":0},{"$f":"SUM(CR1106:DU1106)","v":0},{"$f":"SUM(DV1106:EZ1106)","v":0},{"$f":"SUM(FA1106:GD1106)","v":0},{"$f":"SUM(GE1106:HI1106)","v":0},{"$f":"SUM(HJ1106:IN1106)","v":0},{"$f":"SUM(IO1106:JR1106)","v":0},{"$f":"SUM(JS1106:KW1106)","v":0},{"$f":"SUM(KX1106:MA1106)","v":0},{"$f":"SUM(MB1106:NF1106)","v":0},{"$f":"SUM(NJ1106:NU1106)","v":0}]
[{"$f":"$A$6","v":"zzz"},{"$f":"$B$6","v":"zzz"},{"$f":"SUM(E1107:NF1107)","v":0},null,{"$f":"IF(E6=\"KA\",1,0)","v":0},0,0,0,0,0,0,0,0,0,0,0,0,0,0,0,0,0,0,0,0,0,0,0,0,0,0,0,0,0,0,0,0,0,0,0,0,0,0,0,0,0,0,0,0,0,0,0,0,0,0,0,0,0,0,0,0,0,0,0,0,0,0,0,{"$f":"IF(BQ6=\"KA\",1,0)","v":0},0,0,0,0,0,0,0,0,0,0,0,0,0,0,0,0,0,0,0,0,0,0,0,0,0,0,0,0,0,0,0,0,0,0,0,0,0,0,0,0,0,0,0,0,0,0,0,0,0,0,0,0,0,0,0,0,0,0,0,0,0,0,0,{"$f":"IF(EC6=\"KA\",1,0)","v":0},0,0,0,0,0,0,0,0,0,0,0,0,0,0,0,0,0,0,0,0,0,0,0,0,0,0,0,0,0,0,0,0,0,0,0,0,0,0,0,0,0,0,0,0,0,0,0,0,0,0,0,0,0,0,0,0,0,0,0,0,0,0,0,{"$f":"IF(GO6=\"KA\",1,0)","v":0},0,0,0,0,0,0,0,0,0,0,0,0,0,0,0,0,0,0,0,0,0,0,0,0,0,0,0,0,0,0,0,0,0,0,0,0,0,0,0,0,0,0,0,0,0,0,0,0,0,0,0,0,0,0,0,0,0,0,0,0,0,0,0,{"$f":"IF(JA6=\"KA\",1,0)","v":0},0,0,0,0,0,0,0,0,0,0,0,0,0,0,0,0,0,0,0,0,0,0,0,0,0,0,0,0,0,0,0,0,0,0,0,0,0,0,0,0,0,0,0,0,0,0,0,0,0,0,0,0,0,0,0,0,0,0,0,0,0,0,0,{"$f":"IF(LM6=\"KA\",1,0)","v":0},0,0,0,0,0,0,0,0,0,0,0,0,0,0,0,0,0,0,0,0,0,0,0,0,0,0,0,0,0,0,0,0,0,0,0,0,0,0,0,0,0,0,0,0,0,null,null,null,{"$f":"SUM(E1107:AI1107)","v":0},{"$f":"SUM(AJ1107:BL1107)","v":0},{"$f":"SUM(BM1107:CQ1107)","v":0},{"$f":"SUM(CR1107:DU1107)","v":0},{"$f":"SUM(DV1107:EZ1107)","v":0},{"$f":"SUM(FA1107:GD1107)","v":0},{"$f":"SUM(GE1107:HI1107)","v":0},{"$f":"SUM(HJ1107:IN1107)","v":0},{"$f":"SUM(IO1107:JR1107)","v":0},{"$f":"SUM(JS1107:KW1107)","v":0},{"$f":"SUM(KX1107:MA1107)","v":0},{"$f":"SUM(MB1107:NF1107)","v":0},{"$f":"SUM(NJ1107:NU1107)","v":0}]
[]
[]
[]
[]
[]
[]
[]
[]
[]
[]
[]
[]
[]
[]
[]
[]
[]
[]
[]
[]
[]
[]
[]
[]
[]
[]
[]
[]
[]
[]
[]
[]
[]
[]
[]
[]
[]
[]
[]
[]
[]
[]
[]
[]
[]
[]
[]
[]
[]
[]
[]
[]
[]
[]
[]
[]
[]
[]
[]
[]
[]
[]
[]
[]
[]
[]
[]
[]
[]
[]
[]
[]
[]
[]
[]
[]
[]
[]
[]
[]
[]
[]
[]
[]
[]
[]
[]
[]
[]
[]
[]
[]
[]
[]
[]
[]
[]
[]
[]
[]
[]
[]
[]
[]
[]
[]
[]
[]
[]
[]
[]
[]
[]
[]
[]
[]
[]
[]
[]
[]
[]
[]
[]
[]
[]
[]
[]
[]
[]
[]
[]
[]
[]
[]
[]
[]
[]
[]
[]
[]
[]
[]
[]
[]
[]
[]
[]
[]
[null,null,null,null,null,null,null,null,null,null,null,null,null,null,null,null,null,null,null,null,null,null,null,null,null,null,null,null,null,null,null,null,null,null,null,null,null,null,null,null,null,null,null,null,null,null,null,null,null,null,null,null,null,null,null,null,null,null,null,null,null,null,null,null,null,null,null,null,null,null,null,null,null,null,null,null,null,null,null,null,null,null,null,null,null,null,null,null,null,null,null,null,null,null,null,null,null,null,null,null,null,null,null,null,null,null,null,null,null,null,null,null,null,null,null,null,null,null,null,null,null,null,null,null,null,null,null,null,null,null,null,null,null,null,null,null,null,null,null,null,null,null,null,null,null,null,null,null,null,null,null,null,null,null,null,null,null,null,null,null,null,null,null,null,null,null,null,null,null,null,null,null,null,null,null,null,null,null,null,null,null,null,null,null,null,null,null,null,null,null,null,null,null,null,null,null,null,null,null,null,null,null,null,null,null,null,null,null,null,null,null,null,null,null,null,null,null,null,null,null,null,null,null,null,null,null,null,null,null,null,null,null,null,null,null,null,null,null,null,null,null,null,null,null,null,null,null,null,null,null,null,null,null,null,null,null,null,null,null,null,null,null,null,null,null,null,null,null,null,null,null,null,null,null,null,null,null,null,null,null,null,null,null,null,null,null,null,null,null,null,null,null,null,null,null,null,null,null,null,null,null,null,null,null,null,null,null,null,null,null,null,null,null,null,null,null,null,null,null,null,null,null,null,null,null,null,null,null,null,null,null,null,null,null,null,null,null,null,null,null,null,null,null,null,null,null,null,null,null,null,null,null,null,null,null,null,null,null,null,null,null,null,null,null,null,null,null,null,null,null,null,null,null,{"$f":"SUM(NJ1106:NJ1255)","v":0},{"$f":"SUM(NK1106:NK1255)","v":0},0,0,0,0,0,0,0,0,0,0,0]
[{"$f":"$A$5","v":"zzz"},{"$f":"$B$5","v":"zzz"},{"$f":"SUM(E1257:NF1257)","v":0},null,{"$f":"IF(E5=\"LS\",1,0)","v":0},0,0,0,0,0,0,0,0,0,0,0,0,0,0,0,0,0,0,0,0,0,0,0,0,0,0,0,0,0,0,0,0,0,0,0,0,0,0,0,0,0,0,0,0,0,0,0,0,0,0,0,0,0,0,0,0,0,0,0,0,0,0,0,{"$f":"IF(BQ5=\"LS\",1,0)","v":0},0,0,0,0,0,0,0,0,0,0,0,0,0,0,0,0,0,0,0,0,0,0,0,0,0,0,0,0,0,0,0,0,0,0,0,0,0,0,0,0,0,0,0,0,0,0,0,0,0,0,0,0,0,0,0,0,0,0,0,0,0,0,0,{"$f":"IF(EC5=\"LS\",1,0)","v":0},0,0,0,0,0,0,0,0,0,0,0,0,0,0,0,0,0,0,0,0,0,0,0,0,0,0,0,0,0,0,0,0,0,0,0,0,0,0,0,0,0,0,0,0,0,0,0,0,0,0,0,0,0,0,0,0,0,0,0,0,0,0,0,{"$f":"IF(GO5=\"LS\",1,0)","v":0},0,0,0,0,0,0,0,0,0,0,0,0,0,0,0,0,0,0,0,0,0,0,0,0,0,0,0,0,0,0,0,0,0,0,0,0,0,0,0,0,0,0,0,0,0,0,0,0,0,0,0,0,0,0,0,0,0,0,0,0,0,0,0,{"$f":"IF(JA5=\"LS\",1,0)","v":0},0,0,0,0,0,0,0,0,0,0,0,0,0,0,0,0,0,0,0,0,0,0,0,0,0,0,0,0,0,0,0,0,0,0,0,0,0,0,0,0,0,0,0,0,0,0,0,0,0,0,0,0,0,0,0,0,0,0,0,0,0,0,0,{"$f":"IF(LM5=\"LS\",1,0)","v":0},0,0,0,0,0,0,0,0,0,0,0,0,0,0,0,0,0,0,0,0,0,0,0,0,0,0,0,0,0,0,0,0,0,0,0,0,0,0,0,0,0,0,0,0,0,null,null,null,{"$f":"SUM(E1257:AI1257)","v":0},{"$f":"SUM(AJ1257:BL1257)","v":0},{"$f":"SUM(BM1257:CQ1257)","v":0},{"$f":"SUM(CR1257:DU1257)","v":0},{"$f":"SUM(DV1257:EZ1257)","v":0},{"$f":"SUM(FA1257:GD1257)","v":0},{"$f":"SUM(GE1257:HI1257)","v":0},{"$f":"SUM(HJ1257:IN1257)","v":0},{"$f":"SUM(IO1257:JR1257)","v":0},{"$f":"SUM(JS1257:KW1257)","v":0},{"$f":"SUM(KX1257:MA1257)","v":0},{"$f":"SUM(MB1257:NF1257)","v":0},{"$f":"SUM(NJ1257:NU1257)","v":0}]
[{"$f":"$A$6","v":"zzz"},{"$f":"$B$6","v":"zzz"},{"$f":"SUM(E1258:NF1258)","v":0},null,{"$f":"IF(E6=\"LS\",1,0)","v":0},0,0,0,0,0,0,0,0,0,0,0,0,0,0,0,0,0,0,0,0,0,0,0,0,0,0,0,0,0,0,0,0,0,0,0,0,0,0,0,0,0,0,0,0,0,0,0,0,0,0,0,0,0,0,0,0,0,0,0,0,0,0,0,{"$f":"IF(BQ6=\"LS\",1,0)","v":0},0,0,0,0,0,0,0,0,0,0,0,0,0,0,0,0,0,0,0,0,0,0,0,0,0,0,0,0,0,0,0,0,0,0,0,0,0,0,0,0,0,0,0,0,0,0,0,0,0,0,0,0,0,0,0,0,0,0,0,0,0,0,0,{"$f":"IF(EC6=\"LS\",1,0)","v":0},0,0,0,0,0,0,0,0,0,0,0,0,0,0,0,0,0,0,0,0,0,0,0,0,0,0,0,0,0,0,0,0,0,0,0,0,0,0,0,0,0,0,0,0,0,0,0,0,0,0,0,0,0,0,0,0,0,0,0,0,0,0,0,{"$f":"IF(GO6=\"LS\",1,0)","v":0},0,0,0,0,0,0,0,0,0,0,0,0,0,0,0,0,0,0,0,0,0,0,0,0,0,0,0,0,0,0,0,0,0,0,0,0,0,0,0,0,0,0,0,0,0,0,0,0,0,0,0,0,0,0,0,0,0,0,0,0,0,0,0,{"$f":"IF(JA6=\"LS\",1,0)","v":0},0,0,0,0,0,0,0,0,0,0,0,0,0,0,0,0,0,0,0,0,0,0,0,0,0,0,0,0,0,0,0,0,0,0,0,0,0,0,0,0,0,0,0,0,0,0,0,0,0,0,0,0,0,0,0,0,0,0,0,0,0,0,0,{"$f":"IF(LM6=\"LS\",1,0)","v":0},0,0,0,0,0,0,0,0,0,0,0,0,0,0,0,0,0,0,0,0,0,0,0,0,0,0,0,0,0,0,0,0,0,0,0,0,0,0,0,0,0,0,0,0,0,null,null,null,{"$f":"SUM(E1258:AI1258)","v":0},{"$f":"SUM(AJ1258:BL1258)","v":0},{"$f":"SUM(BM1258:CQ1258)","v":0},{"$f":"SUM(CR1258:DU1258)","v":0},{"$f":"SUM(DV1258:EZ1258)","v":0},{"$f":"SUM(FA1258:GD1258)","v":0},{"$f":"SUM(GE1258:HI1258)","v":0},{"$f":"SUM(HJ1258:IN1258)","v":0},{"$f":"SUM(IO1258:JR1258)","v":0},{"$f":"SUM(JS1258:KW1258)","v":0},{"$f":"SUM(KX1258:MA1258)","v":0},{"$f":"SUM(MB1258:NF1258)","v":0},{"$f":"SUM(NJ1258:NU1258)","v":0}]
[]
[]
[]
[]
[]
[]
[]
[]
[]
[]
[]
[]
[]
[]
[]
[]
[]
[]
[]
[]
[]
[]
[]
[]
[]
[]
[]
[]
[]
[]
[]
[]
[]
[]
[]
[]
[]
[]
[]
[]
[]
[]
[]
[]
[]
[]
[]
[]
[]
[]
[]
[]
[]
[]
[]
[]
[]
[]
[]
[]
[]
[]
[]
[]
[]
[]
[]
[]
[]
[]
[]
[]
[]
[]
[]
[]
[]
[]
[]
[]
[]
[]
[]
[]
[]
[]
[]
[]
[]
[]
[]
[]
[]
[]
[]
[]
[]
[]
[]
[]
[]
[]
[]
[]
[]
[]
[]
[]
[]
[]
[]
[]
[]
[]
[]
[]
[]
[]
[]
[]
[]
[]
[]
[]
[]
[]
[]
[]
[]
[]
[]
[]
[]
[]
[]
[]
[]
[]
[]
[]
[]
[]
[]
[]
[]
[]
[]
[]
[null,null,null,null,null,null,null,null,null,null,null,null,null,null,null,null,null,null,null,null,null,null,null,null,null,null,null,null,null,null,null,null,null,null,null,null,null,null,null,null,null,null,null,null,null,null,null,null,null,null,null,null,null,null,null,null,null,null,null,null,null,null,null,null,null,null,null,null,null,null,null,null,null,null,null,null,null,null,null,null,null,null,null,null,null,null,null,null,null,null,null,null,null,null,null,null,null,null,null,null,null,null,null,null,null,null,null,null,null,null,null,null,null,null,null,null,null,null,null,null,null,null,null,null,null,null,null,null,null,null,null,null,null,null,null,null,null,null,null,null,null,null,null,null,null,null,null,null,null,null,null,null,null,null,null,null,null,null,null,null,null,null,null,null,null,null,null,null,null,null,null,null,null,null,null,null,null,null,null,null,null,null,null,null,null,null,null,null,null,null,null,null,null,null,null,null,null,null,null,null,null,null,null,null,null,null,null,null,null,null,null,null,null,null,null,null,null,null,null,null,null,null,null,null,null,null,null,null,null,null,null,null,null,null,null,null,null,null,null,null,null,null,null,null,null,null,null,null,null,null,null,null,null,null,null,null,null,null,null,null,null,null,null,null,null,null,null,null,null,null,null,null,null,null,null,null,null,null,null,null,null,null,null,null,null,null,null,null,null,null,null,null,null,null,null,null,null,null,null,null,null,null,null,null,null,null,null,null,null,null,null,null,null,null,null,null,null,null,null,null,null,null,null,null,null,null,null,null,null,null,null,null,null,null,null,null,null,null,null,null,null,null,null,null,null,null,null,null,null,null,null,null,null,null,null,null,null,null,null,null,null,null,null,null,null,null,null,null,null,null,null,null,null,{"$f":"SUM(NJ1257:NJ1406)","v":0},{"$f":"SUM(NK1257:NK1406)","v":0},0,0,0,0,0,0,0,0,0,0,0]
[{"$f":"$A$5","v":"zzz"},{"$f":"$B$5","v":"zzz"},{"$f":"SUM(E1408:NF1408)","v":0},null,{"$f":"IF(E5=\"WB\",1,0)","v":0},0,0,0,0,0,0,0,0,0,0,0,0,0,0,0,0,0,0,0,0,0,0,0,0,0,0,0,0,0,0,0,0,0,0,0,0,0,0,0,0,0,0,0,0,0,0,0,0,0,0,0,0,0,0,0,0,0,0,0,0,0,0,0,{"$f":"IF(BQ5=\"WB\",1,0)","v":0},0,0,0,0,0,0,0,0,0,0,0,0,0,0,0,0,0,0,0,0,0,0,0,0,0,0,0,0,0,0,0,0,0,0,0,0,0,0,0,0,0,0,0,0,0,0,0,0,0,0,0,0,0,0,0,0,0,0,0,0,0,0,0,{"$f":"IF(EC5=\"WB\",1,0)","v":0},0,0,0,0,0,0,0,0,0,0,0,0,0,0,0,0,0,0,0,0,0,0,0,0,0,0,0,0,0,0,0,0,0,0,0,0,0,0,0,0,0,0,0,0,0,0,0,0,0,0,0,0,0,0,0,0,0,0,0,0,0,0,0,{"$f":"IF(GO5=\"WB\",1,0)","v":0},0,0,0,0,0,0,0,0,0,0,0,0,0,0,0,0,0,0,0,0,0,0,0,0,0,0,0,0,0,0,0,0,0,0,0,0,0,0,0,0,0,0,0,0,0,0,0,0,0,0,0,0,0,0,0,0,0,0,0,0,0,0,0,{"$f":"IF(JA5=\"WB\",1,0)","v":0},0,0,0,0,0,0,0,0,0,0,0,0,0,0,0,0,0,0,0,0,0,0,0,0,0,0,0,0,0,0,0,0,0,0,0,0,0,0,0,0,0,0,0,0,0,0,0,0,0,0,0,0,0,0,0,0,0,0,0,0,0,0,0,{"$f":"IF(LM5=\"WB\",1,0)","v":0},0,0,0,0,0,0,0,0,0,0,0,0,0,0,0,0,0,0,0,0,0,0,0,0,0,0,0,0,0,0,0,0,0,0,0,0,0,0,0,0,0,0,0,0,0,null,null,null,{"$f":"SUM(E1408:AI1408)","v":0},{"$f":"SUM(AJ1408:BL1408)","v":0},{"$f":"SUM(BM1408:CQ1408)","v":0},{"$f":"SUM(CR1408:DU1408)","v":0},{"$f":"SUM(DV1408:EZ1408)","v":0},{"$f":"SUM(FA1408:GD1408)","v":0},{"$f":"SUM(GE1408:HI1408)","v":0},{"$f":"SUM(HJ1408:IN1408)","v":0},{"$f":"SUM(IO1408:JR1408)","v":0},{"$f":"SUM(JS1408:KW1408)","v":0},{"$f":"SUM(KX1408:MA1408)","v":0},{"$f":"SUM(MB1408:NF1408)","v":0},{"$f":"SUM(NJ1408:NU1408)","v":0}]
[{"$f":"$A$6","v":"zzz"},{"$f":"$B$6","v":"zzz"},{"$f":"SUM(E1409:NF1409)","v":0},null,{"$f":"IF(E6=\"WB\",1,0)","v":0},0,0,0,0,0,0,0,0,0,0,0,0,0,0,0,0,0,0,0,0,0,0,0,0,0,0,0,0,0,0,0,0,0,0,0,0,0,0,0,0,0,0,0,0,0,0,0,0,0,0,0,0,0,0,0,0,0,0,0,0,0,0,0,{"$f":"IF(BQ6=\"WB\",1,0)","v":0},0,0,0,0,0,0,0,0,0,0,0,0,0,0,0,0,0,0,0,0,0,0,0,0,0,0,0,0,0,0,0,0,0,0,0,0,0,0,0,0,0,0,0,0,0,0,0,0,0,0,0,0,0,0,0,0,0,0,0,0,0,0,0,{"$f":"IF(EC6=\"WB\",1,0)","v":0},0,0,0,0,0,0,0,0,0,0,0,0,0,0,0,0,0,0,0,0,0,0,0,0,0,0,0,0,0,0,0,0,0,0,0,0,0,0,0,0,0,0,0,0,0,0,0,0,0,0,0,0,0,0,0,0,0,0,0,0,0,0,0,{"$f":"IF(GO6=\"WB\",1,0)","v":0},0,0,0,0,0,0,0,0,0,0,0,0,0,0,0,0,0,0,0,0,0,0,0,0,0,0,0,0,0,0,0,0,0,0,0,0,0,0,0,0,0,0,0,0,0,0,0,0,0,0,0,0,0,0,0,0,0,0,0,0,0,0,0,{"$f":"IF(JA6=\"WB\",1,0)","v":0},0,0,0,0,0,0,0,0,0,0,0,0,0,0,0,0,0,0,0,0,0,0,0,0,0,0,0,0,0,0,0,0,0,0,0,0,0,0,0,0,0,0,0,0,0,0,0,0,0,0,0,0,0,0,0,0,0,0,0,0,0,0,0,{"$f":"IF(LM6=\"WB\",1,0)","v":0},0,0,0,0,0,0,0,0,0,0,0,0,0,0,0,0,0,0,0,0,0,0,0,0,0,0,0,0,0,0,0,0,0,0,0,0,0,0,0,0,0,0,0,0,0,null,null,null,{"$f":"SUM(E1409:AI1409)","v":0},{"$f":"SUM(AJ1409:BL1409)","v":0},{"$f":"SUM(BM1409:CQ1409)","v":0},{"$f":"SUM(CR1409:DU1409)","v":0},{"$f":"SUM(DV1409:EZ1409)","v":0},{"$f":"SUM(FA1409:GD1409)","v":0},{"$f":"SUM(GE1409:HI1409)","v":0},{"$f":"SUM(HJ1409:IN1409)","v":0},{"$f":"SUM(IO1409:JR1409)","v":0},{"$f":"SUM(JS1409:KW1409)","v":0},{"$f":"SUM(KX1409:MA1409)","v":0},{"$f":"SUM(MB1409:NF1409)","v":0},{"$f":"SUM(NJ1409:NU1409)","v":0}]
[]
[]
[]
[]
[]
[]
[]
[]
[]
[]
[]
[]
[]
[]
[]
[]
[]
[]
[]
[]
[]
[]
[]
[]
[]
[]
[]
[]
[]
[]
[]
[]
[]
[]
[]
[]
[]
[]
[]
[]
[]
[]
[]
[]
[]
[]
[]
[]
[]
[]
[]
[]
[]
[]
[]
[]
[]
[]
[]
[]
[]
[]
[]
[]
[]
[]
[]
[]
[]
[]
[]
[]
[]
[]
[]
[]
[]
[]
[]
[]
[]
[]
[]
[]
[]
[]
[]
[]
[]
[]
[]
[]
[]
[]
[]
[]
[]
[]
[]
[]
[]
[]
[]
[]
[]
[]
[]
[]
[]
[]
[]
[]
[]
[]
[]
[]
[]
[]
[]
[]
[]
[]
[]
[]
[]
[]
[]
[]
[]
[]
[]
[]
[]
[]
[]
[]
[]
[]
[]
[]
[]
[]
[]
[]
[]
[]
[]
[]
[null,null,null,null,null,null,null,null,null,null,null,null,null,null,null,null,null,null,null,null,null,null,null,null,null,null,null,null,null,null,null,null,null,null,null,null,null,null,null,null,null,null,null,null,null,null,null,null,null,null,null,null,null,null,null,null,null,null,null,null,null,null,null,null,null,null,null,null,null,null,null,null,null,null,null,null,null,null,null,null,null,null,null,null,null,null,null,null,null,null,null,null,null,null,null,null,null,null,null,null,null,null,null,null,null,null,null,null,null,null,null,null,null,null,null,null,null,null,null,null,null,null,null,null,null,null,null,null,null,null,null,null,null,null,null,null,null,null,null,null,null,null,null,null,null,null,null,null,null,null,null,null,null,null,null,null,null,null,null,null,null,null,null,null,null,null,null,null,null,null,null,null,null,null,null,null,null,null,null,null,null,null,null,null,null,null,null,null,null,null,null,null,null,null,null,null,null,null,null,null,null,null,null,null,null,null,null,null,null,null,null,null,null,null,null,null,null,null,null,null,null,null,null,null,null,null,null,null,null,null,null,null,null,null,null,null,null,null,null,null,null,null,null,null,null,null,null,null,null,null,null,null,null,null,null,null,null,null,null,null,null,null,null,null,null,null,null,null,null,null,null,null,null,null,null,null,null,null,null,null,null,null,null,null,null,null,null,null,null,null,null,null,null,null,null,null,null,null,null,null,null,null,null,null,null,null,null,null,null,null,null,null,null,null,null,null,null,null,null,null,null,null,null,null,null,null,null,null,null,null,null,null,null,null,null,null,null,null,null,null,null,null,null,null,null,null,null,null,null,null,null,null,null,null,null,null,null,null,null,null,null,null,null,null,null,null,null,null,null,null,null,null,null,{"$f":"SUM(NJ1408:NJ1557)","v":0},{"$f":"SUM(NK1408:NK1557)","v":0},0,0,0,0,0,0,0,0,0,0,0]

{"sheet":"Auswertung","index":3,"n_rows":157,"n_cols":120,"rows_kept":157,"cut":false,"hidden":false,"merged":[[156,93,156,101],[156,102,156,110],[156,111,156,119],[156,48,156,56],[156,57,156,65],[156,66,156,74],[156,75,156,83],[156,84,156,92],[2,93,2,101],[2,102,2,110],[1,0,1,2],[2,111,2,119],[2,3,2,11],[2,12,2,20],[2,21,2,29],[2,30,2,38],[2,39,2,47],[2,48,2,56],[2,57,2,65],[2,66,2,74],[2,75,2,83],[156,0,156,2],[155,0,155,2],[2,0,2,1],[0,0,0,1],[2,84,2,92],[156,3,156,11],[156,12,156,20],[156,21,156,29],[156,30,156,38],[156,39,156,47]]}
[{"$f":"Dateneingabe!A4","v":"2014-01-01"}]
["Prozentueller Anteil zur Gesamteingabe",null,null,{"$f":"IF($D$157=0,0,D156/$D$157)","v":0},{"$f":"IF($D$157=0,0,E156/$D$157)","v":0},0,0,0,0,0,0,0,{"$f":"IF($M$157=0,0,M156/$M$157)","v":0},0,0,0,0,0,0,0,0,{"$f":"IF($V$157=0,0,V156/$V$157)","v":0},0,0,0,0,0,0,0,0,{"$f":"IF($AE$157=0,0,AE156/$AE$157)","v":0},0,0,0,0,0,0,0,0,{"$f":"IF($AN$157=0,0,AN156/$AN$157)","v":0},0,0,0,0,0,0,0,0,{"$f":"IF($AW$157=0,0,AW156/$AW$157)","v":0},0,0,0,0,0,0,0,0,{"$f":"IF($BF$157=0,0,BF156/$BF$157)","v":0},0,0,0,0,0,0,0,0,{"$f":"IF($BO$157=0,0,BO156/$BO$157)","v":0},0,0,0,0,0,0,0,0,{"$f":"IF($BX$157=0,0,BX156/$BX$157)","v":0},0,0,0,0,0,0,0,0,{"$f":"IF($CG$157=0,0,CG156/$CG$157)","v":0},0,0,0,0,0,0,0,0,{"$f":"IF($CP$157=0,0,CP156/$CP$157)","v":0},0,0,0,0,0,0,0,0,{"$f":"IF($CY$157=0,0,CY156/$CY$157)","v":0},0,0,0,0,0,0,0,0,{"$f":"IF($DH$157=0,0,DH156/$DH$157)","v":0},0,0,0,0,0,0,0,0]
["Mitarbeiter",null,{"$f":"NOW()","v":"2014-07-29T22:13:03.090"}]
["NR.","Name","Stamm Nr.","F","S","N","U","K","AK","KA","LS","WB","F","S","N","U","K","AK","KA","LS","WB","F","S","N","U","K","AK","KA","LS","WB","F","S","N","U","K","AK","KA","LS","WB","F","S","N","U","K","AK","KA","LS","WB","F","S","N","U","K","AK","KA","LS","WB","F","S","N","U","K","AK","KA","LS","WB","F","S","N","U","K","AK","KA","LS","WB","F","S","N","U","K","AK","KA","LS","WB","F","S","N","U","K","AK","KA","LS","WB","F","S","N","U","K","AK","KA","LS","WB","F","S","N","U","K","AK","KA","LS","WB","F","S","N","U","K","AK","KA","LS","WB"]
[1,{"$f":"Schichtplan!A5","v":"zzz"},{"$f":"Schichtplan!B5","v":"zzz"},{"$f":"Schichtplan!NJ200","v":0},{"$f":"Schichtplan!NJ351","v":0},{"$f":"Schichtplan!NJ502","v":0},{"$f":"Schichtplan!NJ653","v":0},{"$f":"Schichtplan!NJ804","v":0},{"$f":"Schichtplan!NJ955","v":0},{"$f":"Schichtplan!NJ1106","v":0},{"$f":"Schichtplan!NJ1257","v":0},{"$f":"Schichtplan!NJ1408","v":0},{"$f":"Schichtplan!NK200","v":0},{"$f":"Schichtplan!NK351","v":0},{"$f":"Schichtplan!NK502","v":0},{"$f":"Schichtplan!NK653","v":0},{"$f":"Schichtplan!NK804","v":0},{"$f":"Schichtplan!NK955","v":0},{"$f":"Schichtplan!NK1106","v":0},{"$f":"Schichtplan!NK1257","v":0},{"$f":"Schichtplan!NK1408","v":0},{"$f":"Schichtplan!NL200","v":0},{"$f":"Schichtplan!NL351","v":0},{"$f":"Schichtplan!NL502","v":0},{"$f":"Schichtplan!NL653","v":0},{"$f":"Schichtplan!NL804","v":0},{"$f":"Schichtplan!NL955","v":0},{"$f":"Schichtplan!NL1106","v":0},{"$f":"Schichtplan!NL1257","v":0},{"$f":"Schichtplan!NL1408","v":0},{"$f":"Schichtplan!NM200","v":0},{"$f":"Schichtplan!NM351","v":0},{"$f":"Schichtplan!NM502","v":0},{"$f":"Schichtplan!NM653","v":0},{"$f":"Schichtplan!NM804","v":0},{"$f":"Schichtplan!NM955","v":0},{"$f":"Schichtplan!NM1106","v":0},{"$f":"Schichtplan!NM1257","v":0},{"$f":"Schichtplan!NM1408","v":0},{"$f":"Schichtplan!NN200","v":0},{"$f":"Schichtplan!NN351","v":0},{"$f":"Schichtplan!NN502","v":0},{"$f":"Schichtplan!NN653","v":0},{"$f":"Schichtplan!NN804","v":0},{"$f":"Schichtplan!NN955","v":0},{"$f":"Schichtplan!NN1106","v":0},{"$f":"Schichtplan!NN1257","v":0},{"$f":"Schichtplan!NN1408","v":0},{"$f":"Schichtplan!NO200","v":0},{"$f":"Schichtplan!NO351","v":0},{"$f":"Schichtplan!NO502","v":0},{"$f":"Schichtplan!NO653","v":0},{"$f":"Schichtplan!NO804","v":0},{"$f":"Schichtplan!NO955","v":0},{"$f":"Schichtplan!NO1106","v":0},{"$f":"Schichtplan!NO1257","v":0},{"$f":"Schichtplan!NO1408","v":0},{"$f":"Schichtplan!NP200","v":0},{"$f":"Schichtplan!NP351","v":0},{"$f":"Schichtplan!NP502","v":0},{"$f":"Schichtplan!NP653","v":0},{"$f":"Schichtplan!NP804","v":0},{"$f":"Schichtplan!NP955","v":0},{"$f":"Schichtplan!NP1106","v":0},{"$f":"Schichtplan!NP1257","v":0},{"$f":"Schichtplan!NP1408","v":0},{"$f":"Schichtplan!NQ200","v":0},{"$f":"Schichtplan!NQ351","v":0},{"$f":"Schichtplan!NQ502","v":0},{"$f":"Schichtplan!NQ653","v":0},{"$f":"Schichtplan!NQ804","v":0},{"$f":"Schichtplan!NQ955","v":0},{"$f":"Schichtplan!NQ1106","v":0},{"$f":"Schichtplan!NQ1257","v":0},{"$f":"Schichtplan!NQ1408","v":0},{"$f":"Schichtplan!NR200","v":0},{"$f":"Schichtplan!NR351","v":0},{"$f":"Schichtplan!NR502","v":0},{"$f":"Schichtplan!NR653","v":0},{"$f":"Schichtplan!NR804","v":0},{"$f":"Schichtplan!NR955","v":0},{"$f":"Schichtplan!NR1106","v":0},{"$f":"Schichtplan!NR1257","v":0},{"$f":"Schichtplan!NR1408","v":0},{"$f":"Schichtplan!NS200","v":0},{"$f":"Schichtplan!NS351","v":0},{"$f":"Schichtplan!NS502","v":0},{"$f":"Schichtplan!NS653","v":0},{"$f":"Schichtplan!NS804","v":0},{"$f":"Schichtplan!NS955","v":0},{"$f":"Schichtplan!NS1106","v":0},{"$f":"Schichtplan!NS1257","v":0},{"$f":"Schichtplan!NS1408","v":0},{"$f":"Schichtplan!NT200","v":0},{"$f":"Schichtplan!NT351","v":0},{"$f":"Schichtplan!NT502","v":0},{"$f":"Schichtplan!NT653","v":0},{"$f":"Schichtplan!NT804","v":0},{"$f":"Schichtplan!NT955","v":0},{"$f":"Schichtplan!NT1106","v":0},{"$f":"Schichtplan!NT1257","v":0},{"$f":"Schichtplan!NT1408","v":0},{"$f":"Schichtplan!NU200","v":0},{"$f":"Schichtplan!NU351","v":0},{"$f":"Schichtplan!NU502","v":0},{"$f":"Schichtplan!NU653","v":0},{"$f":"Schichtplan!NU804","v":0},{"$f":"Schichtplan!NU955","v":0},{"$f":"Schichtplan!NU1106","v":0},{"$f":"Schichtplan!NU1257","v":0},{"$f":"Schichtplan!NU1408","v":0},{"$f":"Schichtplan!NV200","v":0},{"$f":"Schichtplan!NV351","v":0},{"$f":"Schichtplan!NV502","v":0},{"$f":"Schichtplan!NV653","v":0},{"$f":"Schichtplan!NV804","v":0},{"$f":"Schichtplan!NV955","v":0},{"$f":"Schichtplan!NV1106","v":0},{"$f":"Schichtplan!NV1257","v":0},{"$f":"Schichtplan!NV1408","v":0}]
[2,{"$f":"Schichtplan!A6","v":"zzz"},{"$f":"Schichtplan!B6","v":"zzz"},{"$f":"Schichtplan!NJ201","v":0},{"$f":"Schichtplan!NJ352","v":0},{"$f":"Schichtplan!NJ503","v":0},{"$f":"Schichtplan!NJ654","v":0},{"$f":"Schichtplan!NJ805","v":0},{"$f":"Schichtplan!NJ956","v":0},{"$f":"Schichtplan!NJ1107","v":0},{"$f":"Schichtplan!NJ1258","v":0},{"$f":"Schichtplan!NJ1409","v":0},{"$f":"Schichtplan!NK201","v":0},{"$f":"Schichtplan!NK352","v":0},{"$f":"Schichtplan!NK503","v":0},{"$f":"Schichtplan!NK654","v":0},{"$f":"Schichtplan!NK805","v":0},{"$f":"Schichtplan!NK956","v":0},{"$f":"Schichtplan!NK1107","v":0},{"$f":"Schichtplan!NK1258","v":0},{"$f":"Schichtplan!NK1409","v":0},{"$f":"Schichtplan!NL201","v":0},{"$f":"Schichtplan!NL352","v":0},{"$f":"Schichtplan!NL503","v":0},{"$f":"Schichtplan!NL654","v":0},{"$f":"Schichtplan!NL805","v":0},{"$f":"Schichtplan!NL956","v":0},{"$f":"Schichtplan!NL1107","v":0},{"$f":"Schichtplan!NL1258","v":0},{"$f":"Schichtplan!NL1409","v":0},{"$f":"Schichtplan!NM201","v":0},{"$f":"Schichtplan!NM352","v":0},{"$f":"Schichtplan!NM503","v":0},{"$f":"Schichtplan!NM654","v":0},{"$f":"Schichtplan!NM805","v":0},{"$f":"Schichtplan!NM956","v":0},{"$f":"Schichtplan!NM1107","v":0},{"$f":"Schichtplan!NM1258","v":0},{"$f":"Schichtplan!NM1409","v":0},{"$f":"Schichtplan!NN201","v":0},{"$f":"Schichtplan!NN352","v":0},{"$f":"Schichtplan!NN503","v":0},{"$f":"Schichtplan!NN654","v":0},{"$f":"Schichtplan!NN805","v":0},{"$f":"Schichtplan!NN956","v":0},{"$f":"Schichtplan!NN1107","v":0},{"$f":"Schichtplan!NN1258","v":0},{"$f":"Schichtplan!NN1409","v":0},{"$f":"Schichtplan!NO201","v":0},{"$f":"Schichtplan!NO352","v":0},{"$f":"Schichtplan!NO503","v":0},{"$f":"Schichtplan!NO654","v":0},{"$f":"Schichtplan!NO805","v":0},{"$f":"Schichtplan!NO956","v":0},{"$f":"Schichtplan!NO1107","v":0},{"$f":"Schichtplan!NO1258","v":0},{"$f":"Schichtplan!NO1409","v":0},{"$f":"Schichtplan!NP201","v":0},{"$f":"Schichtplan!NP352","v":0},{"$f":"Schichtplan!NP503","v":0},{"$f":"Schichtplan!NP654","v":0},{"$f":"Schichtplan!NP805","v":0},{"$f":"Schichtplan!NP956","v":0},{"$f":"Schichtplan!NP1107","v":0},{"$f":"Schichtplan!NP1258","v":0},{"$f":"Schichtplan!NP1409","v":0},{"$f":"Schichtplan!NQ201","v":0},{"$f":"Schichtplan!NQ352","v":0},{"$f":"Schichtplan!NQ503","v":0},{"$f":"Schichtplan!NQ654","v":0},{"$f":"Schichtplan!NQ805","v":0},{"$f":"Schichtplan!NQ956","v":0},{"$f":"Schichtplan!NQ1107","v":0},{"$f":"Schichtplan!NQ1258","v":0},{"$f":"Schichtplan!NQ1409","v":0},{"$f":"Schichtplan!NR201","v":0},{"$f":"Schichtplan!NR352","v":0},{"$f":"Schichtplan!NR503","v":0},{"$f":"Schichtplan!NR654","v":0},{"$f":"Schichtplan!NR805","v":0},{"$f":"Schichtplan!NR956","v":0},{"$f":"Schichtplan!NR1107","v":0},{"$f":"Schichtplan!NR1258","v":0},{"$f":"Schichtplan!NR1409","v":0},{"$f":"Schichtplan!NS201","v":0},{"$f":"Schichtplan!NS352","v":0},{"$f":"Schichtplan!NS503","v":0},{"$f":"Schichtplan!NS654","v":0},{"$f":"Schichtplan!NS805","v":0},{"$f":"Schichtplan!NS956","v":0},{"$f":"Schichtplan!NS1107","v":0},{"$f":"Schichtplan!NS1258","v":0},{"$f":"Schichtplan!NS1409","v":0},{"$f":"Schichtplan!NT201","v":0},{"$f":"Schichtplan!NT352","v":0},{"$f":"Schichtplan!NT503","v":0},{"$f":"Schichtplan!NT654","v":0},{"$f":"Schichtplan!NT805","v":0},{"$f":"Schichtplan!NT956","v":0},{"$f":"Schichtplan!NT1107","v":0},{"$f":"Schichtplan!NT1258","v":0},{"$f":"Schichtplan!NT1409","v":0},{"$f":"Schichtplan!NU201","v":0},{"$f":"Schichtplan!NU352","v":0},{"$f":"Schichtplan!NU503","v":0},{"$f":"Schichtplan!NU654","v":0},{"$f":"Schichtplan!NU805","v":0},{"$f":"Schichtplan!NU956","v":0},{"$f":"Schichtplan!NU1107","v":0},{"$f":"Schichtplan!NU1258","v":0},{"$f":"Schichtplan!NU1409","v":0},{"$f":"Schichtplan!NV201","v":0},{"$f":"Schichtplan!NV352","v":0},{"$f":"Schichtplan!NV503","v":0},{"$f":"Schichtplan!NV654","v":0},{"$f":"Schichtplan!NV805","v":0},{"$f":"Schichtplan!NV956","v":0},{"$f":"Schichtplan!NV1107","v":0},{"$f":"Schichtplan!NV1258","v":0},{"$f":"Schichtplan!NV1409","v":0}]
[3]
[4]
[5]
[6]
[7]
[8]
[9]
[10]
[11]
[12]
[13]
[14]
[15]
[16]
[17]
[18]
[19]
[20]
[21]
[22]
[23]
[24]
[25]
[26]
[27]
[28]
[29]
[30]
[31]
[32]
[33]
[34]
[35]
[36]
[37]
[38]
[39]
[40]
[41]
[42]
[43]
[44]
[45]
[46]
[47]
[48]
[49]
[50]
[51]
[52]
[53]
[54]
[55]
[56]
[57]
[58]
[59]
[60]
[61]
[62]
[63]
[64]
[65]
[66]
[67]
[68]
[69]
[70]
[71]
[72]
[73]
[74]
[75]
[76]
[77]
[78]
[79]
[80]
[81]
[82]
[83]
[84]
[85]
[86]
[87]
[88]
[89]
[90]
[91]
[92]
[93]
[94]
[95]
[96]
[97]
[98]
[99]
[100]
[101]
[102]
[103]
[104]
[105]
[106]
[107]
[108]
[109]
[110]
[111]
[112]
[113]
[114]
[115]
[116]
[117]
[118]
[119]
[120]
[121]
[122]
[123]
[124]
[125]
[126]
[127]
[128]
[129]
[130]
[131]
[132]
[133]
[134]
[135]
[136]
[137]
[138]
[139]
[140]
[141]
[142]
[143]
[144]
[145]
[146]
[147]
[148]
[149]
[150]
[]
["Gesamtwerte der einzelnen Kategorien",null,null,{"$f":"SUM(D5:D154)","v":0},{"$f":"SUM(E5:E154)","v":0},0,0,0,0,0,0,0,0,0,0,0,0,0,0,0,0,0,0,0,0,0,0,0,0,0,0,0,0,0,0,0,0,0,0,0,0,0,0,0,0,0,0,0,0,0,0,0,0,0,0,0,0,0,0,0,0,0,0,0,0,0,0,0,{"$f":"SUM(BQ5:BQ154)","v":0},0,0,0,0,0,0,0,0,0,0,0,0,0,0,0,0,0,0,0,0,0,0,0,0,0,0,0,0,0,0,0,0,0,0,0,0,0,0,0,0,0,0,{"$f":"SUM(DH5:DH154)","v":0},{"$f":"SUM(DI5:DI154)","v":0},0,0,0,0,0,0,0]
["Gesamtwert aller Kategorien",null,null,{"$f":"SUM(D156:L156)","v":0},null,null,null,null,null,null,null,null,{"$f":"SUM(M156:U156)","v":0},null,null,null,null,null,null,null,null,{"$f":"SUM(V156:AD156)","v":0},null,null,null,null,null,null,null,null,{"$f":"SUM(AE156:AM156)","v":0},null,null,null,null,null,null,null,null,{"$f":"SUM(AN156:AV156)","v":0},null,null,null,null,null,null,null,null,{"$f":"SUM(AW156:BE156)","v":0},null,null,null,null,null,null,null,null,{"$f":"SUM(BF156:BN156)","v":0},null,null,null,null,null,null,null,null,{"$f":"SUM(BO156:BW156)","v":0},null,null,null,null,null,null,null,null,{"$f":"SUM(BX156:CF156)","v":0},null,null,null,null,null,null,null,null,{"$f":"SUM(CG156:CO156)","v":0},null,null,null,null,null,null,null,null,{"$f":"SUM(CP156:CX156)","v":0},null,null,null,null,null,null,null,null,{"$f":"SUM(CY156:DG156)","v":0},null,null,null,null,null,null,null,null,{"$f":"SUM(DH156:DP156)","v":0}]

{"sheet":"Urlaub Eintragung MA","index":4,"n_rows":153,"n_cols":17,"rows_kept":153,"cut":false,"hidden":false,"merged":[[1,1,1,6],[1,7,1,16]]}
[null,"zzz"]
[null,"Eingabeliste für die Mitarbeiter:  Urlaubsplan ab",null,null,null,null,null,{"$f":"Dateneingabe!A4","v":"2014-01-01"}]
["NR.","Abt.","Name, Vorname","P.Nr.","Hinweis","Januar","Februar","März","April","Mai","Juni","Juli","August","September","Oktober","November","Dezember"]
[1,{"$f":"IF(Dateneingabe!D7=0,$B$1,Dateneingabe!D7)","v":"zzz"},{"$f":"IF(Dateneingabe!A7=0,$B$1,Dateneingabe!A7)","v":"zzz"},{"$f":"IF(Dateneingabe!B7=0,$B$1,Dateneingabe!B7)","v":"zzz"}]
[2,{"$f":"IF(Dateneingabe!D8=0,$B$1,Dateneingabe!D8)","v":"zzz"},{"$f":"IF(Dateneingabe!A8=0,$B$1,Dateneingabe!A8)","v":"zzz"},{"$f":"IF(Dateneingabe!B8=0,$B$1,Dateneingabe!B8)","v":"zzz"}]
[3]
[4]
[5]
[6]
[7]
[8]
[9]
[10]
[11]
[12]
[13]
[14]
[15]
[16]
[17]
[18]
[19]
[20]
[21]
[22]
[23]
[24]
[25]
[26]
[27]
[28]
[29]
[30]
[31]
[32]
[33]
[34]
[35]
[36]
[37]
[38]
[39]
[40]
[41]
[42]
[43]
[44]
[45]
[46]
[47]
[48]
[49]
[50]
[51]
[52]
[53]
[54]
[55]
[56]
[57]
[58]
[59]
[60]
[61]
[62]
[63]
[64]
[65]
[66]
[67]
[68]
[69]
[70]
[71]
[72]
[73]
[74]
[75]
[76]
[77]
[78]
[79]
[80]
[81]
[82]
[83]
[84]
[85]
[86]
[87]
[88]
[89]
[90]
[91]
[92]
[93]
[94]
[95]
[96]
[97]
[98]
[99]
[100]
[101]
[102]
[103]
[104]
[105]
[106]
[107]
[108]
[109]
[110]
[111]
[112]
[113]
[114]
[115]
[116]
[117]
[118]
[119]
[120]
[121]
[122]
[123]
[124]
[125]
[126]
[127]
[128]
[129]
[130]
[131]
[132]
[133]
[134]
[135]
[136]
[137]
[138]
[139]
[140]
[141]
[142]
[143]
[144]
[145]
[146]
[147]
[148]
[149]
[150]

{"sheet":"Werte","index":5,"n_rows":11,"n_cols":4,"rows_kept":11,"cut":false,"hidden":false,"merged":[]}
["F","F1","F2","F3"]
["S","S2","S3"]
["N"]
["U"]
["K","KuK"]
["AK"]
["KA"]
["LS"]
["WB"]
["FT"]
["Daten sind ausgeblendet !"]